##TITLE=G17-51-SE $$ Begin of the data block
##JCAMP-DX=5.00 $$ ACD/SpecManager v 10.08
##SPECTROMETER/DATA SYSTEM=Alpha
##DATE=23 Oct 2013 10:11:40
##DATA TYPE=INFRARED SPECTRUM
##DATA CLASS=XYDATA
##ORIGIN=
##OWNER=
##NPOINTS=1765
##FIRSTX=399.75695801
##LASTX=3997.56933594
##MAXX=3997.56933594
##MINX=399.75695801
##MAXY=0.76035261
##MINY=0.16057087
##XFACTOR=1.0000000000
##YFACTOR=1.000000000000000e-9
##FIRSTY=0.41125569
##DELTAX=2.03957629
##XUNITS=1/CM
##YUNITS=ARBITRARY UNITS
##XYDATA=(X++(Y..Y))
399.8D11255687l519743j968205j230389q37594k42025O97762R74297L33131m09097
418.1D05053824r97960j542628k278537k407908j498908r80139j409828j663745r69767
436.5C91304404J33961P51078J129091J755446J685858L61174p83205o56396l60966
454.8C95320445j503467k902448k484888j817435k286077k990246k749294j847624
471.1C76738966j761884k451360k242506j049846m50343q70198j223326r22382q42690
489.5C64924431j720756k490700k194643j828313k323687l111034l064126k432019
505.8C45759153k532333l102630k956838k367496k361149k697467k379984j469761
522.1C25891495p19071m33653j79798M12822R12607J199603J860708K796709L140718
$$ plain form
399.8 411255687 407735944 405767739 404537350 403699756 403457731 404155493 405129790 405462921 405053824
418.1 405053824 404055864 402513236 400234699 397826791 396327883 395347744 393937916 392274171 391304404
436.5 391304404 391438365 392189443 393318534 395073980 396759838 397121012 396337807 395681411 395320445
454.8 395320445 393816978 390914530 388429642 386612207 384326130 381335884 378586590 376738966
471.1 376738966 374977082 372525722 370283216 369233370 368783027 367912829 366689503 365767121 364924431
489.5 364924431 363203675 360712975 358518332 356690019 354366332 351255298 348191172 345759153
505.8 345759153 343226820 340124190 337167352 334799856 332438707 329741240 327361256 325891495
522.1 325891495 325172424 324738771 324558973 324971795 325884402 327084005 328944713 331741422 334882140
540.5C34882140K425641J210242M98981K41011l23474j112223j392215j237721j415729
558.8C33776653j875222k118319k220929k517849k712756k057732o48558N57393J141429
577.2C21324110J682103K550929L207803L096640K503574J951605J482487Q81225L12805
595.6C38993281O0797O8784J16467N8323j5259J07736L57359L14981J39266L11137
616C40512872Q96513J617789K025664K213955K508998K727419K543748K155214J919687
634.3C59121859J759589J465291J163929J128853J260221J068473N43117K15828K55794
652.7C67982954K93433J02908K026K97666O46740M93467J19925N48184J343458J415521
673.1C73246282J263410J304656J683742J761198J188934O89626P96586Q80957K61813
$$ plain form
540.5 334882140 337307781 338518023 339017004 339258015 338934541 337822318 336430103 335192382 333776653
558.8 333776653 331901431 329783112 327562183 325044334 322331578 320273846 319625288 320182681 321324110
577.2 321324110 323006213 325557142 328764945 331861585 334365159 336316764 337799251 338680476 338993281
595.6 338993281 339054078 339122862 339239329 339297652 339282393 339390129 339747488 340062469 340201735 340512872
616 340512872 341409385 343027174 345052838 347266793 349775791 352503210 355046958 357202172 359121859
634.3 359121859 360881448 362346739 363510668 364639521 365899742 366968215 367511332 367727160 367982954
652.7 367982954 368276387 368379295 368381321 368678987 369325727 369819194 369939119 370487303 371830761 373246282
673.1 373246282 374509692 375814348 377498090 379259288 380448222 381137848 381934434 382815391 383077204
691.4C83077204o42627j014143q50469n82159j44035P34687J750052K305478K341896
709.8C86975884K552838L310412L903568L849417L928095M726231N381524N072773
726.1D19700742M243672L906130L948600L363162K249420J605391J566172J248955
742.4D41832244L98159j86055j8538J35512m38780j173884j234173r03666r51559j095950
762.8D36363310l25293J378030K848953L691792M605115N783438O334544N776912M968911
781.2D71425712M655540M342586L373414K383292K249896K648920K687544K478391
797.5D96245295K896309L885418M260898L572702K973974K990544K604305J425743
813.8E20855188N48661N56827N25176m29570j654625k153218k206862k523720k992034
$$ plain form
691.4 383077204 382434577 381420434 380569965 379987806 379843771 380578458 382328510 384633988 386975884
709.8 386975884 389528722 392839134 396742702 400592119 404520214 409246445 414627969 419700742
726.1 419700742 423944414 427850544 431799144 435162306 437411726 439017117 440583289 441832244
742.4 441832244 442230403 442044348 442025810 442161322 441722542 440548658 439314485 438410819 437459260 436363310
762.8 436363310 436038017 437416047 440265000 443956792 448561907 454345345 460679889 466456801 471425712
781.2 471425712 476081252 480423838 483797252 486180544 488430440 491079360 493766904 496245295
797.5 496245295 499141604 503027022 507287920 510860622 513834596 516825140 519429445 520855188
813.8 520855188 521403849 521960676 522485852 522056282 520401657 518248439 516041577 513517857 510525823
832.1E10525823k965749k544760k536416l083617l255278k556085j844257j779736
848.5D89959925j732409j109689n24134o19918o30587Q35002L595560N834520O730497
866.8E02338767P168889P518053O869078M867792K506435N64396j324296l469288n161405
885.2E21878421n703449n630970n787969n973965n665004n197048n305558n976618
901.5D76637840o597131o964326p373154p961005q331031q051813p312983o392628
917.8D17653769n138874l512203k017558j221418j005918p60913k67923P7277J9580
936.2D03825819j54286k11328n66215k037555m651457p300854r129881j0233194j0890096
954.5C58650953j1094392j0961741j0827214j0826885j0757894j0417282r874493r222835
$$ plain form
832.1 510525823 507560074 505015314 502478898 499395281 496140003 493583918 491739661 489959925
848.5 489959925 488227516 487117827 486593693 485973775 485343188 486178190 489773750 495608270 502338767
866.8 502338767 509507656 517025709 523894787 528762579 531269014 531833410 530509114 527039826 521878421
885.2 521878421 516174972 510544002 504756033 498782068 493117064 487920016 482614458 476637840
901.5 476637840 470040709 463076383 455703229 447742224 439411193 431359380 424046397 417653769
917.8 417653769 412514895 409002692 406985134 405763716 404757798 403996885 403728962 403806239 403825819
936.2 403825819 403671533 403460205 402893990 400856435 396204978 388904124 379774243 369541049 358650953
954.5 358650953 347556561 336594820 325767606 314940721 304182827 293765545 283891052 274668217
970.8B74668217q337260p087171n632400m280046l138229k147570j327932q01906o30230
989.2B41285473o54831o24791m45113j90645N6788L18259N13017L84152j34051p71209
1009.6B39737049j195923j375019j503006j573577j508564j445204j555503j768395
1025.9B27811858j819923j674965j597211j730263j909122j970768j949400j917705
1042.2B13242501j826793j571685j183316p97242m08441J16170P30946J214698J521737
1060.6B11038575J883924K299740K262250J293227k66462j339555j255915l24070Q30114
1078.9B16421828J964762K998710L730670M049778M139587M200608M094228L637686
1095.2B45237857K954811K326399J810759J338065J103729J361728J920044K328485
$$ plain form
970.8 274668217 266330957 259243786 253611386 249331340 246193111 244045541 242717609 241915703 241285473
989.2 241285473 240630642 240005851 239560738 239370093 239426881 239745140 240258157 240642309 240508258 239737049
1009.6 239737049 238541126 237166107 235663101 234089524 232580960 231135756 229580253 227811858
1025.9 227811858 225991935 224316970 222719759 220989496 219080374 217109606 215160206 213242501
1042.2 213242501 211415708 209844023 208660707 207863465 207455024 207571194 208302140 209516838 211038575
1060.6 211038575 212922499 215222239 217484489 218777716 218511254 217171699 215915784 215591714 216421828
1078.9 216421828 218386590 221385300 225115970 229165748 233305335 237505943 241600171 245237857
1095.2 245237857 248192668 250519067 252329826 253667891 254771620 256133348 258053392 260381877
1111.6B60381877K441138K406270K332747K142131J745999J362592J359254J789928
1127.9B75961936K340167K657593K655506K336323J589179N58466k69503o47515p99030
1146.2B86383122r38117r24677n75066k5779N09710J082092J889557K822429L452986
1164.6B93676257L728181M077822M718602N423009N951405O366581O832599P168412
1180.9C37942868P044077O584108O153256N652070M702121L378511K141326J204491
1197.2C74802828M01318l47674p97391p75933n35876l68207k43694m9233J11162m470
1217.6C72192830l89099p40022r59277j298308j783371k069026j995683j797348j616717
1236C59543979j307666p27832M112O09607J082629J622408K195597K524525K540737
$$ plain form
1111.6 260381877 262823015 265229285 267562032 269704163 271450162 272812754 274172008 275961936
1127.9 275961936 278302103 280959696 283615202 285951525 287540704 288099170 287829667 287182152 286383122
1146.2 286383122 285445005 284520328 283945262 283919483 284429193 285511285 287400842 290223271 293676257
1164.6 293676257 297404438 301482260 306200862 311623871 317575276 323941857 330774456 337942868
1180.9 337942868 344986945 351571053 357724309 363376379 368078500 371457011 373598337 374802828
1197.2 374802828 375204146 374856472 374059081 373283148 372747272 372379065 372135371 372086138 372197300 372192830
1217.6 372192830 371803731 371063709 370104432 368806124 367022753 364953727 362958044 361160696 359543979
1236 359543979 358236313 357508481 357512593 358122200 359204829 360827237 363022834 365547359 368088096
1254.3C68088096K500564K564490K555639K349913K210766K342790K530009K431512
1270.6C87573779K029091J608044J333564J092166R13292R79871J186162J236677J016080
1289C98968726O80715L28601j62840q61734j521409j870871j980781k118498k267510
1307.4C89194399k126962j680493j176715p12514j97947L16799N47498K36273n17130
1325.7C83883208j370072k056510k507627k691149k455622j922995j455963j134187
1342C68289083p94857n37783n90891r74536j418144j685589j858205k040207k353430
1360.4C56035441k954453l587455l869652l829241l319323k843827l046155l521115
1376.7C29064220l887653m165411m097134l443778k478689j438885n54473j51902j78903
$$ plain form
1254.3 368088096 370588660 373153150 375708789 378058702 380269468 382612258 385142267 387573779
1270.6 387573779 389602870 391210914 392544478 393636644 394549936 395529807 396715969 397952646 398968726
1289 398968726 399649441 399978042 399815202 398953468 397432059 395561188 393580407 391461909 389194399
1307.4 389194399 387067437 385386944 384210229 383497715 383299768 383616567 384164065 384400338 383883208
1325.7 383883208 382513136 380456626 377948999 375257850 372802228 370879233 369423270 368289083
1342 368289083 367494226 366956443 366365552 365391016 363972872 362287283 360429078 358388871 356035441
1360.4 356035441 353080988 349493533 345623881 341794640 338475317 335631490 332585335 329064220
1376.7 329064220 325176567 321011156 316914022 313470244 310991555 309552670 308998197 308846295 308667392
1395.1C08667392j66357O2734M64678R59873J367867J614421J780689J862556J879215
1413.4C18493068K052278K455353K769798K577395K459406K433181K117068J472980
1429.7C36830527O16192N0694m25577q43942n14686O7025M10646N28306L58939R5368
1450.1C37173492J06781O53834J756131K593577K604246K812773L232062L512770M319340
1468.5C58765006O368965Q971184R247989P545620O001055M470766K766013R97156
1484.8D05133754o52939k619773m661143n309880n718708o978780p412285o758421
1501.1C65021825o126613p390707j1038810j0695339q728772q055747o826192m981488
1517.4C01178157l173202k724349l026665l107994l301621k933204k506703k561987
$$ plain form
1395.1 308667392 308501035 308563769 309028447 309988320 311356187 312970608 314751297 316613853 318493068
1413.4 318493068 320545346 323000699 325770497 328347892 330807298 333240479 335357547 336830527
1429.7 336830527 337446719 337497413 337071836 336227894 335713208 335780233 336190879 336719185 337078124 337173492
1450.1 337173492 337280273 337934107 339690238 342283815 344888061 347700834 350932896 354445666 358765006
1468.5 358765006 365133971 374105155 383353144 390898764 396899819 401370585 404136598 405133754
1484.8 405133754 404480815 401861042 397199899 391890019 386171311 379192531 371780246 365021825
1501.1 365021825 358895212 351504505 340465695 329770356 321041584 312985837 306159645 301178157
1517.4 301178157 298004955 295280606 292253941 289145947 285844326 282911122 280404419 277842432
1533.7B77842432k027601j192927j172871j102298k30402O90639J655609K621799L404051
1552.1B80488431M035324M519552N539626N698472L963769L619373L863185L807873
1568.4C15535605L466248K729744K502561K347469J526207R84162P23809M73082J40876
1586.8C30429763l24309r46224j577377k280712k999515l726005m589022n449563o146997
1605.1C02390039o866843p825672q419097q378476r208798j1024922j0077268r285867
1621.4B31303096j0634557j0605543r670869r106487p810578o882742o959691n116612
1637.8A64516017k541110j147971k56061M52488R60529J232967J741573K369538K393663
1656.1A69721633K702415L618866M689068N341113N349680O082282P042572O760016
$$ plain form
1533.7 277842432 275814831 274621904 273449033 272346735 272116333 272806972 274462581 277084380 280488431
1552.1 280488431 284523755 289043307 294582933 300281405 304245174 307864547 311727732 315535605
1568.4 315535605 319001853 321731597 324234158 326581627 328107834 329091996 329815805 330288887 330429763
1586.8 330429763 330105454 329159230 327581853 325301141 322301626 318575621 313986599 308537036 302390039
1605.1 302390039 295523196 287697524 279278427 270899951 261691153 250666231 240588963 231303096
1621.4 231303096 220668539 210062996 200392127 191285640 183475062 176592320 169632629 164516017
1637.8 164516017 161974907 160826936 160570875 161023363 161983892 163216859 164958432 167327970 169721633
1656.1 169721633 172424048 176042914 180731982 186073095 191422775 197505057 204547629 211307645
1672.4B11307645P095992P771388P515311P508964Q730754J0966241J0478765R683311
1688.8B81058371J1018485J2046486J4793068J7296493J7573238J9049138J6106963
1703C88942242J3721704J3543129J1736691J0219872R315580Q694858Q302360O932497
1719.3D71408933N480409N027175M768103M407585M258543M042685L944248L553510
1735.7E06891191L291786L738165M147887M613876N494118O424129P203996P509411
1752E49314559P274925P473767P540524P106364P067561O650388O138742N968928N722583
1770.3F10258341N513608M816115L979922L807842L891588L704011L302634L007173
1786.7F42281234L065706L200650K894997K358735K378941K636611K521575K112329
$$ plain form
1672.4 211307645 218403637 226175025 233690336 241199300 249930054 260896295 271375060 281058371
1688.8 281058371 292076856 304123342 318916410 336212903 353786141 372835279 388942242
1703 388942242 402663946 416207075 427943766 438163638 447479218 456174076 464476436 471408933
1719.3 471408933 476889342 481916517 486684620 491092205 495350748 499393433 503337681 506891191
1735.7 506891191 510182977 513921142 518069029 522682905 528177023 534601152 541805148 549314559
1752 549314559 556589484 564063251 571603775 578710139 585777700 592428088 598566830 604535758 610258341
1770.3 610258341 615771949 620588064 624567986 628375828 632267416 635971427 639274061 642281234
1786.7 642281234 645346940 648547590 651442587 653801322 656180263 658816874 661338449 663450778
1803F63450778J991510K213180K260625J976073J757145J941860K083242J845956J633584
1821.3F81153953J810074J979768J773060J466512J343489J493156J482010J219988
1837.6F93722010J226723J552403J533747R90212P59363J019895J212716J029849Q38280
1856G03885198R83238J171231J006425P72774Q99195J086593Q34882M81248N60999
1874.4G11681783R05693J036048P88927O35981Q71480J123011R37521N43654O24478
1892.7G19148576R46880Q35657M69267M69685P75516Q30769N15163L27826N50151P46131
1913.1G25615621N82754L37005M30226O58334N01513J76251K66671N91159N87702K45452
1933.5G29992688R5069M03106O38366L67105L7253K11477N08726M08411J55091K40505
$$ plain form
1803 663450778 665442288 667655468 669916093 671892166 673649311 675591171 677674413 679520369 681153953
1821.3 681153953 682964027 684943795 686716855 688183367 689526856 691020012 692502022 693722010
1837.6 693722010 694948733 696501136 698034883 699025095 699784458 700804353 702017069 703046918 703885198
1856 703885198 704868436 706039667 707046092 707818866 708718061 709804654 710639536 711120784 711681783
1874.4 711681783 712587476 713623524 714412451 715048432 715919912 717042923 717980444 718524098 719148576
1892.7 719148576 720095456 720931113 721400380 721870065 722645581 723476350 723991513 724319339 724869490 725615621
1913.1 725615621 726198375 726535380 726965606 727623940 728125453 728301704 728568375 729159534 729747236 729992688
1933.5 729992688 730087757 730490863 731129229 731496334 731533587 731745064 732253790 732662201 732817292 733057797
1953.9G33057797N32091M73797J73747J99855N16951N44965K06232O6459L27230N08964
1974.3G36608088K99513O3837J69456M01378L15845N3942J05202L81708L35515L278
1994.7G38737762p2360J90616L24130M4822j79231j7285J56164k0206k79427k23696
2015.1G38661289l1113j06872l60071l68655j47700j04308l54350m77791k72155r1552
2035.5G36346722k13743m05311l13044p9870p6950k51889k03550M8161J14918p3314
2055.9G34892130j60694N7280K49922J12772q1301K8789K30551J78516j5139l696J73748
2078.3G35662878J99317K8015o0380R7275K48015J55210L577R5904K86102K42293N5670
2100.7G37013876P6414K66492K74837P3552j490J91689L09824J35482k2829R5845K53915
$$ plain form
1953.9 733057797 733589888 734063685 734237432 734437287 734954238 735499203 735705435 735771894 736099124 736608088
1974.3 736608088 736907601 736971438 737140894 737542272 737858117 737912059 738017261 738398969 738734484 738737762
1994.7 738737762 738665402 738856018 739180148 739224970 739045739 739028454 739184618 739164412 738884985 738661289
2015.1 738661289 738630176 738523304 738163233 737794578 737646878 737542570 737188220 736710429 736438274 736346722
2035.5 736346722 736132979 735727668 735414624 735334754 735257804 735005915 734802365 734850526 734965444 734892130
2055.9 734892130 734731436 734788716 735038638 735151410 735070109 735098898 735329449 735507965 735492826 735489130 735662878
2078.3 735662878 735862195 735890210 735829830 735927105 736175120 736330330 736333907 736429811 736715913 736958206 737013876
2100.7 737013876 737090290 737356782 737631619 737705171 737703681 737895370 738205194 738340676 738317847 738413692 738667607
2123.2G38667607J78159l756M173J94430K41518Q9228J4782J62959K77281J38641M112
2145.6G39969134J14799K72095K38419J18136J46926L11851L66509K58028K18392M11451
2166G42425740N98728N19634L91364M59075N92649N61356M18365M17531N53369N51939
2186.4G47489750M02987L94583N46515N85139M36544L28243M11868N39839M92752L26693
2206.8G51954913L13521M82440N22077L74913L50654M69625M80115L34859K31028K99454
2227.2G55813599M03344L24607J30117J28329L14951L42429J60336J14799K56538K75075
2247.6G58264124J05918K0921J46389K43783J68026O3717Q8036J62423J22249L6061
2268G59421647Q9049K42233K55704Q3029m7326L5823J72734R9719j12474j64211o8903
$$ plain form
2123.2 738667607 738845766 738842010 738846183 739040613 739282131 739371359 739386141 739549100 739826381 739965022 739969134
2145.6 739969134 740083933 740356028 740594447 740712583 740859509 741171360 741537869 741795897 742014289 742425740
2166 742425740 743024468 743544102 743935466 744394541 744987190 745548546 745966911 746384442 746937811 747489750
2186.4 747489750 747892737 748287320 748833835 749418974 749855518 750183761 750595629 751135468 751628220 751954913
2206.8 751954913 752268434 752750874 753272951 753647864 753998518 754468143 754948258 755283117 755514145 755813599
2227.2 755813599 756216943 756541550 756671667 756799996 757114947 757457376 757617712 757732511 757989049 758264124
2247.6 758264124 758370042 758390963 758537352 758781135 758949161 759012878 759100914 759263337 759385586 759421647
2268 759421647 759510696 759752929 760008633 760091662 760044336 760080159 760252893 760352612 760240138 760075927 760007024
2290.4G60007024p6354j85430k39849j76370j23501j95145l20971l77775l62694l83735
2310.8G57565200m41134m20153l83198n12064o75797o61135n19991l99828l96788m55260
2331.2G52699852m16279l58522m08292m54127m04060j99139J40249L05117r180o59644
2351.6G50235975j219273j285195j023352p22945m18782j37389Q1420K36154M31358
2370G46177971N99385N49137L99351M06146M88937L81351J26421p1644j64211k83480
2390.4G48609364m64022n40972m70996m33504n46158o50167n89073n13375o16550p51972
2410.8G43032575o92189n78225o46293q01861q50439p85530p47740q50320r31621q25584
2431.2G35322773p25090q31664r70602r23574q10086q57890r88603r40144p86483p91967
$$ plain form
2290.4 760007024 759930670 759745240 759505391 759329021 759205520 759010375 758689404 758311629 757948935 757565200
2310.8 757565200 757124066 756703913 756320715 755808651 755132854 754471719 753951728 753551900 753155112 752699852
2331.2 752699852 752283573 751925051 751516759 751062632 750658572 750459433 750599682 750904799 750895619 750235975
2351.6 750235975 749016702 747731507 746708155 745985210 745566428 745429039 745510459 745746613 746177971
2370 746177971 746777356 747326493 747725844 748131990 748620927 749002278 749128699 749057055 748892844 748609364
2390.4 748609364 748145342 747604370 747133374 746699870 746153712 745503545 744914472 744401097 743784547 743032575
2410.8 743032575 742340386 741762161 741115868 740314007 739463568 738678038 737930298 737079978 736148357 735322773
2431.2 735322773 734597683 733766019 732795417 731871843 731061757 730203867 729215264 728275120 727488637 726696670
2451.5G26696670r38833r94503q77202p80642q54671r51946q91029p93100q30471r12965
2471.9G17871308q88645q01504q12173r23216r41694q03113p26581q23378q89778q05557
2492.3G09455669p19845p67649q46147p93755o94394p02381p87735q09312p12991o75261
2512.7G01946199q06809q76367p51495o75738p93278r22501q97825q17418q62360r49204
2533.1F93593204r14872q29518q32140r30369r91702r13083q38817r10699r69052q80182
2553.5F84582770p96497q43585r15467q96156q12948p87437q55386q81791q14676q05915
2573.9F76172912r01401r11355q06928p77483q59737r27508q93414p99656p73549q38578
2594.3F67683303q65757q33690q58486r35614r68456r66668r89795j046598j118004
$$ plain form
2451.5 726696670 725757837 724763334 723886132 723105490 722250819 721298873 720407844 719614744 718784273 717871308
2471.9 717871308 716982663 716181159 715368986 714445770 713504076 712700963 711974382 711151004 710261226 709455669
2492.3 709455669 708735824 707968175 707122028 706328273 705633879 704931498 704143763 703334451 702621460 701946199
2512.7 701946199 701139390 700263023 699511528 698835790 698042512 697120011 696222186 695404768 694542408 693593204
2533.1 693593204 692678332 691848814 691016674 690086305 689094603 688181520 687342703 686432004 685462952 684582770
2553.5 684582770 683786273 682942688 682027221 681131065 680318117 679530680 678675294 677793503 676978827 676172912
2573.9 676172912 675271511 674360156 673553228 672775745 671916008 670988500 670095086 669295430 668521881 667683303
2594.3 667683303 666817546 665983856 665125370 664189756 663221300 662254632 661264837 660218239 659100235
2612.7F59100235j180292j213073j250863j338125j382112j335979j344383j434445
2629F48620963j477420j473785j503467j536191j516223j465678j441717j470566j513183
2647.3F35222733j525342j522482j519918j494229j463771j473248j472831j442075
2663.7F23308837j438677j439035j396715j336933j332700j358032j335204j302302
2680F12369239j296043j282215j249016j242280j271069j294314j293779j286805j327276
2698.3F00826442j426458j494408j464486j434207j492321j561225j566768j527309
2714.6E88859260j497269j532018j567662j526236j479209j467466j426756j352847
2731E77009797j317143j312912j300037j277327j240135j239240j278043j264154j208425
$$ plain form
2612.7 659100235 657919943 656706870 655456007 654117882 652735770 651399791 650055408 648620963
2629 648620963 647143543 645669758 644166291 642630100 641113877 639648199 638206482 636735916 635222733
2647.3 635222733 633697391 632174909 630654991 629160762 627696991 626223743 624750912 623308837
2663.7 623308837 621870160 620431125 619034410 617697477 616364777 615006745 613671541 612369239
2680 612369239 611073196 609790981 608541965 607299685 606028616 604734302 603440523 602153718 600826442
2698.3 600826442 599399984 597905576 596441090 595006883 593514562 591953337 590386569 588859260
2714.6 588859260 587361991 585829973 584262311 582736075 581256866 579789400 578362644 577009797
2731 577009797 575692654 574379742 573079705 571802378 570562243 569323003 568044960 566780806 565572381
2749.3E65572381j189947j215398j228333j200378j185834j191497j195729j202583
2765.6E55962682j187802j207649j326919j423776j385391j350164j446486j564085
2782E45070410j594305j617372j697004j743257j734793j766920j849473j923621j986801
2800.3E29156864k027214k052247k149463k265632k272189k258956k333105k436638
2816.6E11361420k513707k547144k585769k710283k863228k974808l100723l285736
2832.9D88780022l511310l794968m209310m815757n606562o458312p093549p165104
2849.3D46125150o471187n129725l604114k452016k009034k299726l054887l851116
2865.6D17253345m407584m590273m270792l514648k637744j910686j405925j122027
$$ plain form
2749.3 565572381 564382434 563167036 561938703 560738325 559552491 558360994 557165265 555962682
2765.6 555962682 554774880 553567231 552240312 550816536 549431145 548080981 546634495 545070410
2782 545070410 543476105 541858733 540161729 538418472 536683679 534916759 533067286 531143665 529156864
2800.3 529156864 527129650 525077403 522927940 520662308 518390119 516131163 513798058 511361420
2816.6 511361420 508847713 506300569 503714800 501004517 498141289 495166481 492065758 488780022
2832.9 488780022 485268712 481473744 477264434 472448677 466842115 460383803 453290254 446125150
2849.3 446125150 439653963 434524238 430920124 428468108 426459074 424159348 421104461 417253345
2865.6 417253345 412845761 408255488 403984696 400470048 397832304 395921618 394515693 393393666
2881.9C93393666j037330j093238j249403j453221j655221j852840k087057k360105
2898.2C80605251k596438k827913l147393l532172l987014m538178n099863n580932
2914.5C49295348n835772n694627n164028m318505l233642k041339q60036K69890J382500
2932.9C23799789K491683L490835M218966M553199M456937L989160L257543K399236
2949.2C52657348J592845J012414P69437R58264J553207K389372L275960M049242M711181
2967.6C72969270N294680N715818N908489N893439N739033N512983N213588M796893
2983.9D17044193M280030L730774L159553K550334J937419J311451O79910R6888m32223
3002.2D34358329q92252j230806j410574j467019j468808j441538j442075j534134
$$ plain form
2881.9 393393666 392356336 391263098 390013695 388560474 386905253 385052413 382965356 380605251
2898.2 380605251 378008813 375180900 372033507 368501335 364514321 359976143 354876280 349295348
2914.5 349295348 343459576 337764949 332600921 328282416 325048774 323007435 322147399 322417289 323799789
2932.9 323799789 326291472 329782307 334001273 338554472 343011409 347000569 350258112 352657348
2949.2 352657348 354250193 355262607 356032044 356990308 358543515 360932887 364208847 368258089 372969270
2967.6 372969270 378263950 383979768 389888257 395781696 401520729 407033712 412247300 417044193
2983.9 417044193 421324223 425054997 428214550 430764884 432702303 434013754 434693664 434790552 434358329
3002.2 434358329 433466077 432235271 430824697 429357678 427888870 426447332 425005257 423471123
3018.5D23471123j724482k012938k296656k433270k431602k374857k346397k392173
3034.9D05458748k484798k571851k624124k656639k687603k732903k768308k767861
3051.2C84164661k767891k757489k713591k618849k480924k370328k263576k082735
3067.5C64109278j898080j825154j799494j710922j576960j509935j524060j469911
3083.8C50794762j335233j234233j183391j158983j146078j126289j125336j162767
3100.1C41322452j216740j278668j333326j368642j390696j426816j497835j555621
3116.4C30254108j592726j650184j715005j774042j831174j865656j857519j885891
3132.8C16081911j985669k032786j983136j944453j993626k096117k135336k071917
$$ plain form
3018.5 423471123 421746641 419733703 417437047 415003777 412572175 410197318 407850921 405458748
3034.9 405458748 402973950 400402099 397777975 395121336 392433733 389700830 386932522 384164661
3051.2 384164661 381396770 378639281 375925690 373306841 370825917 368455589 366192013 364109278
3067.5 364109278 362211198 360386044 358586550 356875628 355298668 353788733 352264673 350794762
3083.8 350794762 349459529 348225296 347041905 345882922 344736844 343610555 342485219 341322452
3100.1 341322452 340105712 338827044 337493718 336125076 334734380 333307564 331809729 330254108
3116.4 330254108 328661382 327011198 325296193 323522151 321690977 319825321 317967802 316081911
3132.8 316081911 314096242 312063456 310080320 308135867 306142241 304046124 301910788 299838871
3149.1B99838871k027154k059102k108097k132923k147227k161205k133399k098292
3165.4B82971472k108783k111673k083242k074749k103269k103716k041578k018839
3181.7B66325623k058029k050281k000064j964271j937598j911789j903891j895845
3198B50603855j830161j740351j688749j667067j639113j606986j609892j589209j532048
3216.4B35700279j519307j528084j538679j577542j590505j559004j586899j652584
3232.7B23147675j678019j697302j729429j767859j805290j857222j920253j946315
3249B08745986j941114j950071k000510k057031k042696j981720j913414j834690j797185
3267.4A91227555j762405j654058j525239j415282j293555j150161j008123r08718
$$ plain form
3149.1 299838871 297811717 295752615 293644518 291511595 289364368 287203163 285069764 282971472
3165.4 282971472 280862689 278751016 276667774 274593025 272489756 270386040 268344462 266325623
3181.7 266325623 264267594 262217313 260217249 258252978 256315380 254403591 252499700 250603855
3198 250603855 248773694 247033343 245344594 243677527 242038414 240431428 238821536 237232327 235700279
3216.4 235700279 234180972 232652888 231114209 229536667 227946162 226387158 224800259 223147675
3232.7 223147675 221469656 219772354 218042925 216275066 214469776 212612554 210692301 208745986
3249 208745986 206804872 204854801 202854291 200797260 198754564 196772844 194859430 193024740 191227555
3267.4 191227555 189465150 187811092 186285853 184870571 183577016 182426855 181418732 180510014
3283.7A80510014q15347o92918n73740m77061m38898m16026l02642j68920j43096j32397
3304.1A76348969p6413m3541n484L9965N6953N2720M1947M5001M8980M4152L3111K4378
3328.6A76610738N3048P0602K3842j5363k8730p7680j25199j52618j65626j51545j77920
3351A75863549k35900k77847k86222k41965k05785k30580k63587k54512k17110k26170
3371.4A73423871k88665k79680k09704j95011k29761k16440j34185K429R7901J4752
3391.8A71985507j11118q1971N7503J31354L4720r4190l3245J31443K07722K06620
3412.2A72434345K09391K23950K36436K74346L54528M45768N15267N97597O44758P00086
3432.6A76636472P88272P24986O11752O78554Q09879Q73520Q97289Q94487R18030R70379
$$ plain form
3283.7 180510014 179694667 179001749 178428009 177950948 177512050 177096024 176793382 176624462 176481366 176348969
3304.1 176348969 176272556 176229015 176223531 176263496 176320449 176373169 176415116 176460117 176509097 176553249 176586360 176610738
3328.6 176610738 176663786 176734388 176758230 176742867 176714137 176636457 176511258 176358640 176193014 176041469 175863549
3351 175863549 175627649 175349802 175063580 174821615 174615830 174385250 174121663 173867151 173650041 173423871
3371.4 173423871 173135206 172855526 172645822 172450811 172221050 172004610 171870425 171872854 171970755 171985507
3391.8 171985507 171874389 171792418 171849921 171981275 172015995 171921805 171888560 172020003 172227725 172434345
3412.2 172434345 172643736 172867686 173104122 173378468 173732996 174178764 174694031 175291628 175936386 176636472
3432.6 176636472 177424744 178149730 178761482 179440036 180249915 181123435 182020724 182915211 183833241 184803620
3453A84803620J074180J209453J245022J176402J192718J365796J481995J332656J090571
3471.3A95972413J149267J373201J519114J582995J506523J449599J557529J636476
3487.6B07747117J627698J654938J687497J693979J687944J756698J816585J696065
3504B21368521J610294J753733J897275J935676J949504J889214J872972K019062K176524
3522.3B38472775K118423K012491K084792K196595K265081K375603K425134K326578
3538.6B56277472K357840K563805K677858K563417K489388K586483K673120K727955
3554.9B76917338K797395K901227K997338L076047L188402L341645L370046L309280
3571.3C01898718L351390L484547L619820L779412L926277M013270M067659L997565
$$ plain form
3453 184803620 185877800 187087253 188332275 189508677 190701395 192067191 193549186 194881842 195972413
3471.3 195972413 197121680 198494881 200013995 201596990 203103513 204553112 206110641 207747117
3487.6 207747117 209374815 211029753 212717250 214411229 216099173 217855871 219672456 221368521
3504 221368521 222978815 224732548 226629823 228565499 230515003 232404217 234277189 236296251 238472775
3522.3 238472775 240591198 242603689 244688481 246885076 249150157 251525760 253950894 256277472
3538.6 256277472 258635312 261199117 263876975 266440392 268929780 271516263 274189383 276917338
3554.9 276917338 279714733 282615960 285613298 288689345 291877747 295219392 298589438 301898718
3571.3 301898718 305250108 308734655 312354475 316133887 320060164 324073434 328141093 332138658
3587.6C32138658L958910M083306M222840M299223M417211M516006M513681M521459
3603.9C66671294M532039M583329M653573M736513M816413M827738M872471M916578
3620.2D04609948M799515M788191M982531N106717M938483M770458M844695M844934
3636.5D43685472M792094M848153M942268N016416N058050M981250M626900M331261
3652.8D82281864M306197M369944M383952M312723M193396M195094M232943M025936
3669.2E16302049L792346L761649L400504K951682L048420L195822L303290L501236
3685.5E43256998L481746K811074K190411K284587K474844K457440K354979K147973
3701.8E63460052K027452K236724K367914K057194J463175J362086J663088J808048
$$ plain form
3587.6 332138658 336097568 340180874 344403714 348702937 353120148 357636154 362149835 366671294
3603.9 366671294 371203333 375786662 380440235 385176748 389993161 394820899 399693370 404609948
3620.2 404609948 409409463 414197654 419180185 424286902 429225385 433995843 438840538 443685472
3636.5 443685472 448477566 453325719 458267987 463284403 468342453 473323703 477950603 482281864
3652.8 482281864 486588061 490958005 495341957 499654680 503848076 508043170 512276113 516302049
3669.2 516302049 520094395 523856044 527256548 530208230 533256650 536452472 539755762 543256998
3685.5 543256998 546738744 549549818 551740229 554024816 556499660 558957100 561312079 563460052
3701.8 563460052 565487504 567724228 570092142 572149336 573612511 574974597 576637685 578445733
3718.1E78445733J769900J611710J399219J181483J379311J840591J943529J550794
3734.4E91122270J003265J014709J620234J715540R39668R98497J540422R68516M56631
3752.8F01379752J006484J409769J110852Q19504J057625J188397J106382R77397P51078
3771.1F10807240Q00550J094222J209796R11831O97911Q27730Q19325P61152Q89480
3789.5F18819237J040637J060725R01222R21666J016856O07907N99325P30038L32653
3807.8F26030266N33462J139402J190126P07627P71343Q24332J66715K78294O98328
3826.2F32339895P40409P49468P56145R50873R05216K85208O7890L29196M50492O59227
3846.6F38234019J133323J404345M33147q35180p3076P70927Q41975O41286M67897
$$ plain form
3718.1 578445733 580215633 581827343 583226562 584408045 585787356 587627947 589571476 591122270
3734.4 591122270 592125535 593140244 594760478 596476018 597415686 598414183 599954605 600923121 601379752
3752.8 601379752 602386236 603796005 604906857 605726361 606783986 607972383 609078765 610056162 610807240
3771.1 610807240 611607790 612702012 613911808 614823639 615521550 616349280 617168605 617929757 618819237
3789.5 618819237 619859874 620920599 621821821 622743487 623760343 624368250 624967575 625697613 626030266
3807.8 626030266 626563728 627703130 628893256 629600883 630372226 631196558 631363273 631641567 632339895
3826.2 632339895 633080304 633829772 634585917 635536790 636442006 636727214 636795104 637124300 637574792 638234019
3846.6 638234019 639367342 640771687 641204834 640369654 640296578 641067505 641909480 642550766 643018663
3865F43018663N49674L92735J44184L02434M00126O19769O86824M23133M25935K02298
3885.4F47165775R9480M53771L06964J26779N06103P36057N62013K73048m0173j49906
3905.7F50039911Q2553K64823L00288L89338L75688J72973J51097K99931K24471P5519
3926.1F52376592J92404L10242K09749J28388J51277K14279K86281K46167K01762K38001
3946.5F54555142K12789J69992J73926J99020J93894J94252K35319K36153J95086J78218
3966.9F56543791K16127K31802J70291J46508J98245J84655J25945J40846J70528J58966
3987.3F58287704J77085K23756K16067J60992J51694
3997.5F59217298
$$ plain form
3865 643018663 643568337 643961072 644105256 644407690 644807816 645427585 646114409 646537542 646963477 647165775
3885.4 647165775 647265255 647719026 648025990 648152769 648658872 649394929 649956942 650229990 650189817 650039911
3905.7 650039911 650122464 650387287 650687575 651076913 651452601 651625574 651776671 652076602 652301073 652376592
3926.1 652376592 652568996 652879238 653088987 653217375 653368652 653582931 653869212 654115379 654317141 654555142
3946.5 654555142 654767931 654937923 655111849 655310869 655504763 655699015 655934334 656170487 656365573 656543791
3966.9 656543791 656759918 656991720 657162011 657308519 657506764 657691419 657817364 657958210 658128738 658287704
3987.3 658287704 658464789 658688545 658904612 659065604 659217298
3997.5 659217298
##END=$$ End of the data block
