##TITLE=G17-51-SE $$ Begin of the data block
##JCAMP-DX=5.00 $$ ACD/SpecManager v 10.08
##SPECTROMETER/DATA SYSTEM=Alpha
##DATE=23 Oct 2013 10:11:40
##DATA TYPE=INFRARED SPECTRUM
##DATA CLASS=XYDATA
##ORIGIN=
##OWNER=
##NPOINTS=1765
##FIRSTX=399.75695801
##LASTX=3997.56933594
##MAXX=3997.56933594
##MINX=399.75695801
##MAXY=0.76199889
##MINY=0.16061389
##XFACTOR=1.0000000000
##YFACTOR=1.000000000000000e-9
##FIRSTY=0.40968904
##DELTAX=2.03957629
##XUNITS=1/CM
##YUNITS=ARBITRARY UNITS
##XYDATA=(X++(Y..Y))
399.8D09689039l306836k176791j288385r01103l1292J217246J243562K87324l40462
418.1D04392302p73907j485496k326221k574622j887769j514077j931906j770526n38617
436.5C89589161N21660P24077R39101J633674J602471L82304o97345o78658l49611
454.8C93666834j196832k588808k597809j959503k024352k668322k804070k196729
471.1C75630409k017707k300888j947523j020699n25773r21011j304597q38488o35117
489.5C64118606j582861k465785k264022j931489k463371l105938k861768k337486
505.8C45105886k581745l135770k977312k488047k482772k695918k297074j291275
522.1C25155973o31183n21004k59012L07232R39190J484543J994789K704024L106267
$$ y = [409689039, 406382203, 404205412, 402917027, 402015924, 401984632, 403201878, 404445440, 404732764, 404392302, 403618395, 402132899, 399806678, 397232056, 395344287, 393830210, 391898304, 390127778, 389589161, 390110821, 390834898, 391773999, 393407673, 395010144, 395392448, 394695103, 394016445, 393666834, 392470002, 389881194, 387283385, 385323882, 383299530, 380631208, 377827138, 375630409, 373612702, 371311814, 369364291, 368343592, 367817819, 366896808, 365592211, 364753723, 364118606, 362535745, 360069960, 357805938, 355874449, 353411078, 350305140, 347443372, 345105886, 342524141, 339388371, 336411059, 333923012, 331440240, 328744322, 326447248, 325155973, 324524790, 324003786, 323744774, 324052006, 324991196, 326475739, 328470528, 331174552, 334280819]
540.5C34280819K365738J003474L22133K36809k32726r89169j292735j266986j441956
558.8C32985401j889348k289116k283931k309114k523213k057702p52598M90993J186967
577.2C20558339J733810K483696L151327L194243K615958J897931J417965R92716M47213
595.6C38493198J3083j00910M0054Q7142J2577R3460L73631M35174K39074M03702J005590
618C41095775J523614J852334K216071K597809K786725K542079K093673J863747J811356
636.3C60383183J589805J210808J081825J224518J113742O51389L28482L02791L26932
654.7C68213475J49578k4915K00212N64337N02616J71065O28442J447499J431047J235873
675.1C74519229J276582J598657J733243J308948P68959P23154P98613K50309o22451
$$ y = [334280819, 336646557, 337650031, 337972164, 338208973, 337976247, 336987078, 335694343, 334427357, 332985401, 331096053, 328806937, 326523006, 324213892, 321690679, 319632977, 318880379, 319371372, 320558339, 322292149, 324775845, 327927172, 331121415, 333737373, 335635304, 337053269, 338045985, 338493198, 338506281, 338405371, 338445425, 338532567, 338545144, 338638604, 339012235, 339447409, 339686483, 340090185, 341095775, 342619389, 344471723, 346687794, 349285603, 352072328, 354614407, 356708080, 358571827, 360383183, 361972988, 363183796, 364265621, 365490139, 366603881, 367255270, 367583752, 367886543, 368213475, 368363053, 368338138, 368538350, 369102687, 369605303, 369776368, 370404810, 371852309, 373283356, 374519229, 375795811, 377394468, 379127711, 380436659, 381205618, 381928772, 382727385, 382977694, 382355243]
693.5C82355243r70811q28474n94855k07364O12050J734585K432286K410949K526283
711.8C89469892L277391L897130L904343L985047M703105N331844N090207M316628
728.1D23975587L939271L936231L334373K212852J601696J596362J253158L52174k27452
746.5D41974252k324J55628m94153j274913j304478q94814r07302j045734k38895J396268
766.9D37363535K741635L611565M633635N833089O331653N743831M972994M683078
783.2D75915015M320919L311098K377778K325863K678901K652377K486825K959162
799.5D99027938L924816M208923L511667L012538L048718K598286J407623N64456N37038
817.9E21842003M29094n33998j717389k113283k088308k472222l030240k994001k542675
$$ y = [382355243, 381384432, 380555958, 379961103, 379753739, 380365789, 382100374, 384532660, 386943609, 389469892, 392747283, 396644413, 400548756, 404533803, 409236908, 414568752, 419658959, 423975587, 427914858, 431851089, 435185462, 437398314, 439000010, 440596372, 441849530, 442201704, 441974252, 441971928, 442127556, 441633403, 440358490, 439054012, 438159198, 437251896, 436206162, 435967267, 437363535, 440105170, 443716735, 448350370, 454183459, 460515112, 466258943, 471231937, 475915015, 480235934, 483547032, 485924810, 488250673, 490929574, 493581951, 496068776, 499027938, 502952754, 507161677, 510673344, 513685882, 516734600, 519332886, 520740509, 521304965, 521842003, 522271097, 521737099, 520019710, 517906427, 515818119, 513345897, 510315657, 507321656, 504778981]
836.2E04778981k584815l135562l209114k465099j749337j675456j675517j105219
852.5D87178862n20795o80209p41154Q26091L652215N810350O630302P092952P473409
870.9E16722023O822885M857540K547085N76198j393855l529548n145312n661308n610943
889.3E10184765n792260o016225n722403n191982n266637o015390o687343o984145
905.6D62508380p369071p987052q305788p981777p256896o346941n084872l456741
921.9D08719242j986772j259297j105994q34316k57969J21683Q434j97441k11537n50538
942.3D02445495k035946m636317p284075r149760j0256261j0865479j1054784j0937214
958.6C36225659j0811568j0834932j0789216j0443389r854078r149730q259178p046580
$$ y = [504778981, 502194166, 499058604, 495849490, 493384391, 491635054, 489959598, 488284081, 487178862, 486658067, 485977858, 485236704, 486062795, 489715010, 495525360, 502155662, 509248614, 516722023, 523544908, 528402448, 530949533, 531525731, 530131876, 526602328, 521457016, 515795708, 510184765, 504392505, 498376280, 492653877, 487461895, 482195258, 476179868, 469492525, 462508380, 455139309, 447152257, 438846469, 430864692, 423607796, 417260855, 412175983, 408719242, 406732470, 405473173, 404367179, 403532863, 403274894, 403396577, 403405011, 403207570, 402996033, 402445495, 400409549, 395773232, 388489157, 379339397, 369083136, 358217657, 347162873, 336225659, 325414091, 314579159, 303789943, 293346554, 283492476, 274342746, 266083568, 259036988]
974.9B59036988n604982m242584l154785k213493j352057p84009o32450o90684o29708
993.3B39732236l76731j49787J5482L02196N49048L79562k20179q65668j208469j304731
1013.7B36852959j410440j523912j515165j452088j514629j731649j847356j734540
1030B24123180j636729j717359j870900j948282j919121j883074j824215j595766j217633
1048.3B08510101q16554l97310J35616P44641J224279J541257J921773K341658K300307
1066.7B17505768J319721k75343j382038j294032l41192Q15734J935900K983585L745391
1085B25013494M062623M135534M182309M081399L654554L000125K360300J801401J307756
1103.4B53599495J088023J375168J954467K360284K439260K396495K355605K157241
$$ y = [259036988, 253432006, 249189422, 246034637, 243821144, 242469087, 241685078, 241052628, 240361944, 239732236, 239355505, 239205718, 239221200, 239523396, 240072444, 240452006, 240231827, 239366159, 238157690, 236852959, 235442519, 233918607, 232403442, 230951354, 229436725, 227705076, 225857720, 224123180, 222486451, 220769092, 218898192, 216949910, 215030789, 213147715, 211323500, 209727734, 208510101, 207693547, 207296237, 207431853, 208176494, 209400773, 210942030, 212863803, 215205461, 217505768, 218825489, 218550146, 217168108, 215874076, 215532884, 216348618, 218284518, 221268103, 225013494, 229076117, 233211651, 237393960, 241475359, 245129913, 248130038, 250490338, 252291739, 253599495, 254687518, 256062686, 258017153, 260377437, 262816697, 265213192, 267568797, 269726038]
1119.7B69726038J714259J332462J383692J822889K351493K685189K672851K304584
1136B85993457J549810N29110k86519o16282p54237r34273r61692o14255j4782N62817
1156.4B84453154J136601J921534K822608L448784L741622M075289M676580N372525
1172.7C11648697N922407O368339O849378P155687P004082O585359O218464N715191
1189.1C63467604M698038L311574K073676J187384M21703l36021q16524p92563n21273
1207.4C72693598l67760k73139m4793J40042j4067m18753p38322r29147j279563j777083
1227.8C66991013k058238j987785j780063j584649j276284p10011j3053N73307J077175
1246.2C59231412J649619K201616K498865K533764K519608K588510K552569K297521
$$ y = [269726038, 271440297, 272772759, 274156451, 275979340, 278330833, 281016022, 283688873, 285993457, 287543267, 288072377, 287785858, 287169576, 286415339, 285481066, 284519374, 283905119, 283890337, 284453154, 285589755, 287511289, 290333897, 293782681, 297524303, 301599592, 306276172, 311648697, 317571104, 323939443, 330788821, 337944508, 344948590, 351533949, 357752413, 363467604, 368165642, 371477216, 373550892, 374738276, 375159979, 374823958, 374007434, 373214871, 372693598, 372325838, 372052699, 372007906, 372147948, 372133881, 371715128, 370976806, 370047659, 368768096, 366991013, 364932775, 362944990, 361164927, 359580278, 358303994, 357593983, 357580930, 358154237, 359231412, 360881031, 363082647, 365581512, 368115276, 370634884, 373223394, 375775963, 378073484]
1262.5C78073484K166271K359152K586514K454847J994460J572013J332105J111894
1278.8C93650740R03488R44346J191914J258373R99034O69866L66003j17570q48026
1297.2C99018168j534432j892298j979739k088338k262622k164960j689106j138061
1313.5C84268612o91831k00719L13789N42283K28017n28931j366526k041996k517164
1331.8C78005534k713233k452612j915842j466036j137704q04901n61058n97954r62615
1350.2C65393579j408756j693696j851737j999855k347291k997547l611296l875167
1366.5C45608234l835648l314584k837927l052055l532291l891200m155069m090786
1382.8C16898674l453106k477229j419544n32239j24276j60784j51038R9033M93795
$$ y = [378073484, 380239755, 382598907, 385185421, 387640268, 389634728, 391206741, 392538846, 393650740, 394554228, 395498574, 396690488, 397948861, 398947895, 399617761, 399983764, 399866194, 399018168, 397483736, 395591438, 393611699, 391523361, 389260739, 387095779, 385406673, 384268612, 383576781, 383376062, 383689851, 384232134, 384460151, 383931220, 382564694, 380522698, 378005534, 375292301, 372839689, 370923847, 369457811, 368320107, 367515206, 366954148, 366356194, 365393579, 363984823, 362291127, 360439390, 358439535, 356092244, 353094697, 349483401, 345608234, 341772586, 338458002, 335620075, 332568020, 329035729, 325144529, 320989460, 316898674, 313445568, 310968339, 309548795, 309016556, 308892280, 308731496, 308580458, 308679491, 309173286]
1401.2C09173286R75966J377404J605511J781791J883298J887471K046168K458960
1417.5C23189855K776891K580493K470583K438903K125412J483530O05732N5522l75897
1435.9C37351024q22842n63771J8091L81886M97431L34948R2209J09940O45638J758963
1456.2C39803517K613693K614171K820760L231197L488750M271805O326258Q986980
1472.6C74157131R291261P532209N941212M398972K692551R41068o84053k663046m728586
1490.9C96878719n354881n713224o947726p424146o785274o107747p342130j0994554
1507.2C40209037j0674566q716553q025140o784856m946113l129065k690911l011912
1523.6B92229921l061414l255606k911329k460092k520919k044559j211375j129061
$$ y = [309173286, 310149252, 311526656, 313132167, 314913958, 316797256, 318684727, 320730895, 323189855, 325966746, 328547239, 331017822, 333456725, 335582137, 337065667, 337671399, 337726921, 337351024, 336528182, 335964411, 335982502, 336364388, 336861819, 337196767, 337288976, 337398916, 338044554, 339803517, 342417210, 345031381, 347852141, 351083338, 354572088, 358843893, 365170151, 374157131, 383448392, 390980601, 396921813, 401320785, 404013336, 404954404, 404270351, 401607305, 396878719, 391523838, 385810614, 378862888, 371438742, 364653468, 358545721, 351203591, 340209037, 329534471, 320817918, 312792778, 306007922, 301061809, 297932744, 295241833, 292229921, 289168507, 285912901, 283001572, 280541480, 278020561, 275976002, 274764627, 273635566]
1539.9B73635566j006871j50442P21842J654535K621413L404438M031241M513383N528450
1558.2B94953555N680710L945351L609746L856272L787547L450632K734751K490967
1574.5C24509531K305985J514405R97454P19785M46141R1762l60758r41723j571000
1592.9C27711582k302408l027022l732145m578680n456000o181687o877214p793307
1609.2B87763119q407980q407265r210229j0974974j0060593r313748j0668650j0641709
1625.5B10077971r698540r098977p771998o835759o923631n120590k567619j167655
1641.8A60893202k79308M24281R77367J268775J766100K418578K429217K711013L609881
1660.2A76219106M669994N347311N392805O136194P058710O735742P075131P772103
$$ y = [273635566, 272628695, 272478253, 273200095, 274854630, 277476043, 280880481, 284911722, 289425105, 294953555, 300634265, 304579616, 308189362, 312045634, 315833181, 319283813, 322018564, 324509531, 326815516, 328329921, 329327375, 330047160, 330493301, 330585063, 330224305, 329282582, 327711582, 325409174, 322382152, 318650007, 314071327, 308615327, 302433640, 295556426, 287763119, 279355139, 270947874, 261737645, 250762671, 240702078, 231388330, 220719680, 210077971, 200379431, 191280454, 183508456, 176672697, 169749066, 164628476, 162060857, 160893202, 160613894, 161038175, 162015542, 163284317, 165050417, 167468995, 169898212, 172609225, 176219106, 180889100, 186236411, 191629216, 197765410, 204824120, 211559862, 218634993, 226407096]
1676.5B26407096P528275P530749Q750483J0963202J0487973R702683J1007547J2036354
1692.8C04414362J4822751J7322630J7585039J9097030J6140193J3715565J3566285
1707.1D16663855J1803061J0271192R343773Q733123Q375287P002086N483389N000591
1723.4D82676357M790574M484296M310698M030674L922701L571093L327966L780901
1739.7E14895260M205406M667580N513489O421805P211268P539213P322311P513761
1756.1E65290093P542372P096172P081449O672561O146192N947709N703628N528212
1772.4F17008388M828990L992259L851771L944636L715873L285110L009796L092467
1788.7F46729290L227592K899528K345860K386748K654076K501309K072871J989424
$$ y = [226407096, 233935371, 241466120, 250216603, 261179805, 271667778, 281370461, 292378008, 304414362, 319237113, 336559743, 354144782, 373241812, 389382005, 403097570, 416663855, 428466916, 438738108, 448081881, 456815004, 465190291, 472192377, 477675766, 482676357, 487466931, 491951227, 496261925, 500292599, 504215300, 507786393, 511114359, 514895260, 519100666, 523768246, 529281735, 535703540, 542914808, 550454021, 557776332, 565290093, 572832465, 579928637, 587010086, 593682647, 599828839, 605776548, 611480176, 617008388, 621837378, 625829637, 629681408, 633626044, 637341917, 640627027, 643636823, 646729290, 649956882, 652856410, 655202270, 657589018, 660243094, 662744403, 664817274, 666806698]
1805F66806698K247631K289057J970828J737594J939416K083004J833021J638949J845420
1823.4F84391618K004564J767993J452863J338422J497805J476169J197636J217663
1839.7F96344733J570463J551032R87173P58051J031876J212180J006484Q17120R77874
1858G06256986J190066J030326P93576R41098J107812P93755M39823N74648R32395
1876.4G14060485J015425P47264O14583Q67307J127482R33408N39363O40988R59218
1894.7G21505523Q35597M81367M91679P79867Q12054N15342L59416N58197P11322N68509
1915.1G27618873L76165M63247O43850M81486J81198K75970N84125N49555K20239J47641
1935.5G31542349M66406O35863L47256N8770K40803M78745L33011J13427K74122N88835
$$ y = [666806698, 669054329, 671343386, 673314214, 675051808, 676991224, 679074228, 680907249, 682546198, 684391618, 686396182, 688164175, 689617038, 690955460, 692453265, 693929434, 695127070, 696344733, 697915196, 699466228, 700453401, 701211452, 702243328, 703455508, 704461992, 705279112, 706256986, 707447052, 708477378, 709270954, 710212052, 711319864, 712113619, 712553442, 713128090, 714060485, 715075910, 715823174, 716437757, 717305064, 718432546, 719365954, 719905317, 720546305, 721505523, 722341120, 722822487, 723314166, 724094033, 724906087, 725421429, 725780845, 726339042, 727050364, 727618873, 727995038, 728458285, 729102135, 729583621, 729764819, 730040789, 730624914, 731174469, 731394708, 731542349, 732008755, 732644618, 732991874, 733050644, 733291447, 733770192, 734103203, 734216630, 734490752, 735079587]
1955.9G35079587M89294J57833J76907N02228N35429J89364O4313L57211N42164K98023
1976.3G38392353M5478J69456M03703K97844M7088J20043L75867K97964k9147n1200
1996.7G40069449K33233L20733K6166j64509J0312J62840k8313k70843j88708Q702
2017.1G40179062r3579l87013m06742j79828j35183l52979m26650k19583r1791k52307
2037.5G37633407m13954k84434p4148j08897k86937k18988N0128J22011o3718j36316
2057.9G36218154P5043K30610R9301o9022L0220K24650J84774N961J4483J72616J85132
2080.3G37371922L397q0168J15633K84910J54614j6093R6798K89738K45929P0512Q5116
2102.8G38622308K61247K73764Q7559l57J72197L00825J35064l4153Q0406K49863J79410
$$ y = [735079587, 735568881, 735726714, 735903621, 736405849, 736941278, 737130642, 737194955, 737552166, 738094330, 738392353, 738437831, 738607287, 739010990, 739308834, 739355922, 739475965, 739851832, 740149796, 740120649, 740069449, 740302682, 740623415, 740649581, 740485072, 740495384, 740658224, 740629911, 740359068, 740170360, 740179062, 740085483, 739698470, 739291728, 739111900, 738976717, 738623738, 738197088, 737977505, 737885714, 737633407, 737219453, 736935019, 736860871, 736751974, 736465037, 736246049, 736296177, 736418188, 736354470, 736218154, 736293197, 736523807, 736623108, 736554086, 736584306, 736808956, 736993730, 736999691, 737014174, 737186790, 737371922, 737375319, 737295151, 737410784, 737695694, 737850308, 737834215, 737931013, 738220751, 738466680, 738537192, 738622308, 738883555, 739157319, 739244878, 739244521, 739416718, 739717543, 739852607, 739818454, 739898860, 740148723, 740328133]
2125.2G40328133k98K6524K24114K40445N3763j1444J58429K64645J20699J9789J64270
2147.7G41589069L10064K36451R3937J47760L44098L75092K39730K35021M29511N66602
2168G44567335M84168L90053N00917O36936N53310L94284M48227O16014N55873L52264
2188.4G49499381L64184N61178O07073M32909L32355M36664N37574M57048L08872L36468
2208.8G53873706N06997N26071L77774L47554M44711M54604L44575K75254L32177L84927
2229.2G57868350K78532J20699J57118L15368L04223J48832J45078K75433K65777J08183
2249.6G59987593M6789J53482K23637J45614N2989R5844J78277J51277P0453Q1598
2270G61187553J84477K00271Q4520K086P7128J77086Q5771j17600j57714n1856o5565
$$ y = [740328133, 740327835, 740354359, 740578473, 740818918, 740872681, 740861237, 741019666, 741284311, 741405010, 741424799, 741589069, 741899133, 742135584, 742229521, 742377281, 742721379, 743096471, 743336201, 743571222, 744000733, 744567335, 745051503, 745441556, 745942473, 746579409, 747132719, 747527003, 747975230, 748591244, 749147117, 749499381, 749863565, 750424743, 751031816, 751464725, 751797080, 752233744, 752771318, 753228366, 753537238, 753873706, 754380703, 754906774, 755284548, 755632102, 756076813, 756531417, 756875992, 757151246, 757483423, 757868350, 758146882, 758267581, 758424699, 758740067, 759044290, 759193122, 759338200, 759613633, 759879410, 759987593, 760034382, 760187864, 760411501, 760557115, 760610104, 760705948, 760884225, 761035502, 761105955, 761187553, 761372030, 761572301, 761656821, 761658907, 761736035, 761913121, 761998892, 761881292, 761723578, 761671722, 761606157]
2292.5G61606157j90854k17796j34825j27077k15292k89917l17693l22521l72589m14490
2312.9G59003103l55184l47317n08487o60360o32763m67062l92198m65393m91440l81947
2333.3G54300952l17693m37140n33164m16636j63734J24514K77459M888o02543j110256
2353.6G51126647j167774r94861p71284m53055j32025J22130K83122M00544M68909
2372G48882353M12047L41416L86119M09483K50459L9876p7308j46389k98321n05209
2392.4G49694526n68032m66287m17292n41628o49512n85854n20825o09875p26819o96301
2412.8G43912101n99385o55889q30650q80063p68185p26580q58665r25898q16405p35819
2433.2G36114562q31724r72628r40681q30114q61346r56178r27270q25405q32915r43780
$$ y = [761606157, 761415303, 761197507, 761062682, 760935605, 760720313, 760430396, 760112703, 759790182, 759417593, 759003103, 758647919, 758300602, 757792115, 757131755, 756498992, 756031930, 755639732, 755174339, 754682899, 754300952, 753983259, 753546119, 753012955, 752596319, 752432585, 752557099, 752834558, 752839446, 752236903, 751126647, 749958873, 748964012, 748192728, 747739673, 747607648, 747729778, 748012900, 748413444, 748882353, 749294400, 749635816, 750021935, 750431418, 750681877, 750721753, 750644445, 750498056, 750199735, 749694526, 749126494, 748660207, 748242915, 747701287, 747051775, 746465921, 745945096, 745335221, 744608402, 743912101, 743312716, 742656827, 741826177, 740946114, 740177929, 739451349, 738592684, 737666786, 736850381, 736114562, 735282838, 734310210, 733369529, 732539415, 731678069, 730721891, 729794621, 728969216, 728136301, 727192521]
2453.6G27192521r65357q35359p51614q66414r92596r03189p64191q18193r46581r10759
2474G18438268p73549p80464r20951r57608q33392p66218q64625r25243q07345o93202
2494.4G10115671p56025q57473p93576o65009o91414q07941q08179o86646o54935q04663
2514.8G02589810r01401p87437o77526p79510r39786r02772p84516q47936r68456r31681
2535.2F94068789q17716q08596r35018j012683r27985q42094r04918r83000q95679
2553.5F85941100p72059q09848r13501r06646q09610p95424q91864r10044q13067p83920
2573.9F77535117q70765r04142q28028p90954q65340r34720q98182q16226p92683q28147
2594.3F69005930q28981p98404q37147r35555r88841r82106r95576j074195j165569
$$ y = [727192521, 726227164, 725391805, 724640191, 723773777, 722781181, 721877992, 721113801, 720295608, 719349027, 718438268, 717664719, 716884255, 715963304, 715005696, 714172304, 713406086, 712541461, 711616218, 710808873, 710115671, 709359646, 708502173, 707708597, 707043588, 706352174, 705544233, 704736054, 704049408, 703394473, 702589810, 701688409, 700900972, 700223446, 699443936, 698504150, 697601378, 696816862, 695968926, 695000470, 694068789, 693251073, 692442477, 691507459, 690494776, 689566791, 688724697, 687819779, 686836779, 685941100, 685169041, 684359193, 683445692, 682539046, 681729436, 680934012, 680042148, 679132104, 678319037, 677535117, 676664352, 675760210, 674932182, 674141228, 673275888, 672341168, 671442986, 670626760, 669834077, 669005930, 668176949, 667378545, 666541398, 665605843, 664617002, 663634896, 662639320, 661565125, 660399556]
2612.7F60399556j195073j192629j229644j320720j382530j349985j349628j451254
2629F49928093j512587j484096j484156j529515j528620j473844j446784j479566j516104
2647.3F36472821j517772j514793j523912j518369j498997j468718j416266j399278
2663.7F24614716j459718j488388j416206j342476j329481j336575j331567j308442
2680F13601863j274585j256705j267075j277924j268327j276374j308799j337289j362622
2698.3F01972163j401663j462102j488805j479506j514495j570880j554728j487195
2714.6E90012789j474798j544058j589597j539886j480698j448810j409471j364291
2731E78161180j320064j315713j331925j297355j252294j256168j275360j252473j201391
$$ y = [660399556, 659204483, 658011854, 656782210, 655461490, 654078960, 652728975, 651379347, 649928093, 648415506, 646931410, 645447254, 643917739, 642389119, 640915275, 639468491, 637988925, 636472821, 634955049, 633440256, 631916344, 630397975, 628898978, 627430260, 626013994, 624614716, 623154998, 621666610, 620250404, 618907928, 617578447, 616241872, 614910305, 613601863, 612327278, 611070573, 609803498, 608525574, 607257247, 605980873, 604672074, 603334785, 601972163, 600570500, 599108398, 597619593, 596140087, 594625592, 593054712, 591499984, 590012789, 588537991, 586993933, 585404336, 583864450, 582383752, 580934942, 579525471, 578161180, 576841116, 575525403, 574193478, 572896123, 571643829, 570387661, 569112301, 567859828, 566658437]
2749.3E66658437j188874j208425j220285j225174j219273j204490j199603j198232
2765.6E56994081j185537j218617j329124j401543j385510j373232j421690j518249
2782E46160579j586557j625538j702427j766563j782119j823247j905560j954496j965761
2800.3E30048311j990676k057672k158403k233982k248049k272248k360285k440810
2816.6E12286186k495050k561927k640188k743780k865881k976895l094434l274232
2832.9D89633799l508568l790915m224658m856110n646646o499588p120669p173658
2849.3D46812987o498545n171180l623038k458215k015382k296746l045291l839254
2865.6D17865336m397005m581481m279971l544629k654672j912415j406878j112371
$$ y = [566658437, 565469563, 564261138, 563040853, 561815679, 560596406, 559391916, 558192313, 556994081, 555808544, 554589927, 553260803, 551859260, 550473750, 549100518, 547678828, 546160579, 544574022, 542948484, 541246057, 539479494, 537697375, 535874128, 533968568, 532014072, 530048311, 528057635, 525999963, 523841560, 521607578, 519359529, 517087281, 514726996, 512286186, 509791136, 507229209, 504589021, 501845241, 498979360, 496002465, 492908031, 489633799, 486125231, 482334316, 478109658, 473253548, 467606902, 461107314, 453986645, 446812987, 440314442, 435143262, 431520224, 429062009, 427046627, 424749881, 421704590, 417865336, 413468331, 408886850, 404606879, 401062250, 398407578, 396495163, 395088285, 393975914]
2881.9C93975914j032025j117826j272440j444846j628488j861960k142906k388090
2898.2C81087333k579153k801448l149271l570288m012525m528910n080819n573333
2914.5C49791586n827516n670369n141556m319429l249347k050847q63433K64644J369983
2932.9C24303716K467722L489941M260064M580259M452616M003882L301651K450198
2949.2C53310049J628816R94891P26163R67771J614302K428383L265619M063547M766524
2967.6C73766065N316168N699396N900442N897254N756289N550444N222410M761905
2983.9D17870373M264086L745288L169298K543777J926363J342088P53700J57386m16010
3002.2D35356349r14753j256615j419305j468003j462192j421183j424432j555592
$$ y = [393975914, 392943889, 391826063, 390553623, 389108777, 387480289, 385618329, 383475423, 381087333, 378508180, 375706732, 372557461, 368987173, 364974648, 360445738, 355364919, 349791586, 343964070, 338293701, 333152145, 328832716, 325583369, 323532522, 322669089, 322933733, 324303716, 326771438, 330261379, 334521443, 339101702, 343554318, 347558200, 350859851, 353310049, 354938865, 355933756, 356659919, 357627690, 359241992, 361670375, 364935994, 368999541, 373766065, 379082233, 384781629, 390682071, 396579325, 402335614, 407886058, 413108468, 417870373, 422134459, 425879747, 429049045, 431592822, 433519185, 434861273, 435614973, 435772359, 435356349, 434441596, 433184981, 431765676, 430297673, 428835481, 427414298, 425989866, 424434274]
3018.5D24434274j775503k046257k311230k441257k428204k375334k344132k386689
3034.9D06325668k486676k572596k637088k679587k704709k738476k769441k767473
3051.2C84969622k763063k773344k738864k630353k484172k358347k247304k089977
3067.5C64884198j925856j844198j799702j722813j628637j541734j488537j448303
3083.8C51484418j380235j295090j193374j125544j128138j128077j129925j175821
3100.1C41928214j232356j283914j335859j375258j411647j462221j504719j535505
3116.4C30786735j583606j665741j733005j749307j806110j893998j912117j914024
3132.8C16528827j936466j949727j961351j997560k054751k091616k104342k103090
$$ y = [424434274, 422658771, 420612514, 418301284, 415860027, 413431823, 411056489, 408712357, 406325668, 403838992, 401266396, 398629308, 395949721, 393245012, 390506536, 387737095, 384969622, 382206559, 379433215, 376694351, 374063998, 371579826, 369221479, 366974175, 364884198, 362958342, 361114144, 359314442, 357591629, 355962992, 354421258, 352932721, 351484418, 350104183, 348809093, 347615719, 346490175, 345362037, 344233960, 343104035, 341928214, 340695858, 339411944, 338076085, 336700827, 335289180, 333826959, 332322240, 330786735, 329203129, 327537388, 325804383, 324055076, 322248966, 320354968, 318442851, 316528827, 314592361, 312642634, 310681283, 308683723, 306628972, 304537356, 302433014, 300329924]
3149.1C00329924k078355k070427k111584k147108k155244k130717k100528k123475
3165.4B83412486k148866k137959k113134k084404k075941k094000k100319k098441
3181.7B66559422k089709k034128j953572j935661j980841j965403j884133j832038
3198B50883937j805231j759663j690746j639381j639828j651481j651823j623705j554772
3216.4B35867307j536087j580149j597121j580924j560226j559496j600980j618147
3232.7B23234177j625225j687780j761169j839548j901999j891911j857176j885102
3249B08784267j953318k000675k010763j991287j984864j983523j935095j886681j850053
3267.4A91188008j718238j570836j496002j405657j315504j210913j042753r21607
$$ y = [300329924, 298251569, 296181142, 294069558, 291922450, 289767206, 287636489, 285535961, 283412486, 281263620, 279125661, 277012527, 274928123, 272852182, 270758182, 268657863, 266559422, 264469713, 262435585, 260482013, 258546352, 256565511, 254600108, 252715975, 250883937, 249078706, 247319043, 245628297, 243988916, 242349088, 240697607, 239045784, 237422079, 235867307, 234331220, 232751071, 231153950, 229573026, 228012800, 226453304, 224852324, 223234177, 221608952, 219921172, 218160003, 216320455, 214418456, 212526545, 210669369, 208784267, 206830949, 204830274, 202819511, 200828224, 198843360, 196859837, 194924742, 193038061, 191188008, 189469770, 187898934, 186402932, 184997275, 183681771, 182470858, 181428105, 180506498]
3283.7A80506498q47623p21038n75482m55991l81022l38346k71559k13563j89603j36107
3304.1A76376164o4850l5420l4779j6675J8344M0769M3378O2152R8929R0182L2201
3326.5A76610395p972K1458O5088L2991m6774j03116j19105j11178j47849k23920k31057
3348.9A75738961j89737j98856k49371k52604k27705k31370k59340k94775k86475k66224
3369.3A73282504k96742k81646k07052k02924k29567k27631j71914n0828M6804O0186
3389.7A71721190k1770j28776j27614p912R5725O8337k8238k936J11491J66163J73270
3412.2A72018930J92240K28673K50742K85611L65212M51684N33194O32897O81951P11739
3432.6A76352873P58052O93769N86748O45026Q03739Q99851R34929R15036R11876R71809
$$ y = [180506498, 179658875, 178937837, 178362355, 177906364, 177525342, 177186996, 176915437, 176701874, 176512271, 176376164, 176311314, 176275894, 176241115, 176224440, 176242784, 176283553, 176326931, 176389083, 176488012, 176578194, 176610395, 176602423, 176623881, 176688969, 176721960, 176675186, 176572070, 176452965, 176341787, 176193938, 175970018, 175738961, 175549224, 175350368, 175100997, 174848393, 174620688, 174389318, 174129978, 173835203, 173548728, 173282504, 172985762, 172704116, 172497064, 172294140, 172064573, 171836942, 171665028, 171614200, 171661004, 171721190, 171699420, 171570644, 171443030, 171435118, 171530843, 171599180, 171570942, 171568006, 171679497, 171845660, 172018930, 172211170, 172439843, 172690585, 172976196, 173341408, 173793092, 174326286, 174959183, 175641134, 176352873, 177110925, 177804694, 178391442, 179036468, 179840207, 180740058, 181674987, 182590023, 183501899, 184473708]
3453A84473708J067713J181960J242504J195982J187146J335337J461044J362682J152485
3471.3A95660561J144111J336307J554966J625582J499728J461044J600206J647964
3487.6B07530469J593172J639843J716376J717954J698614J765906J814336J694396
3504B21171066J638860J794681J911819J953244J993194J917288J865864K004966K167076
3522.3B38418058K125024K042130K120018K235383K282977K369285K425789K358020
3538.6B56376684K447307K663433K707631K519458K442628K607823K705753K729416
3554.9B77200133K855509K996773L048151L113687L236711L337920L317326L308356
3571.3C02414566L412843L580630L724068L820837L919482M029870M116535M070252
$$ y = [184473708, 185541421, 186723381, 187965885, 189161867, 190349013, 191684350, 193145394, 194508076, 195660561, 196804672, 198140979, 199695945, 201321527, 202821255, 204282299, 205882505, 207530469, 209123641, 210763484, 212479860, 214197814, 215896428, 217662334, 219476670, 221171066, 222809926, 224604607, 226516426, 228469670, 230462864, 232380152, 234246016, 236250982, 238418058, 240543082, 242585212, 244705230, 246940613, 249223590, 251592875, 254018664, 256376684, 258823991, 261487424, 264195055, 266714513, 269157141, 271764964, 274470717, 277200133, 280055642, 283052415, 286100566, 289214253, 292450964, 295788884, 299106210, 302414566, 305827409, 309408039, 313132107, 316952944, 320872426, 324902296, 329018831, 333089083]
3587.6C33089083M034013M127920M258930M369349M487455M532039M488021M519671
3603.9C67906481M635274M780412M817724M785210M803688M860073M952669M943639
3620.2D06485170M771054M787475N015403N161643N031526M850924M881054M876942
3636.5D45861191M831641M876376M946977N001545N070775N052924M687667M328281
3652.8D84657377M318923M438936M455656M352719M184306M167377M235626M049539
3669.2E18860459L821791L787159L428877L034651L099203L131748L269672L594577
3685.5E46028137L581345K826095K175152K281726K493202K479256K319574K071679
3701.8E66256166K007424K257347K371252K070427J458466J336038J683653J826763
$$ y = [333089083, 337123096, 341251016, 345509946, 349879295, 354366750, 358898789, 363386810, 367906481, 372541755, 377322167, 382139891, 386925101, 391728789, 396588862, 401541531, 406485170, 411256224, 416043699, 421059102, 426220745, 431252271, 436103195, 440984249, 445861191, 450692832, 455569208, 460516185, 465517730, 470588505, 475641429, 480329096, 484657377, 488976300, 493415236, 497870892, 502223611, 506407917, 510575294, 514810920, 518860459, 522682250, 526469409, 529898286, 532932937, 536032140, 539163888, 542433560, 546028137, 549609482, 552435577, 554610729, 556892455, 559385657, 561864913, 564184487, 566256166, 568263590, 570520937, 572892189, 574962616, 576421082, 577757120, 579440773, 581267536]
3718.1E81267536J766741J623034J381934J156390J442015J943469J960635J508177
3734.4E94049931J020610J036465J580894J658499R34303J053870J551330R24110M72427
3752.8F04282439J061141J411438J081825Q19802J071095J209796J158058R89378O91175
3771.1F13776147P94292J168370J278401R20772O50406P87437Q12650P48336Q54790
3789.5F21791601J061380J154780R52542R09031R71079N19514N95510Q50558M29213
3807.8F29235208N31375J082361J146496P18712P56681P77006J68384L19182P56801
3826.2F35492206P95841P79867P48336R09746Q93474L27170J05917L02315L69608O33598
3846.6F41358078J216709J503050M65453q50439j00672P56383Q66592O93083M69386
$$ y = [581267536, 583034277, 584657311, 586039245, 587195635, 588637650, 590581119, 592541754, 594049931, 595070541, 596107006, 597687900, 599346399, 600280702, 601334572, 602885902, 603810012, 604282439, 605343580, 606755018, 607836843, 608656645, 609727740, 610937536, 612095594, 613084972, 613776147, 614570439, 615738809, 617017210, 617937982, 618588388, 619375825, 620188475, 620936811, 621791601, 622852981, 624007761, 624960303, 625869334, 626840413, 627359927, 627955437, 628805995, 629235208, 629766583, 630848944, 631995440, 632714152, 633470833, 634247839, 634416223, 634735405, 635492206, 636288047, 637067914, 637816250, 638725996, 639619470, 639946640, 640052557, 640354872, 640724480, 641358078, 642574787, 644077837, 644543290, 643692851, 643592179, 644348562, 645215154, 645908237, 646377623]
3865F46377623N24223M39882J76907K36690L03864N45204O77407M88281N12779K41935
3885.4F50524795Q8394M69506L43024J14203M83870P57993N77628K31922j15812k05874
3905.7F53269649Q3923L14593L75629M45425L84331J29640N8830K14040K14815J35720
3926.1F55626595K51234L39984K12431J38402K02001K41935K89857K52128J52767J83582
3946.5F57890916K00271J45972J35184K12848K91049K61426J76013J18434J38998K18392
3966.9F59789503K68995K46287J70588J45912K27869K16544J04248J17362J99377K27034
3987.3F61713719K02537J60038J69158J88828J55985
3997.5F62590265
$$ y = [646377623, 646901846, 647341728, 647518635, 647755325, 648059189, 648604393, 649281800, 649770081, 650282860, 650524795, 650613189, 651082695, 651425719, 651539922, 652023792, 652781785, 653359413, 653591335, 653475523, 653269649, 653353572, 653668165, 654043794, 654489219, 654873550, 655003190, 655062020, 655276060, 655490875, 655626595, 655877829, 656217813, 656430244, 656568646, 656770647, 657012582, 657302439, 657554567, 657707334, 657890916, 658091187, 658237159, 658372343, 658585191, 658876240, 659137666, 659313679, 659432113, 659571111, 659789503, 660058498, 660304785, 660475373, 660621285, 660849154, 661065698, 661169946, 661287308, 661486685, 661713719, 661916256, 662076294, 662245452, 662434280, 662590265]
##END=$$ End of the data block
