##TITLE=G17-51-CE $$ Begin of the data block
##JCAMP-DX=5.00 $$ ACD/SpecManager v 10.08
##SPECTROMETER/DATA SYSTEM=Alpha
##DATE=23 Oct 2013 10:11:40
##DATA TYPE=INFRARED SPECTRUM
##DATA CLASS=XYDATA
##ORIGIN=
##OWNER=
##NPOINTS=1765
##FIRSTX=399.75695801
##LASTX=3997.56933594
##MAXX=3997.56933594
##MINX=399.75695801
##MAXY=0.73122686
##MINY=0.13817787
##XFACTOR=1.0000000000
##YFACTOR=1.000000000000000e-9
##FIRSTY=0.44348004
##DELTAX=2.03957629
##XUNITS=1/CM
##YUNITS=ARBITRARY UNITS
##XYDATA=(X++(Y..Y))
399.8D43480045k974213j567244j219273q23378m62979o05792o11901j75983k11656
418.1D34827626j100242j801104k165585k166123j526415j138866j545846j945407
434.4D21438038j440286k86937O25431J176060J410365R62138l8832q06183j021624
452.8D22018170j127720j557707k107621k532094k879173k866357k614528k352059
469.1D03980911k412856k683580k315640j653970j193493q43614p52002r13233j169771
487.5C90042752j636714k155989k330929k342850k420128k407610k557814l093958
503.8C71096760l503293l445804l102630k871484k923280k949893k655864k246410
520.1C47398102j874298j374006p94649k75105O5475L54440J004517J965940K575874
$$ plain form
399.8 443480045 440505832 438938588 437719315 436895937 436432958 435827166 435215265 435039282 434827626
418.1 434827626 433727384 431926280 429760695 427594572 426068157 424929291 423383445 421438038
434.4 421438038 419997752 419710815 420336246 421512306 422922671 423884809 423845977 423039794 422018170
452.8 422018170 420890450 419332743 417225122 414693028 411813855 408947498 406332970 403980911
469.1 403980911 401568055 398884475 396568835 394914865 393721372 392877758 392125756 391212523 390042752
487.5 390042752 388406038 386250049 383919120 381576270 379156142 376748532 374190718 371096760
503.8 371096760 367593467 364147663 361045033 358173549 355250269 352300376 349644512 347398102
520.1 347398102 345523804 344149798 343355149 343080044 343145519 343499959 344504476 346470416 349046290
538.4C49046290K529502K012104J088082J66178l25948n86659p88390r91255j308024
556.8C50841880j616806j837373k113729k326757k319247k097577j636475r61065j49489
575.2C35783362Q28833J810878K392918K621383K667635K399236J788616J203239P57814
593.5C52253914L17067K563j91421k11864R328J76936J26750M5150j6183k5183K86550
616C52773607R15527J471400J885444K257198K422899K434791K424597K375216K266973
634.3C71227652J982182J460433J036227J013875J192152J190693Q69423L12775j12116
652.7C80173296j89573n1677K07633L90380L35157O9171j37835N55128J440048J572728
673.1C84364456J606047J452476J214087J209170J347184J323759J067877N68420j34886
$$ plain form
538.4 349046290 351575792 353587896 354675978 354842156 354516208 353929549 353141159 352149904 350841880
556.8 350841880 349225074 347387701 345273972 342947215 340627968 338530391 336893916 335932851 335783362
575.2 335783362 336612195 338423073 340815991 343437374 346105009 348504245 350292861 351496100 352253914
593.5 352253914 352570981 352573544 352382123 352170259 352179587 352356523 352483273 352528423 352512240 352487057 352773607
616 352773607 353689134 355160534 357045978 359303176 361726075 364160866 366585463 368960679 371227652
634.3 371227652 373209834 374670267 375706494 376720369 377912521 379103214 379972637 380285412 380173296
652.7 380173296 379983723 379932046 380139679 380530059 380865216 380934387 380796552 381351680 382791728 384364456
673.1 384364456 385970503 387422979 388637066 389846236 391193420 392517179 393585056 394153476 394018590
691.4C94018590q26507j217962j023829k24203O78659J289308J684219K115070K664149
709.8C99157494L262520L752619L922790L938139M140586M546761M967034N171210
726.1D32859153M844516M109532L297209K569199K148062J938611J592100Q99583J09673
744.4D54367638l06994j95265Q0466Q3864l17603r91434j487881j360208o15895M26740
764.8D49683428J553118K651185L622770M394889N043685N576671N776256N393416
781.2D83695418M379868L150016K306819K167195K417594K545655K472818K464414
797.5E05599797K690792L091156L507078L725350L465116K594590J487196O81877M37736
815.8E27280688N02169K79427n29706j692653k730251l114759k755940k236546k148449
$$ plain form
691.4 394018590 393192083 391974121 390950292 390726089 391404748 392694056 394378275 396493345 399157494
709.8 399157494 402420014 406172633 410095423 414033562 418174148 422720909 427687943 432859153
726.1 432859153 437703669 441813201 445110410 447679609 449827671 451766282 453358382 454257965 454367638
744.4 454367638 454060644 453865379 453945845 454029709 453712106 452720672 451232791 449872583 449256688 449683428
764.8 449683428 451236546 453887731 457510501 461905390 466949075 472525746 478302002 483695418
781.2 483695418 488075286 491225302 493532121 495699316 498116910 500662565 503135383 505599797
797.5 505599797 508290589 511381745 514888823 518614173 522079289 524673879 526161075 526842952 527280688
815.8 527280688 527782857 528062284 527532578 525839925 523109674 519994915 517238975 515002429 512853980
834.2E12853980k599537l125072l218710k790571k090841j446843j059503r71436r83715
852.5D94567752q13425l78966L84688J765132L591419M965364N559087N904854O083130
870.9E21629035N593062M125059J847684o14405k557397l714501m364551m839480n277872
889.3E11826634n689799n853176n563051n033910m783988n137176o005913p012069
905.6D66747552p658571p694006p336050o902754o436438n787045m771202l401876
921.9D16759610k019435j036316o34790o52492p72208p72595n66065k39730j45793
940.2D09920186p62433k401292m823238p132679q584291r278178r714574j0127693
956.6C57095808j0454864j0572552j0456473j0195017r901493r606123r198547q538514
$$ plain form
834.2 512853980 510254443 507129371 503910661 501120090 499029249 497582406 496522903 495551467 494567752
852.5 494567752 493754327 493375361 493760049 495525181 499116600 504081964 509641051 515545905 521629035
870.9 521629035 527222097 531347156 533194840 532580435 530023038 526308537 521943986 517104506 511826634
889.3 511826634 506136835 500283659 494720608 489686698 484902710 479765534 473759621 466747552
905.6 466747552 459088981 451394975 444058925 437156171 430719733 424932688 420161486 416759610
921.9 416759610 414740175 413703859 413069069 412416577 411644369 410871774 410305709 410065979 409920186
940.2 409920186 409157753 406756461 401933223 394800544 386216253 376938075 367223501 357095808
956.6 357095808 346640944 336068392 325611919 315416902 305515409 295909286 286710739 278172225
972.9B78172225p571072o348222n051166l908575l082692k591431k266467j951978
989.2B45400622j606464j293138j090303r05826o45027l34754o7533n7011m35844j042501
1009.6B37922221j606181j946747k036989j948863j844287j904741k125412k353683
1025.9B22155318k469033k378971k126574j982868k068192k221644k260521k152264
1042.2B04495251j941904j654670j303881q81672m38497Q583N12913J024962J461312
1060.6B01282397J846224K076164J850664R69589k96265j146257r81628R149J232728
1078.9B06842765K330110L239110L972381M497484M721179M602224M250049L751025
1095.2B38206327L115758K472937J938150J586333J523018J724168K039343K369881
$$ plain form
972.9 278172225 270601153 264252931 259201765 255293190 252210498 249619067 247352600 245400622
989.2 245400622 243794158 242501020 241410717 240504891 239859864 239525110 239457577 239400566 238964722 237922221
1009.6 237922221 236316040 234369293 232332304 230383441 228539154 226634413 224509001 222155318
1025.9 222155318 219686285 217307314 215180740 213197872 211129680 208908036 206647515 204495251
1042.2 204495251 202553347 200898677 199594796 198713124 198274627 198283210 198796123 199821085 201282397
1060.6 201282397 203128621 205204785 207055449 208025038 207728773 206582516 205600888 205610037 206842765
1078.9 206842765 209172875 212411985 216384366 220881850 225603029 230205253 234455302 238206327
1095.2 238206327 241322085 243795022 245733172 247319505 248842523 250566691 252606034 254975915
1111.6B54975915K655089K785802K675354K317608J841873J530170J609385K038151
1127.9B72429347K573371K868086K694637K130091J385510O63131J22696k52485n70088
1146.2B84044296p66844p32780m20629J79857R72211J811713K607226L356666M052192
1164.6B95103908M623174N100191N634427O243736O766587P088155P247269P288545
1180.9C45095992P127106O638408N854934M867673L717453K526939J428514M52549
1197.2C77709568l68238j002639j422316j493931j201749p72059n13732n86391q64237
1215.6C69484276j111478j234412j334995j525253j809270k103358k306491k309293
1231.9C55749726k037674j549184r93550m66704K6404N57155J179129J788109K261490
$$ plain form
1111.6 254975915 257631004 260416806 263092160 265409768 267251641 268781811 270391196 272429347
1127.9 272429347 275002718 277870804 280565441 282695532 284081042 284744173 284866869 284614384 284044296
1146.2 284044296 283277452 282544672 282124043 282303900 283276111 285087824 287695050 291051716 295103908
1164.6 295103908 299727082 304827273 310461700 316705436 323472023 330560178 337807447 345095992
1180.9 345095992 352223098 358861506 364716440 369584113 373301566 375828505 377257019 377709568
1197.2 377709568 377341330 376338691 374916375 373422444 372220695 371448636 370934904 370348513 369484276
1215.6 369484276 368372798 367138386 365803391 364278138 362468868 360365510 358059019 355749726
1231.9 355749726 353712052 352162868 351169318 350702614 350729018 351286173 352465302 354253411 356514901
1250.3C56514901K534598K617061K570719K498179K475709K489179K519370K489566
1266.6C76709282K341658K101839J809150J525462J320332J170993J040578R59426
1282.9C88978720R86784J116783J178920J003504N29021k08408j038491j665026j942158
1301.2C88939649k012462k092063k184004k148866j901448j394302o97791K2083N02050
1319.6C77032846N70506K34574m30137j190394j794159k197564k419949k383053k088338
1338C65334332j596302j044690o34104n26339p43330j163155j594036j876831k013654
1356.3C54141891k156973k558499l316462m101187m470706m315287l629417l192126
1372.6C26401234l508509m004448m377574m675388m622549l969222k914161j758605
$$ plain form
1250.3 356514901 359049499 361666560 364237279 366735458 369211167 371700346 374219716 376709282
1266.6 376709282 379050940 381152779 382961929 384487391 385807723 386978716 388019294 388978720
1282.9 388978720 389965504 391082287 392261207 393264711 393793732 393585324 392546833 390881807 388939649
1301.2 388939649 386927187 384835124 382651120 380502254 378600806 377206504 376508713 376530796 377032846
1319.6 377032846 377603352 377837926 377407789 376217395 374423236 372225672 369805723 367422670 365334332
1338 365334332 363738030 362693340 362059236 361532897 360789567 359626412 358032376 356155545 354141891
1356.3 354141891 351984918 349426419 346109957 342008770 337538064 333222777 329593360 326401234
1372.6 326401234 322892725 318888277 314510703 309835315 305212766 301243544 298329383 296570778
1388.9B96570778r20206n38171l34620k3067L90291Q46088J313388J797617K129167
1407.3C01231265K318621K501636K579660K561152K730816L172338L132135K942383
1423.6C23170006K815753K284349J479446N45323k69562q51750q93027l38584Q3685
1442C28025639K01911K45690L15905L14980K77699O51985J986235L514886L489465
1460.3C39024395L262549L657073M135817M718006O346047Q910418R425819P672429
1476.6C87152553N806982L908754J923471j46776k181918m271745n962551o382734
1493C79846036p073998q593678q797080p865339p314682q924306j2431800j1413276
1509.3C07431877r390504q886188p628798n578846l563881k951205l136933l237545
$$ plain form
1388.9 296570778 295650572 295112401 294777781 294754714 295145005 295991093 297304481 299102098 301231265
1407.3 301231265 303549886 306051522 308631182 311192334 313923150 317095488 320227623 323170006
1423.6 323170006 325985759 328270108 329749554 330294877 330025315 329173565 328280538 327941954 328025639
1442 328025639 328227550 328473240 328789145 329104125 329381824 330033809 332020044 335534930 339024395
1460.3 339024395 342286944 345944017 350079834 354797840 361143887 370054305 379480124 387152553
1476.6 387152553 392959535 396868289 398791760 398644984 396463066 392191321 386228770 379846036
1493 379846036 372772038 364178360 355381280 347515941 340201259 331276953 318845153 307431877
1509.3 307431877 298041373 289155185 281526387 275947541 272383660 269432455 266295522 263057977
1525.6B63057977l386080k995193k640575k604396k052992j454324j354649p62895
1541.9B45806873K99975J157552J949012K811954L582954M111380M364252N507320
1558.2B69591272O479412M714221L951549M011065L902436L758192L014475K536863
1574.5C01959485K488047J857280J180798P93964N20468K35378j41233p16954j348973
1592.9C06828260k014756k634555l309160m191727n094886n878061o705224p729233
1609.2B69270658q365690q461207r425938j1223317j0392517r865447j1247576j1050060
1625.5A89238906r984896r299740q039579p279589p315204n212650k517059j112685
1641.8A38477504k99632M16264J084610J257644J684695K679750K766967K819091L594458
$$ plain form
1525.6 263057977 259671897 256676704 254036129 251431733 249378741 247924417 246569768 245806873
1541.9 245806873 246106848 247264400 249213412 252025366 255608320 259719700 264083952 269591272
1558.2 269591272 276070684 280784905 284736454 288747519 292649955 296408147 299422622 301959485
1574.5 301959485 304447532 306304812 307485610 308279574 308800042 309035420 308894187 308177233 306828260
1592.9 306828260 304813504 302178949 298869789 294678062 289583176 283705115 276999891 269270658
1609.2 269270658 260904968 252443761 243017823 231794506 221401989 211536542 200288966 189238906
1625.5 189238906 179254010 169954270 161914691 154635102 147319898 142107248 139590189 138477504
1641.8 138477504 138177872 138594136 139678746 140936390 142621085 145300835 148067802 150886893 154481351
1660.2A54481351M689828N494431N503952O242827P373839P099718P407442Q188411
1676.5B06481799P897541P731483Q983880J1686161J1377990J0379643J1755764J2810588
1692.8B89104849J5856773J8802225J9205243K1095395J7844975J4953077J4846086
1707.1D11708623J2880027J0901720R535551Q685350Q605510P607907N903840N158693
1723.4D80987221M787356M168182L740013L449589L789246L970385L448009L718436
1739.7E12058437M360258M820407N492151O361067P396698P938802P364691P167339
1756.1E62959850P259786O912589O893873O391943N665958N419433N167246N142748
1772.4F11813426M819453M005372L595293L450990L249585L100872K949655K637327
$$ plain form
1660.2 154481351 159171179 164665610 170169562 176412389 183786228 190885946 198293388 206481799
1676.5 206481799 214379340 222110823 231094703 242780864 254158854 264538497 276294261 289104849
1692.8 289104849 304961622 323763847 342969090 364064485 381909460 396862537 411708623
1707.1 411708623 424588650 435490370 445025921 453711271 462316781 469924688 475828528 480987221
1723.4 480987221 485774577 489942759 493682772 497132361 500921607 504891992 508340001 512058437
1739.7 512058437 516418695 521239102 526731253 533092320 540489018 548427820 555792511 562959850
1756.1 562959850 570219636 577132225 584026098 590418041 596083999 601503432 606670678 611813426
1772.4 611813426 616632879 620638251 624233544 627684534 630934119 634034991 636984646 639621973
1788.7F39621973K390146K457977K409696K240062K190351K194107K092302J895428
1805F57492042J781582J787961J854002J799345J667500J566470J528799J498580J548410
1823.4F72524691J616418J447916J292586J285911J236558J205981J242518J163244
1839.7F83015823R87053R28879R89318R87887J007736J013875R03547P88569P20322
1858F91343009P23005P65800Q03531P44819O52254O50286O58513O94274P67529P85172
1878.4F98588192O99282N96166N48601N76913O94633P86841P23123N85616M76718M41670
1898.8G04717755N25356O15060N99563M91858L74555L17753L30567M07755N18143N46277
1919.2G09444642L88324K45691K50995L06666L63290M03523L49880J90377J01387J20879
$$ plain form
1788.7 639621973 642012119 644470096 646879792 649119854 651310205 653504312 655596614 657492042
1805 657492042 659273624 661061585 662915587 664714932 666382432 667948902 669477701 670976281 672524691
1823.4 672524691 674141109 675589025 676881611 678167522 679404080 680610061 681852579 683015823
1839.7 683015823 684002876 684931755 685921073 686908960 687916696 688930571 689834118 690622687 691343009
1858 691343009 692066014 692831814 693635345 694380164 695032418 695682704 696341217 697035491 697803020 698588192
1878.4 698588192 699287474 699883640 700432241 701009154 701703787 702490628 703213751 703799367 704276085 704717755
1898.8 704717755 705243111 705858171 706457734 706949592 707324147 707641900 707972467 708380222 708898365 709444642
1919.2 709444642 709832966 710078657 710329652 710636318 710999608 711403131 711753011 711943388 712044775 712165654
1939.6G12165654K11179L52502L79920K61724J62482J55568K26617L41892M00722L61383
1960G15019643K59281J60276J25826K11775L16262L28660K85387J85132Q3387O9380
1980.4G17045009J50502K28286K35319J57416N1260J5080O1273J50562K19941J87456
2000.8G18502104L5763j13308j65224r3937J9252K8610r3698k22743k86519k96712
2021.2G17313588k13504j21355j18375k05934l30269m00961l19242j42157n3049j02043
2041.6G15306699k22802l09825k83956j14262P6472J46985P4685p1764j61707r5904
2062G14344621R2089K47061K41518P1228j02938j27315J8716J90437K30193J21712
2082.4G15327322m3928j41382q6964J00732K61247K71082J34170k9385q5353L7491
$$ plain form
1939.6 712165654 712376833 712729335 713109255 713370979 713533461 713689029 713915646 714257538 714658260 715019643
1960 715019643 715278924 715439200 715565026 715776801 716093063 716421723 716707110 716892242 716975629 717045009
1980.4 717045009 717195511 717423797 717659116 717816532 717867792 717882872 717944145 718094707 718314648 718502104
2000.8 718502104 718537867 718424559 718259335 718165398 718184650 718213260 718119562 717896819 717610300 717313588
2021.2 717313588 717100084 716978729 716860354 716654420 716324151 715923190 715603948 715461791 715408742 715306699
2041.6 715306699 715083897 714774072 714490116 714375854 714452326 714599311 714673996 714602232 714440525 714344621
2062 714344621 714436710 714683771 714925289 714996517 714893579 714766264 714784980 714975417 715205610 715327322
2082.4 715327322 715283394 715142012 715055048 715155780 715417027 715688109 715822279 715792894 715707541 715745032
2102.8G15745032K41816L23236K35438O2049o2764n8472N3167K00629K68162J40965
2123.2G17149258p3612j42336k3842J51932K60354K59399J21474n6147r1494L1889
2143.6G17586875J84178K55406J95146O5446j3113K7597K03609M02689M52340L04997
2164G19665170J38461J19925K52068M62234N94735N38588L52680K01643K03788L45469
2184.4G22874761M81963N13077M25756K71618J82152K20358L71099N03420M76480L17931
2204.8G26638615J45614R0421K22802M21405M91678L96431K14100P5399Q1599K08378
2225.2G28986442L47018L65854J99496k2053r1195J8715K04802L17037K49207O2049
2245.6G30637372r5547j20103J8418K00629K33948J15454m5597j50502j17361L2007
$$ plain form
2102.8 715745032 715986848 716310084 716545522 716607571 716544807 716486335 716539502 716740131 717008293 717149258
2123.2 717149258 717075646 716933310 716909468 717061400 717321754 717581153 717702627 717646480 717554986 717586875
2143.6 717586875 717771053 718026459 718221605 718287051 718273938 718301535 718505144 718907833 719360173 719665170
2164 719665170 719803631 719923556 720175624 720637858 721232593 721771181 722123861 722325504 722529292 722874761
2184.4 722874761 723356724 723869801 724295557 724567175 724749327 724969685 725340784 725844204 726320684 726638615
2204.8 726638615 726784229 726874650 727097452 727518857 728010535 728406966 728621066 728696465 728778064 728986442
2225.2 728986442 729333460 729699314 729898810 729876757 729785562 729804277 730009079 730326116 730575323 730637372
2245.6 730637372 730541825 730421722 730440140 730640769 730874717 730990171 730944574 730794072 730676711 730708718
2265.9G30708718J79291K23160J15692j05440k42949j39117Q4937J94728Q9049j75595
2286.3G30932474l82542l75987k00390j0908K6345j11460l33965m75169m32252k90096
2306.7G28346050j73032j53482k80261m96984o37710n95152l99948k27332k59459m69744
2327.1G24652946n79953m83871l18825j90377k25306l81350m68374l63647k6703Q8334
2347.5G21702874k45154o39558r39727j070320q38459m46916j53541N4955J00017p6354
2367.9G17447817j25825M9353K04145K60115J75655j8895k07424k91824k72751k35081
2388.3G16985285k61128l80814n52952o75082o56188n04017l78072l99053n51224p72297
2408.7G11854458q65579p44641n84900n27561n91755p52627r02176r12965p88271o56009
$$ plain form
2265.9 730708718 730888009 731111169 731226861 731121421 730878472 730739355 730824292 731019020 731108069 730932474
2286.3 730932474 730549932 730173945 729973555 729962647 729988992 729877532 729543567 729068398 728636146 728346050
2306.7 728346050 728173018 728019536 727739275 727242291 726604581 726009429 725609481 725382149 725122690 724652946
2327.1 724652946 724072993 723589122 723270297 723079920 722854614 722473264 722004890 721641243 721614540 721702874
2347.5 721702874 721457720 720818162 719878435 718808115 717969656 717522740 717369199 717424154 717524171 717447817
2367.9 717447817 717321992 717371345 717575490 717835605 718011260 717992365 717784941 717493117 717220366 716985285
2388.3 716985285 716724157 716343343 715790391 715115309 714459121 713955104 713577032 713177979 712626755 711854458
2408.7 711854458 710988879 710244238 709659338 709131777 708540022 707787395 706885219 705972254 705183983 704527974
2429.1G04527974o55234p61986q71956r22918q85546p95663p08520p08699q36730r61960
2449.5F96418762r59396q46327p14540o88612p83980r12011r75072q91567p46905o59287
2469.9F88241065o70672p95305r24229r43840q60453p38322o66678p07686q28207r00924
2490.3F80204749q38756p12812o34194o51002p37250q04007q15689p61509o54340n88894
2510.7F73006296o39796p73132q63135q15928p12871o72996o70255o96838p86006q74579
2531.1F65500760q82924q20338p76410p84696q08477q45075q75890q50439p94828p50840
2551.5F57310843p22408p67827q55446q55565q05378p53045o97374p14302p82609q19326
2571.9F49537563q32140q21889p68959p35641p71045q37624q64804q32260q02219p84397
$$ plain form
2429.1 704527974 703872740 703110754 702238798 701315880 700430334 699634671 698926151 698217452 697380722 696418762
2449.5 696418762 695459366 694613039 693898499 693209887 692425907 691513896 690538824 689647257 688900352 688241065
2469.9 688241065 687570393 686775088 685850859 684907019 684046566 683308244 682641566 681933880 681105673 680204749
2490.3 680204749 679365993 678653181 678018987 677367985 676630735 675826728 675011039 674249530 673595190 673006296
2510.7 673006296 672366500 671593368 670730233 669914305 669201434 668528438 667858183 667161345 666375339 665500760
2531.1 665500760 664617836 663797498 663021088 662236392 661427915 660582840 659706950 658856511 658061683 657310843
2551.5 657310843 656588435 655820608 654965162 654109597 653304219 652551174 651853800 651139498 650356889 649537563
2571.9 649537563 648705423 647883534 647114575 646378934 645607889 644770265 643905461 643073201 642270982 641486585
2592.3F41486585p62284p84814q66532r33409r25422q68678q65936r42111j007617
2610.6F33529782j086056j172960j150667j091958j137971j222849j268566j305282
2626.9F24093473j317024j273990j244783j269162j323283j394391j416743j365661
2643.3F13488436j292885j259744j303673j368820j374126j336693j314462j299798
2659.6F02938235j283705j284481j308500j327992j287162j217783j206696j233518
2675.9E92788398j245677j226783j170516j130223j129628j110911j105308j177013
2692.2E83492339j260400j298845j298070j265526j257956j297652j375676j466453
2708.5E72971761j487195j435101j410604j429677j438498j466334j501203j450658
$$ plain form
2592.3 641486585 640724301 639939487 639072955 638139546 637214124 636345446 635479510 634537399 633529782
2610.6 633529782 632443726 631270766 630120099 629028141 627890170 626667321 625398755 624093473
2626.9 624093473 622776449 621502459 620257676 618988514 617665231 616270840 614854097 613488436
2643.3 613488436 612195551 610935807 609632134 608263314 606889188 605552495 604238033 602938235
2659.6 602938235 601654530 600370049 599061549 597733557 596446395 595228612 594021916 592788398
2675.9 592788398 591542721 590315938 589145422 588015199 586885571 585774660 584669352 583492339
2692.2 583492339 582231939 580933094 579635024 578369498 577111542 575813890 574438214 572971761
2708.5 572971761 571484566 570049465 568638861 567209184 565770686 564304352 562803149 561352491
2724.8E61352491j347720j296819j275420j252412j276374j298726j255691j212299
2741.2E51137030j192570j176715j193284j204849j173973j164257j175046j148403
2757.5E41707933j127899j168489j231730j249314j210212j173973j196266j263856
2773.8E32086194j343847j411378j427889j419306j460492j564205j653910j673102
2790.1E20132065j682282j733899j783550j793027j822054j911163k024591k109826
2806.4E05271673k109349k078533k129525k239972k331048k387017k421707k446473
2822.7D87128049k506196k676964k900005l050237l178746l361404l636092m094928
2839.1D61723477m761994n564958o388962p023991p147729o562680n363375l911227
$$ plain form
2724.8 561352491 560004771 558707952 557432532 556180120 554903746 553605020 552349329 551137030
2741.2 551137030 549944460 548767745 547574461 546369612 545195639 544031382 542856336 541707933
2757.5 541707933 540580034 539411545 538179815 536930501 535720289 534546316 533350050 532086194
2773.8 532086194 530742347 529330969 527903080 526483774 525023282 523459077 521805167 520132065
2790.1 520132065 518449783 516715884 514932334 513139307 511317253 509406090 507381499 505271673
2806.4 505271673 503162324 501083791 498954266 496714294 494383246 491996229 489574522 487128049
2822.7 487128049 484621853 481944889 479044884 475994647 472815901 469454497 465818405 461723477
2839.1 461723477 456961483 451396525 445007563 437983572 430835843 424273163 418909788 414998561
2855.4D14998561k716541k183408k399802l112763l955096m589856m738927m313022
2871.7C86989146l429770k403975j598894j109868q82864r09031j089334j293838j487375
2890.1C72784197j710772j990289k268105k498270k711415k950251l255755l664165
2906.4C51735175m157126m700691n240768n668551n871653n779892n330712m521966
2922.7C10463816l472149k261848r79840K48849J417786K518833L493845M238337M573375
2941C20241004M439771L934235L153622K220660J335502O98328M60833P01815J359880
2959.4C38545650K241731L155738M030496M825592N472660N943745O211907O241053
2975.7C76668572O093085N864710N561858N154014M628599M032582L420591K794713
$$ plain form
2855.4 414998561 412282020 410098612 407698810 404586047 400630951 396041095 391302168 386989146
2871.7 386989146 383559376 381155401 379556507 378446639 377563775 376654744 375565410 374271572 372784197
2890.1 372784197 371073425 369083136 366815031 364316761 361605346 358655095 355399340 351735175
2906.4 351735175 347578049 342877358 337636590 331968039 326096386 320316494 314985782 310463816
2922.7 310463816 306991667 304729819 303749979 303998828 305416614 307935447 311429292 315667629 320241004
2941 320241004 324680775 328615010 331768632 333989292 335324794 336023122 336483955 337185770 338545650
2959.4 338545650 340787381 343943119 347973615 352799207 358271867 364215612 370427519 376668572
2975.7 376668572 382761657 388626367 394188225 399342239 403970838 408003420 411424011 414218724
2992D14218724K152264J500726Q80390L15994k26021p24405j092076j283378j310527
3010.4D14431691j263350j233846j282781j452923j682997j928300k156257k256423
3026.7D01174814k229244k214491k274931k332985k343148k382308k488375k581954
3043C82327378k615750k647281k696246k690822k671748k703190k687722k569437k442062
3061.4C58603120k326638k145201j935452j770705j682460j659453j605839j497984
3077.7C43979388j418769j400649j353026j223564j106173j033157r72301r43005r44018
3096C33584726j003117j103013j155645j178592j200498j224637j275092j361787j479745
3114.4C22602600j530469j512736j559376j647890j715273j791358j871615j902223
$$ plain form
2992 414218724 416370988 417871714 418752104 419068098 418842077 418117672 417025596 415742218 414431691
3010.4 414431691 413168341 411934495 410651714 409198791 407515794 405587494 403431237 401174814
3026.7 401174814 398945570 396731079 394456148 392123163 389780015 387397707 384909332 382327378
3043 382327378 379711628 377064347 374368101 371677279 369005531 366302341 363614619 361045182 358603120
3061.4 358603120 356276482 354131281 352195829 350425124 348742664 347083211 345477372 343979388
3077.7 343979388 342560619 341159970 339806944 338583380 337477207 336444050 335471749 334528744 333584726
3096 333584726 332581609 331478596 330322951 329144359 327943861 326719224 325444132 324082345 322602600
3114.4 322602600 321072131 319559395 318000019 316352129 314636856 312845498 310973883 309071660
3130.7C09071660j917452j999020k093762k086312k030313k033025k082080k146601
3147B92683095k177120k151668k153337k209007k235711k198607k164811k186775k224684
3165.4B72981375k242624k238840k233923k253830k262205k223760k152204k125740
3181.7B55248249k153874k148360k109915k076819k046481k014995j990437j966134
3198B38741234j923710j856923j804099j791149j766160j717255j690015j683563j696736
3216.4B22811624j694813j636669j592442j611248j654148j684666j738727j800477
3232.7B09398434j804904j814976j865193j911715j958459k005622k051965k101794
3249A93883806k137690k165556k181575k187237k211228k202109k104982j993746j945168
$$ plain form
3130.7 309071660 307154208 305155188 303061426 300975114 298944801 296911776 294829696 292683095
3147 292683095 290505975 288354307 286200970 283991963 281756252 279557645 277392834 275206059 272981375
3165.4 272981375 270738751 268499911 266265988 264012158 261749953 259526193 257373989 255248249
3181.7 255248249 253094375 250946015 248836100 246759281 244712800 242697805 240707368 238741234
3198 238741234 236817524 234960601 233156502 231365353 229599193 227881938 226191923 224508360 222811624
3216.4 222811624 221116811 219480142 217887700 216276452 214622304 212937638 211198911 209398434
3232.7 209398434 207593530 205778554 203913361 202001646 200043187 198037565 195985600 193883806
3249 193883806 191746116 189580560 187398985 185211748 183000520 180798411 178693429 176699683 174754515
3267.4A74754515j893937j774386j645341j513794j351148j185656j027867r12383
3283.7A63450003q11652o97344o11395n03376l69251k76401j85341r4712p1525o9917
3304.1A59759089l1814L6791J11878J62989K00778K33502K14219J69426J84953K40699
3324.5A61282510K54273K53707K87861K67491K26676K22728J57639N7668L0517N3480
3344.9A63094550P3612J02967Q1986N618j0610O870k1741q106M6894M8235L0935n693
3369.3A63445517q5994j02446l472P0602N3674L5420O5565P8127R3803J46687J43081
3391.8A63940564J08897J25319J90273K69771K56598J72213K29507L35723L18498L17529
3412.2A66264892L93465M42907M43161M42817N31584O86437P69720Q01742Q06242Q71956
$$ plain form
3267.4 174754515 172860578 171086192 169440851 167927057 166575909 165390253 164362386 163450003
3283.7 163450003 162638351 161941007 161329612 160826236 160456985 160180584 159995243 159900531 159829006 159759089
3304.1 159759089 159727275 159764066 159875944 160038933 160239711 160473213 160687432 160856858 161041811 161282510
3324.5 161282510 161536783 161790490 162078351 162345842 162572518 162795246 162952885 163010553 163041070 163094550
3344.9 163094550 163168162 163271129 163353115 163358733 163348123 163354993 163333252 163325146 163372040 163420275 163451210 163445517
3369.3 163445517 163359523 163257077 163253605 163324207 163377881 163413301 163478866 163556993 163650796 163797483 163940564
3391.8 163940564 164049461 164174780 164365053 164634824 164891422 165063635 165293142 165628865 165947363 166264892
3412.2 166264892 166658357 167101264 167544425 167987242 168518826 169205263 169974983 170776725 171582967 172454923
3432.6A72454923R64180Q74117P54044Q36685R86948J051277J088113J090646J103431
3450.9A81204364J174152J252681J308530J321167J290232J318261J456410J557737
3467.2A91883534J491279J353368J390412J558766J701012J753345J709938J701981
3483.6B04543635J799301J907229J925707J871615J857132J932189J962021J975671
3499.9B19774500K013579J956358J907081K011120K109662K144187K190784K189413
3516.2B36296684K203092K267271K351686K371326K317131K335295K429426K520561
3532.5B55092472K629071K670467K604097K643526K817213K978236K928197K778083
3548.8B77141362K827973L009617L112584L158719L242880L300190L260612L355146
$$ plain form
3432.6 172454923 173419103 174293220 175047264 175883949 176870897 177922174 179010287 180100933 181204364
3450.9 181204364 182378516 183631197 184939727 186260894 187551126 188869387 190325797 191883534
3467.2 191883534 193374813 194728181 196118593 197677359 199378371 201131716 202841654 204543635
3483.6 204543635 206342936 208250165 210175872 212047487 213904619 215836808 217798829 219774500
3499.9 219774500 221788079 223744437 225651518 227662638 229772300 231916487 234107271 236296684
3516.2 236296684 238499776 240767047 243118733 245490059 247807190 250142485 252571911 255092472
3532.5 255092472 257721543 260392010 262996107 265639633 268456846 271435082 274363279 277141362
3548.8 277141362 279969335 282978952 286091536 289250255 292493135 295793325 299053937 302409083
3565.1C02409083L795266L951877L690362L669620L856420L937155M037142M153907
3581.5C33500832M121512M195482M469752M491091M268199M378617M648626M702240
3597.8C68776351M668176M661501M592001M524499M745633M957914M893303M746407
3614.1D06565785M557431M779637N262852N055278M568756M494339N181372N574882
3630.4D46040332M842490M585296M715949M676044M627020M514575M291415M313052
3646.7D82606173M869639N000622M207611L897637M307985M279852L905296L732384
3663E16807199L575444L377259L534019L699123L261209L307342L453196K927720K642632
3681.4E46585143K603054K548873K682328K813459K459109K073645K000630J994610
$$ plain form
3565.1 302409083 306204349 310156226 313846588 317516208 321372628 325309783 329346925 333500832
3581.5 333500832 337622344 341817826 346287578 350778669 355046868 359425485 364074111 368776351
3597.8 368776351 373444527 378106028 382698029 387222528 391968161 396926075 401819378 406565785
3614.1 406565785 411123216 415902853 421165705 426220983 430789739 435284078 440465450 446040332
3630.4 446040332 450882822 455468118 460184067 464860111 469487131 474001706 478293121 482606173
3646.7 482606173 487475812 492476434 496684045 500581682 504889667 509169519 513074815 516807199
3663 516807199 520382643 523759902 527293921 530993044 534254253 537561595 541014791 543942511 546585143
3681.4 546585143 549188197 551737070 554419398 557232857 559691966 561765611 563766241 565760851
3697.7E65760851J960814K009094J989245J821160J738131J815975J910210J718223
3714E80723703J410484J302004J330078J364350J304686J238048J204133J182795J307428
3732.4E92367709J443505J368880J048088O96719P66099J299977J336098J022338J131118
3750.7F02480531J081109Q20339Q30829J012981J014828Q24273P64131P84398Q46445
3769.1F10459864R14395Q14140P46786Q24154Q45909P34448O84679P48217P57873P54416
3789.5F18284881P11084N43236N06461N45680N91517Q92878Q58664N97954O48558N65410
3809.9F24746323M31835N07415P08520O05106M07398N75423N63860M88103N37157M81188
3830.3F30052328M22001M15623M97282O30140N75364M65154M06802K95222K02060J95205
$$ plain form
3697.7 565760851 567721665 569730759 571720004 573541164 575279295 577095270 579005480 580723703
3714 580723703 582134187 583436191 584766269 586130619 587435305 588673353 589877486 591060281 592367709
3732.4 592367709 593811214 595180094 596228182 596924901 597691000 598990977 600327075 601349413 602480531
3750.7 602480531 603561640 604381979 605212808 606225789 607240617 608064890 608829021 609613419 610459864
3769.1 610459864 611374259 612188399 612935185 613759339 614605248 615339696 616024375 616772592 617530465 618284881
3789.5 618284881 618995965 619539201 620045662 620591342 621182859 622075737 622934401 623532355 624180913 624746323
3809.9 624746323 625178158 625685573 626394093 626999199 627406597 627982020 628545880 629033983 629571140 630052328
3830.3 630052328 630474329 630889952 631387234 632017374 632592738 633057892 633464694 633759916 633961976 634157181
3850.7F34157181N65827R13798M42267J16169J85371L50594M90666L49104K61605M47273
3871.1F38279855M41432L24250J85668K07484M01854L83437L67045K73526J25051K89261
3891.5F41278863L64661J62423O4432J35541K45989L63350L72231K11537J08122R0301
3911.9F43397450Q2314J17779J75119K01821J74165J77264J72198O3240L2664K17139
3932.3F44811153L38555K16067O2227L2186J12534J52171J37686K00987K13444J02759
3952.7F46379769P8738J37627J39236J40131J77979J73092J30355J19269J22011J12653
3973.1F47710860J03235J21951J45078J13845N2213M0234Q4102J21593J60277K02835
3993.4F48856223J91271J54972
$$ plain form
3850.7 634157181 634723008 635636806 636079073 636195242 636380613 636731207 637221873 637570977 637832582 638279855
3871.1 638279855 638721287 639045537 639231205 639438689 639840543 640223980 640591025 640864551 640989602 641278863
3891.5 641278863 641643524 641805947 641870379 642005920 642251909 642615259 642987490 643199027 643307149 643397450
3911.9 643397450 643479764 643597543 643772662 643974483 644148648 644325912 644498110 644561350 644594014 644811153
3932.3 644811153 645149708 645365775 645428002 645460188 645572722 645724893 645862579 646063566 646277010 646379769
3952.7 646379769 646458507 646596134 646735370 646875501 647053480 647226572 647356927 647476196 647598207 647710860
3973.1 647710860 647814095 647936046 648081124 648194969 648247182 648287416 648371518 648493111 648653388 648856223
3993.4 648856223 649047494 649202466
3997.5F49202466
$$ plain form
3997.5 649202466
##END=$$ End of the data block
