##TITLE=G17-51-CE $$ Begin of the data block
##JCAMP-DX=5.00 $$ ACD/SpecManager v 10.08
##SPECTROMETER/DATA SYSTEM=Alpha
##DATE=23 Oct 2013 10:11:40
##DATA TYPE=INFRARED SPECTRUM
##DATA CLASS=XYDATA
##ORIGIN=
##OWNER=
##NPOINTS=1765
##FIRSTX=399.75695801
##LASTX=3997.56933594
##MAXX=3997.56933594
##MINX=399.75695801
##MAXY=0.73188615
##MINY=0.13851617
##XFACTOR=1.0000000000
##YFACTOR=1.000000000000000e-9
##FIRSTY=0.44585824
##DELTAX=2.03957629
##XUNITS=1/CM
##YUNITS=ARBITRARY UNITS
##XYDATA=(X++(Y..Y))
399.8D45858240l146380j823396j526475j035332n30333m33355l07262o5178j09523
418.1D36881006r85593k030223k268464j900047j475870j440943j757473j947581j551122
436.5D21523690o09815N85049J412422J550764J025051k15441j122654j168579j127332
454.8D21853155j382113j914352k605319l016561k726615k301663k321869k561271
471.1D03023392k658039k352506j889825j464039r22263n89877q27939j280546j699596
489.5C89338762k037228k162933k125472k192020k579183l089398l254980l153801
505.8C68743747l231138Tk981275k811104k808899k696931k291292j816243j384556
524.2C45491171r45896m63039J1504M59999J126766J957834K465904K411514J893133
$$ y = [445858240, 442711860, 440888464, 439361989, 438326657, 437796324, 437362969, 437055707, 436990529, 436881006, 435895413, 433865190, 431596726, 429696679, 428220809, 426779866, 425022393, 423074812, 421523690, 420913875, 421498924, 422911346, 424462110, 425487161, 425271720, 424149066, 422980487, 421853155, 420471042, 418556690, 415951371, 412934810, 410208195, 407906532, 405584663, 403023392, 400365353, 398012847, 396123022, 394658983, 393736720, 393146843, 392318904, 391038358, 389338762, 387301534, 385138601, 383013129, 380821109, 378241926, 375152528, 371897548, 368743747, 365512609, 362281471, 359300196, 356489092, 353680193, 350983262, 348691970, 346875727, 345491171, 344545275, 344082236, 344093740, 344553739, 345680505, 347638339, 350104243, 352515757, 354408890]
542.5C54408890J063108K50817k58059n13672p37012j111477j486034j670986j776814
560.9C48168761j913995k052575k252281k376020j959473j030892r0122Q08060J740813
579.2C39042276K439320K778709K698809K298385J805097J271307P65562L44724n4985
597.6C53389204l43234k71171M5746K44797K78264K05696L2365n5999J63675P57396
618C54446739J444161J981884K360463K450019K382696K429873K477676K278238J905113
636.3C74156862J471133J080453R98944J218647J231879Q18073K87742r2149j79797
654.7C80991787k3127J75327L46095L70085J66267P2807O23167J227051J452267J629472
675.1C87031198J574933J338095J180023J188606J186072J029909O04212j04367q44330
$$ y = [354408890, 355471998, 355722815, 355464756, 354951084, 354214072, 353102595, 351616561, 349945575, 348168761, 346254766, 344202191, 341949910, 339573890, 337614417, 336583525, 336493403, 337301463, 339042276, 341481596, 344260305, 346959114, 349257499, 351062596, 352333903, 353099465, 353444189, 353389204, 353045970, 352774799, 352820545, 353065342, 353343606, 353549302, 353581667, 353525668, 353689343, 354446739, 355890900, 357872784, 360233247, 362683266, 365065962, 367495835, 369973511, 372251749, 374156862, 375627995, 376708448, 377707392, 378926039, 380157918, 380975991, 381263733, 381171584, 380991787, 380968660, 381143987, 381490082, 381860167, 382026434, 382099241, 382722408, 383949459, 385401726, 387031198, 388606131, 389944226, 391124249, 392312855, 393498927, 394528836, 395133048, 395028681, 394184351]
693.5C94184351j207769r98318k67536O49244J309365J650065K000481K618849L354669
711.8D03293401L843546L893733L797352M036784M554123N019903N250424M967750
728.1D38657016M226297L287732K457202K082407J940072J571417R06139K19971k22981
746.5D55125272k58922m1604M8488k83629r32544j432121j421839p72178L65704J667321
766.9D52063948K807736L650308M270315M873961N456925N699217N337477M411250
783.2D88571137L301531K482683K216845K335907K529621K557337K493977K620519
799.5E09109557K986908L476143L788888L506362K540112J402616O50049M20093M56989
817.9E28337717K34842n49137j623988k611936l104269k858222k378106k295911k656102
$$ y = [394184351, 392976582, 391978264, 391710728, 392359972, 393669337, 395319402, 397319883, 399938732, 403293401, 407136947, 411030680, 414828032, 418864816, 423418939, 428438842, 433689266, 438657016, 442883313, 446171045, 448628247, 450710654, 452650726, 454222143, 455128282, 455348253, 455125272, 454866350, 454824746, 454873234, 454589605, 453657061, 452224940, 450803101, 450030923, 450396627, 452063948, 454871684, 458521992, 462792307, 467666268, 473123193, 478822410, 484159887, 488571137, 491872668, 494355351, 496572196, 498908103, 501437724, 503995061, 506489038, 509109557, 512096465, 515572608, 519361496, 522867858, 525407970, 526810586, 527460635, 527880728, 528337717, 528572559, 528023422, 526399434, 523787498, 520683229, 517825007, 515446901, 513150990, 510494888]
836.2E10494888l056884l122151k728581k069682j460582j100123j003772r93282q14885
854.6D94144946l28958M91888J815557L509760M888296N596578N951345O057859N504608
872.9E27631879M029214J813114n82635k550722l791690m405736m799068n236030n676448
891.3E06431878n896986n627036n048573m774213n147278o044805p035524p615477
907.6D59241986p653206p354081o907344o407112n768567m793763l449381k029389
923.9D14879143j009047o40213p17461p92295o87510n07623k67446j90020q16792k435088
944.3D06815648m771471p058144q587062r322047r723038j0135293j0488033j0602593
960.6C36127967j0468156j0163992r861499r615004r236813q549660p542223o320775
$$ y = [510494888, 507438004, 504315853, 501587272, 499517590, 498057008, 496956885, 495953113, 494959831, 494144946, 493815988, 494307876, 496123433, 499633193, 504521489, 510118067, 516069412, 522127271, 527631879, 531661093, 533474207, 532891572, 530340850, 526549160, 522143424, 517344356, 512108326, 506431878, 500534892, 494907856, 489859283, 485085070, 479937792, 473892987, 466857463, 459241986, 451588780, 444234699, 437327355, 430920243, 425151676, 420357913, 416908532, 414879143, 413870096, 413229883, 412512422, 411720127, 411032617, 410524994, 410257548, 410067528, 409250736, 406815648, 402044177, 394986033, 386398971, 377076924, 367353886, 357218593, 346730560, 336127967, 325659811, 315495819, 305634320, 296019316, 286782503, 278232843, 270690620, 264369845]
977B64369845n037665l911585l099501k587735k241835j923755j600057j314789j084551
995.3B41568372q76636o50465l67955r9644p4446m39524j047418j601234j908287j985833
1015.7B32516930j944408j879201j910418k127007k397969k480417k344042k152011
1032B15281457k065853k110049k177119k176851k092570j894653j617148j317233r47550
1050.4A98882431m93616J8403N48020J045942J482889J838267K025932J813412R62213
1068.7B08123893k95178j147359r73627L3155J230702K313956L270984M017577M506170
1087.1B21080273M718438M610911M225552L688306L118217K533838J953691J561359
1103.4B47490585J516133J745135K049059K354264K666801K844364K711773K312004
$$ y = [264369845, 259332180, 255420595, 252321094, 249733359, 247491524, 245567769, 243967712, 242652923, 241568372, 240691736, 240041271, 239673316, 239573672, 239499226, 239059702, 238012284, 236411050, 234502763, 232516930, 230572522, 228693321, 226782903, 224655896, 222257927, 219777510, 217433468, 215281457, 213215604, 211105555, 208928436, 206751585, 204659015, 202764362, 201147214, 199829981, 198882431, 198388815, 198407218, 198955238, 200001180, 201484069, 203322336, 205348268, 207161680, 208123893, 207828715, 206681356, 205707729, 205740884, 206971586, 209285542, 212556526, 216574103, 221080273, 225798711, 230409622, 234635174, 238323480, 241441697, 243975535, 245929226, 247490585, 249006718, 250751853, 252800912, 255155176, 257821977, 260666341, 263378114, 265690118]
1119.7B65690118J839727J512259J559914K002090K574742K893418K700627K102077
1136B82874972J388520P05242J21742k79575n47499p33673p42197m53622J43260R52780
1156.4B83429950J823664K637863L366053M022718M611164N136699N666256O223380
1172.7C16917747O706357P038147P236987P281035P113576O675512N903035M840642
1189.1C69713038L660470K515197J457274M90248l57031j026959j452893j518666j224041
1207.4C72256637p95126n31346n59598q10683j094311j235128j331240j538455j826197
1225.8C62534553k113730k321780k314180k015650j517952r78589m65840L7104N74023
1244.1C51417959J185924J785904K247333K532900K649486K599001K495110K469092
$$ y = [265690118, 267529845, 269042104, 270602018, 272604108, 275178850, 278072268, 280772895, 282874972, 284263492, 284968734, 285090476, 284810901, 284263402, 283529729, 282787532, 282333910, 282477170, 283429950, 285253614, 287891477, 291257530, 295280248, 299891412, 305028111, 310694367, 316917747, 323624104, 330662251, 337899238, 345180273, 352293849, 358969361, 364872396, 369713038, 373373508, 375888705, 377345979, 377836227, 377479196, 376452237, 374999344, 373480678, 372256637, 371461511, 370930165, 370370567, 369559884, 368465573, 367230445, 365899205, 364360750, 362534553, 360420823, 358099043, 355784863, 353769213, 352251261, 351272672, 350806832, 350843936, 351417959, 352603883, 354389787, 356637120, 359170020, 361819506, 364418507, 366913617, 369382709]
1260.4C69382709K490372K504378K476067K349943K110600J817137J550049J358240
1276.8C86039495J177043R98974R25601R87708J129925J204729J052827N55694k34872
1295.1C93837124j062363j657099j948505k024413k064108k161742k166003j910716
1311.4C78842175j374394o78241J1325M64588N36979K29299m00663j163691j807034
1329.8C74660343k206564k411217k389997k087474j583367j049102o39110n25415p63238
1348.1C61004859j201302j604765j843572j980185k129615k524972l338396m187495
1364.5C42194557m534542m327447l611475l180593l530949m027784m384578m675477
1380.8C09921712m588783l913134k899260j776218r03398n05656l34203k0236M24713
$$ y = [369382709, 371873081, 374377459, 376853526, 379203469, 381314069, 383131206, 384681255, 386039495, 387216538, 388215512, 389141113, 390128821, 391258746, 392463475, 393516302, 394071996, 393837124, 392774761, 391117662, 389169157, 387144744, 385080636, 382918894, 380752891, 378842175, 377467781, 376789540, 376800865, 377265453, 377802432, 378031731, 377631068, 376467377, 374660343, 372453779, 370042562, 367652565, 365565091, 363981724, 362932622, 362293512, 361768097, 361004859, 359803557, 358198792, 356355220, 354375035, 352245420, 349720448, 346382052, 342194557, 337660015, 333332568, 329721093, 326540500, 323009551, 318981767, 314597189, 309921712, 305332929, 301419795, 298520535, 296744317, 295840919, 295335263, 295001060, 294980824, 295405537]
1399.1B95405537Q71867J319051J794666K122402K320468K491623K554059K586037
1415.5C11465710K812893L205001L090560K900184K796769K289504J461505M94332
1431.8C30516458k57016p77512q99256m01228P8350K26170K50667L09020L03895K75015
1452.2C29624563P11710K127349L540903L342092L156394L645420M125029M689485
1468.5C54962945O357849Q929163R372026P596224N769640L890306J904219j59531
1484.8C98622841k186746m279494n987287o408095p079512q588999q809567p886916
1501.1C47396225p283062q816242j2368053j1450768r409040q879483p608354n520970
1517.4B76060253l489017k921790l160447l237069l355801k971857k605915k564520
$$ y = [295405537, 296277404, 297596455, 299391121, 301513523, 303833991, 306325614, 308879673, 311465710, 314278603, 317483604, 320574164, 323474348, 326271117, 328560621, 330022126, 330516458, 330259442, 329481930, 328582674, 328181446, 328259796, 328485966, 328736633, 329045653, 329349548, 329624563, 330336273, 332463622, 336004525, 339346617, 342503011, 346148431, 350273460, 354962945, 361320794, 370249957, 379621983, 387218207, 392987847, 396878153, 398782372, 398622841, 396436095, 392156601, 386169314, 379761219, 372681707, 364092708, 355283141, 347396225, 340113163, 331296921, 318928868, 307478100, 298069060, 289189577, 281581223, 276060253, 272571236, 269649446, 266488999, 263251930, 259896129, 256924272, 254318357, 251753837]
1533.7B51753837k021596j374409j247033p66248K37480J134396J976356K845749L598392
1552.1B56136924M162878M484266N611420O385505M581809L914445M006356L897578
1568.4B93181181L753722L018438K548874K467304J787722J113534P70331N42343K46614
1586.8C09430063j56552p06911j333028k029747k662092l329873m187018n072206n870074
1605.1B84082562o712020p721245q350760q453786r405971j1192113j0379970r873837
1621.4B11992860j1276916j1079192r988129r310112q056923p270709p319391n256444
1637.8A42435044k553761j117945k47165N11050J136690J272247J705288K641053K688080
1656.1A48470581K776548L595069M702672N471364N504116O305337P395774P057786
$$ y = [251753837, 249732241, 248357832, 247110799, 246344551, 246582031, 247716427, 249692783, 252538532, 256136924, 260299802, 264784068, 270395488, 276780993, 281362802, 285277247, 289283603, 293181181, 296934903, 299953341, 302502215, 304969519, 306757241, 307870775, 308641106, 309183449, 309430063, 309273511, 308566600, 307233572, 305203825, 302541733, 299211860, 295024842, 289952636, 284082562, 277370542, 269649297, 261298537, 252844751, 243438780, 232246667, 221866697, 211992860, 200715944, 189636752, 179648623, 170338511, 162281588, 155010879, 147691488, 142435044, 139881283, 138763338, 138516173, 139027223, 140163913, 141436160, 143141448, 145782501, 148470581, 151247129, 154842198, 159544870, 165016234, 170520350, 176825687, 184221461, 191279247]
1672.4A91279247P388667Q196368P893026P734359R004280J1663332J1330262J0357708
1688.8B64847249J1737734J2821078J5908271J8859148J9273967K1108895J7781854
1703C82338196J4922500J4830887J2855083J0915667R596198Q779943Q699835P601857
1719.3D70540166N818903N085916M780233M236847L821939L511876L819644L929675
1735.7E05545199L442705L772020M362822M800140N530239O407618P379174P870317
1752E49110234P321059P171631P267654O919980O889582O356418N660057N457700N232572
1770.3F07386887N195141M786670L937543L559172L455221L273130L106832K926946
1786.7F37627542K649069K481460K520800K369404K190649K173782K176583K056479
$$ y = [191279247, 198667914, 206864282, 214757308, 222491667, 231495947, 243159279, 254489541, 264847249, 276584983, 289406061, 305314332, 324173480, 343447447, 364556342, 382338196, 397260696, 412091583, 424946666, 435862333, 445458531, 454238474, 462938309, 470540166, 476359069, 481444985, 486225218, 490462065, 494284004, 497795880, 501615524, 505545199, 508987904, 512759924, 517122746, 521922886, 527453125, 533860743, 541239917, 549110234, 556431293, 563602924, 570870578, 577790558, 584680140, 591036558, 596696615, 602154315, 607386887, 612582028, 617368698, 621306241, 624865413, 628320634, 631593764, 634700596, 637627542, 640276611, 642758071, 645278871, 647648275, 649838924, 652012706, 654189289, 656245768]
1803F56245768J862943J773060J797735J861275J790344J657903J564205J531303J509488
1821.3F71594024J545548J608849J478791J319587J259387J211583J200021J229047
1837.6F82446837J169980J031101R53495R42528R36568R89378J005828R04679P92027
1856F91172421P26581P45952P96795Q25703P83145O85454O13153N96582O66202P66515
1876.4F98378503P88749P04825O07013N59807N85377O88553P72953P16806N81681M86791
1896.8G04871058M62592N24819N97239N92231M98355L85284L25322L20673L95656N28336
1917.2G09501565N45322L65079K28822K39492L16083M06027M32849L43919J85608J12534
1937.6G12677300J55628K44856L16798L19243K47776J70708J70052K39909L34561L90768
$$ y = [656245768, 658108711, 659881771, 661679506, 663540781, 665331125, 666989028, 668553233, 670084536, 671594024, 673139572, 674748421, 676227212, 677546799, 678806186, 680017769, 681217790, 682446837, 683616817, 684647918, 685601413, 686543941, 687480509, 688469887, 689475715, 690380394, 691172421, 691899002, 692644954, 693441749, 694267452, 695050597, 695736051, 696349204, 696945786, 697611988, 698378503, 699167252, 699872077, 700479090, 701038897, 701624274, 702312827, 703085780, 703802586, 704384267, 704871058, 705333650, 705858469, 706455708, 707047939, 707546294, 707931578, 708256900, 708577573, 708973229, 709501565, 710046887, 710411966, 710640788, 710880280, 711196363, 711602390, 712035239, 712379158, 712564766, 712677300, 712832928, 713077784, 713394582, 713713825, 713961601, 714132309, 714302361, 714542270, 714876831, 715267599]
1958G15267599L68058K74360J83762J38521J71661K54989L20554L24249K05040N7578
1978.4G17566371M4644J69456K60770K49565J62899N1797O973M7386J28031K06530
1998.8G18894422K02298N7876q9764j50264j11758q285L1113o2406k16543l30329l35038
2021.2G17881322k07067q3267p3195j89781l53754m28915l31997j40608k8848o5089
2041.6G15978801k11298l30389l00228j20104O4671J37508P5162o5744j53065q4579
2062G14990735R9838K40564K39551Q4043p9572j02640M888J54674K26617J32441m0412
2084.4G15950727j28865p5340J09315K79665K67982R8467m2438n0903O8248K34425
2104.8G16711283K98261K13445M9233o9499n3883R3520K37465K47180J19150o6578
$$ y = [715267599, 715635657, 715910017, 716093779, 716232300, 716403961, 716658950, 716979504, 717303753, 717508793, 717566371, 717611015, 717780471, 718041241, 718290806, 718453705, 718505502, 718512475, 718559861, 718687892, 718894422, 719096720, 719154596, 719064832, 718914568, 718802810, 718794525, 718825638, 718763232, 718546689, 718216360, 717881322, 717674255, 717590988, 717517793, 717328012, 716974258, 716545343, 716213346, 716072738, 716043890, 715978801, 715767503, 715437114, 715136886, 715016782, 715081453, 715218961, 715294123, 715228379, 715075314, 714990735, 715090573, 715331137, 715570688, 715654731, 715575159, 715472519, 715477407, 715632081, 715858698, 715991139, 715950727, 715821862, 715746522, 715855837, 716135502, 716403484, 716501951, 716459513, 716408610, 716476858, 716711283, 717009544, 717222989, 717272222, 717202723, 717148840, 717242360, 717479825, 717727005, 717846155, 717779577]
2125.2G17779577j41144j1504J84655K81811K43068Q7678o7234r1493L2008K13921
2145.6G18511343L01778K09213L8147m8638J2160K01821M12822M85301L48687J59323
2166G20631957J10924K51651M74095N71371M96149L31401J91212K11060L59595M91083
2186.4G24120498N42521M50015K43902J15872J75357L62158M98354M87745L74377K06708
2206.8G27577507R0778J67847L79205N14269M52518K38061L3140J4603K19644M11570
2227.2G30099142L74138J76668j8239r4056L636K23338L46780K49386N3346j03354
2247.6G31310785j40906m589J89900K39611J32024m0948j41442p9334N2810J50084
2268G31667995J65225N2928j33335k07722q3804J09851J94371Q3029j76847l59058
$$ y = [717779577, 717638433, 717626929, 717811584, 718093395, 718336463, 718424141, 718356907, 718265414, 718297422, 718511343, 718813121, 719022334, 719060481, 719011843, 719024003, 719225824, 719638646, 720123947, 720472634, 720631957, 720742881, 720994532, 721468627, 722039998, 722536147, 722867548, 723058760, 723269820, 723629415, 724120498, 724663019, 725113034, 725356936, 725472808, 725648165, 726010323, 726508677, 726996422, 727370799, 727577507, 727668285, 727836132, 728215337, 728729606, 729182124, 729420185, 729453325, 729467928, 729687572, 730099142, 730473280, 730649948, 730631709, 730537653, 730541289, 730764627, 731111407, 731360793, 731414139, 731310785, 731169879, 731165290, 731355190, 731594801, 731726825, 731685877, 731544435, 731465101, 731517911, 731667995, 731833220, 731886148, 731752813, 731545091, 731461287, 731571138, 731765509, 731848538, 731671691, 731312633]
2288.4G31312633l37720k00034l3974J7285j22785l28005m38094m09484k89917j65462
2308.8G29004443j34647k79308n01394n70595m92811l71218k33591k10940m04299n90145
2329.2G25215495n16951k99097k12252k67088l35395m14730l97801j16289L0935k39491
2349.6G22447336n87583q28028q78691p15316n64038l24250K2352J53303j2874j66595
2370G18545616q9348J14143K12074R5367j02341k56837l15785k84731k26081k29716
2390.4G17462361l61264n58436o82235o69121n37098l97861l96549n51999p58588q40009
2410.8G11709201p31468n78463n17011n75363p60734r52900r64820q11041o48140o11127
2431.2G04558134p23600q82447r47356q88646p91013p20203p12812q00788r28581r79483
$$ y = [731312633, 730974913, 730774879, 730740905, 730758190, 730635405, 730307400, 729869306, 729459822, 729169905, 729004443, 728869796, 728590488, 728089094, 727518499, 727025688, 726654470, 726420879, 726209939, 725805640, 725215495, 724698544, 724399447, 724187195, 723920107, 723584712, 723169982, 722772181, 722655892, 722686827, 722447336, 721859753, 721031725, 720153034, 719437718, 718873680, 718549430, 718571782, 718725085, 718712211, 718545616, 718456268, 718570411, 718782485, 718877852, 718775511, 718518674, 718202889, 717918158, 717692077, 717462361, 717101097, 716542661, 715860426, 715191305, 714654207, 714256346, 713859797, 713307798, 712549210, 711709201, 710977733, 710399270, 709882259, 709306896, 708546162, 707593262, 706628442, 705817401, 705169261, 704558134, 703834534, 702952087, 702004731, 701116085, 700325072, 699604869, 698892057, 698091269, 697162688, 696183205]
2451.5F96183205q95322p20978o30199p23601r00030r72807q76427p57039p01189p04229
2471.9F88301384p95900r18687r47356q55625p30753o76155p27534q33452r02414q66115
2492.3F80047393p46191o41644o35922p14957q06570q29399p40230o27816n99861o52611
2512.7F73052192p52628q43704q26955p12275o45578o67036p15375q12649r19640r00150
2533.1F65256202p83682p19487p45058q09849q73685r12010q85189p85351p12931p34150
2553.5F57294810q11696q73447q43823p83503p55787p12275o96778p70092q38638q29756
2573.9F49379015q05557p74085p34449p57932q29995q76188q63135p92265p30574p47443
2594.3F41467392q20875q97824r44078r35138q67188q37028r28759j028180j083613
$$ y = [696183205, 695287883, 694566905, 693936706, 693213105, 692313075, 691340268, 690463841, 689706802, 689005613, 688301384, 687505484, 686586797, 685639441, 684783816, 684053063, 683376908, 682649374, 681815922, 680913508, 680047393, 679301202, 678659558, 678023636, 677308679, 676502109, 675672710, 674932480, 674304664, 673704803, 673052192, 672299564, 671455860, 670628905, 669916630, 669271052, 668604016, 667888641, 667075992, 666156352, 665256202, 664472520, 663753033, 663007975, 662198126, 661324441, 660412431, 659527242, 658741891, 658028960, 657294810, 656483114, 655609667, 654765844, 653982341, 653226554, 652514279, 651817501, 651047409, 650208771, 649379015, 648573458, 647799373, 647064924, 646306992, 645476997, 644600809, 643737674, 642945409, 642214835, 641467392, 640646517, 639748693, 638804615, 637869477, 637002289, 636165261, 635236502, 634208322, 633124709]
2612.7F33124709j131475j119554j101971j147091j199782j265108j333058j341999
2629F23484671j287043j224220j239240j318097j383305j408219j379549j307309j259804
2647.3F11677885j289129j359046j388371j362800j337767j308262j263380j260579
2663.7F01108551j309514j331806j272083j210868j229048j241147j225054j233817
2680E91055214j212000j147271j103639j096607j120924j194716j277685j290143j246810
2698.3E80365419j242876j297831j331568j363575j420856j428902j395822j402020
2714.6E69481969j443327j483202j510977j489759j419782j338900j283943j272083
2731E58239996j278460j299917j315534j277209j200378j146257j168906j221597j217485
$$ y = [633124709, 631993234, 630873680, 629771709, 628624618, 627424836, 626159728, 624826670, 623484671, 622197628, 620973408, 619734168, 618416071, 617032766, 615624547, 614244998, 612937689, 611677885, 610388756, 609029710, 607641339, 606278539, 604940772, 603632510, 602369130, 601108551, 599799037, 598467231, 597195148, 595984280, 594755232, 593514085, 592289031, 591055214, 589843214, 588695943, 587592304, 586495697, 585374773, 584180057, 582902372, 581612229, 580365419, 579122543, 577824712, 576493144, 575129569, 573708713, 572279811, 570883989, 569481969, 568038642, 566555440, 565044463, 563554704, 562134922, 560796022, 559512079, 558239996, 556961536, 555661619, 554346085, 553068876, 551868498, 550722241, 549553335, 548331738, 547114253]
2749.3E47114253j187265j165509j141250j125396j143753j196086j243949j241148
2765.6E37669897j179457j143098j206159j305759j340687j360655j426101j458704
2782E27249277j455546j506448j632988j735032j737475j711488j719653j744688j814842
2800.3E12191117j944363k060652k118945k095342k043843k091050k229303k361477
2816.6D95246142k425939k441942k474279k545833k666801k844662l046006l206640
2832.9D73594040l363937l650517m101336m742741n580366o433099p042498p132292
2849.3D31547254o535500n350232l924549k774149k256304k418578l107190l965437
2865.6D01215315m595131m738122m312426l434390k401828j570106j103580r32515
$$ y = [547114253, 545926988, 544761479, 543620229, 542494833, 541351080, 540154994, 538911045, 537669897, 536490440, 535347342, 534141183, 532835424, 531494737, 530134082, 528707981, 527249277, 525793731, 524287283, 522654295, 520919263, 519181788, 517470300, 515750647, 514005959, 512191117, 510246754, 508186102, 506067157, 503971815, 501927972, 499836922, 497607619, 495246142, 492820203, 490378261, 487903982, 485358149, 482691348, 479846686, 476800680, 473594040, 470230103, 466579586, 462478250, 457735509, 452155143, 445722044, 438679546, 431547254, 425011754, 419661522, 415736973, 412962824, 410706520, 408287942, 405180752, 401215315, 396620184, 391882062, 387569636, 384135246, 381733418, 380163312, 379059732, 378127217]
2881.9C78127217r35375j060218j271218j492411j730263k013713k268464k486437
2898.2C64869118k724558k976537l273338l662735m148066m705161n246669n660236
2914.5C32471818n859405n769312n333215m550636l477454k241910r90868K36273J432359
2932.9C05917650K548129L506899M187852M514694M459292L995120L187806K213567
2949.2C34531009J306981O68883M64738P82817J454711K249837L118992M027546M843294
2967.6C53448808N484283N940169O189704O235481O124675N916774N612254N160421
2983.9D00112569M602969M035175L455937K847582K220809J553923Q86083K93553k49565
3002.2D19759035p45654j101136j275540j313775j275987j218408j246810j396358
$$ y = [378127217, 377191842, 376131624, 374860406, 373367995, 371637732, 369624019, 367355555, 364869118, 362144560, 359168023, 355894685, 352231950, 348083884, 343378723, 338132054, 332471818, 326612413, 320843101, 315509886, 310959250, 307481796, 305239886, 304249018, 304485291, 305917650, 308465779, 311972678, 316160530, 320675224, 325134516, 329129636, 332317442, 334531009, 335837990, 336506873, 336971611, 337754428, 339209139, 341458976, 344577968, 348605514, 353448808, 358933091, 364873260, 371062964, 377298445, 383423120, 389339894, 394952148, 400112569, 404715538, 408750713, 412206650, 415054232, 417275041, 418828964, 419715047, 420008600, 419759035, 419013381, 417912245, 416636705, 415322930, 414046943, 412828535, 411581725, 410185367]
3018.5D10185367j611650j898229k176315k291232k263487k236872k274842k304852
3034.9C93127888k309471k378523k495885k593756k663523k691358k675593k647162
3051.2C72672617k636015k667308k682686k579987k414614k282917k164334j987934
3067.5C53256822j793147j705914j689613j630843j518547j419187j368821j304566
3083.8C40826184j206667j122683j041740r67831r52661r93043j049012j087397j103312
3102.2C31301838j125872j176417j229942j280904j379758j502841j542956j520753
3118.5C20542395j540720j618386j725971j816810j873046j906216j923472j965522
3134.8C06172252k039165k053886k013535k047300k141833k182991k167373k176941
$$ y = [410185367, 408573717, 406675488, 404499173, 402207941, 399944454, 397707582, 395432740, 393127888, 390818417, 388439894, 385944009, 383350253, 380686730, 377995372, 375319779, 372672617, 370036602, 367369294, 364686608, 362106621, 359692007, 357409090, 355244756, 353256822, 351463675, 349757761, 348068148, 346437305, 344918758, 343499571, 342130750, 340826184, 339619517, 338496834, 337455094, 336487263, 335534602, 334541559, 333492547, 332405150, 331301838, 330175966, 328999549, 327769607, 326488703, 325108945, 323606104, 322063148, 320542395, 319001675, 317383289, 315657318, 313840508, 311967462, 310061246, 308137774, 306172252, 304133087, 302079201, 300065666, 298018366, 295876533, 293693542, 291526169, 289349228]
3151.1B89349228k210349k203017k190590k212316k215505k211391k237410k261340
3167.4B71607310k263815k244770k204716k178193k196133k220362k227366k188802
3183.7B53883153k105474k071709k086326k071426k022624j984626j979857j947075
3200.1B37614036j853109j790464j793459j802355j764953j711220j685917j667529
3216.4B23545030j654357j629442j608461j648173j695707j690090j706526j764252
3232.7B10148022j805053j844793j898587j956060k009482k044603k055749k076745
3249A94456950k127692k179191k202213k188027k166822k160505k116888k029404j952678
3267.4A75333530j857534j734317j632124j529708j389772j224294j068339r44033
$$ y = [289349228, 287138879, 284935862, 282745272, 280532956, 278317451, 276106060, 273868650, 271607310, 269343495, 267098725, 264894009, 262715816, 260519683, 258299321, 256071955, 253883153, 251777679, 249705970, 247619644, 245548218, 243525594, 241540968, 239561111, 237614036, 235760927, 233970463, 232177004, 230374649, 228609696, 226898476, 225212559, 223545030, 221890673, 220261231, 218652770, 217004597, 215308890, 213618800, 211912274, 210148022, 208342969, 206498176, 204599589, 202643529, 200634047, 198589444, 196533695, 194456950, 192329258, 190150067, 187947854, 185759827, 183593005, 181432500, 179315612, 177286208, 175333530, 173475996, 171741679, 170109555, 168579847, 167190075, 165965781, 164897442, 163953409]
3283.7A63953409q07599o62192n69284m87447l75897k89351k35676j60054r1925n4300
3304.1A60219684K489P6622J26928J60545J58801J29089J68905K44528K75433K73436
3324.5A61836460K39656K23770K53484K37793K04906K07960J80662J36301Q4340K2412
3344.9A63627744J8701N3957O1214K4080k1860j6913K0683O5342M7147m8086n2899
3367.3A63779110K2411J7420k8998l1099j3322N648L0100P2942J16154J80245K09227
3389.7A64359838J16303M6149Q5607J57819K40609K62558J98409K33710L52949L76731
3410.1A66430682L36811L65600M39882M67822M88639N56841O66798P39440P37950P46161
3430.5A71976626Q76591J023799R73627Q17611Q10668R41441J051381J104340J085252
$$ y = [163953409, 163145810, 162483618, 161914334, 161426887, 161050990, 160761639, 160525963, 160365909, 160273984, 160219684, 160222173, 160298795, 160425723, 160586268, 160745069, 160874158, 161043063, 161287591, 161563024, 161836460, 162076116, 162299886, 162553370, 162791163, 162996069, 163204029, 163384691, 163520992, 163605332, 163627744, 163646445, 163700402, 163761616, 163785696, 163763836, 163746923, 163767606, 163832948, 163880095, 163832009, 163779110, 163801521, 163818941, 163789943, 163758844, 163745522, 163751170, 163781270, 163854212, 163970366, 164150611, 164359838, 164476141, 164522290, 164607897, 164765716, 165006325, 165268883, 165467292, 165701002, 166053951, 166430682, 166767493, 167133093, 167572975, 168040797, 168529436, 169086277, 169753075, 170492515, 171230465, 171976626, 172853217, 173877016, 174850643, 175668254, 176478922, 177420363, 178471744, 179576084, 180661336]
3448.9A80661336J089200J163453J223504J256943J302913J331210J366168J481876
3465.2A90876603J574099J503080J366824J408652J583948J731888J779511J721025
3481.5B03545630J697898J794606J852393J820416J836315J897439J970410J976073
3497.8B18391180J944006J961082J972094J986906K066806K129599K152980K182290
3514.2B34786943K172216K186969K280638K425179K436250K311200K318815K446860
3530.5B53365070K541720K662719K739399K652079K643168K799511K956748K949387
3546.8B75309801K854109K886206L018260L100335L157437L245384L290564L305435
3563.1C00167531L466695L833801L899753L652632L631711L824651L991455M113674
$$ y = [180661336, 181750536, 182913989, 184137493, 185394436, 186697349, 188028559, 189394727, 190876603, 192450702, 193953782, 195320606, 196729258, 198313206, 200045094, 201824605, 203545630, 205243528, 207038134, 208890527, 210710943, 212547258, 214444697, 216415107, 218391180, 220335186, 222296268, 224268362, 226255268, 228322074, 230451673, 232604653, 234786943, 236959159, 239146128, 241426766, 243851945, 246288195, 248599395, 250918210, 253365070, 255906790, 258569509, 261308908, 263960987, 266604155, 269403666, 272360414, 275309801, 278163910, 281050116, 284068376, 287168711, 290326148, 293571532, 296862096, 300167531, 303634226, 307468027, 311367780, 315020412, 318652123, 322476774, 326468229, 330581903]
3579.4C30581903M171193M154086M286617M552365M487663M238993M397422M685938
3595.7C65556180M721344M670143M642964M571914M599720M868269M949361M822076
3612.1D03401971M776507M666061M835754N207241M955172M514039M543692N307823
3628.4D42208260N629301M803062M562676M722059M669308M600436M471123M283190
3644.7D79949415M393100M958570M992575M138559L848672M276872M216671L846407
3661E14620841L726720L618837L478348L660023L726006L205478L243148L358424K842128
3679.4E45479953K599180K593935K591252K767861K846122K365708J948953J957714
3695.7E65150678K011001J982212K035678K000749J835167J800239J883746J901865
$$ y = [330581903, 334753096, 338907182, 343193799, 347746164, 352233827, 356472820, 360870242, 365556180, 370277524, 374947667, 379590631, 384162545, 388762265, 393630534, 398579895, 403401971, 408178478, 412844539, 417680293, 422887534, 427842706, 432356745, 436900437, 442208260, 447837561, 452640623, 457203299, 461925358, 466594666, 471195102, 475666225, 479949415, 484342515, 489301085, 494293660, 498432219, 502280891, 506557763, 510774434, 514620841, 518347561, 521966398, 525444746, 529104769, 532830775, 536036253, 539279401, 542637825, 545479953, 548079133, 550673068, 553264320, 556032181, 558878303, 561244011, 563192964, 565150678, 567161679, 569143891, 571179569, 573180318, 575015485, 576815724, 578699470, 580601335]
3712E80601335J654863J366496J315296J376569J396298J333535J243591J163841J179933
3730.3E92631757J381934J477778J293719R72211O85155P69437J274705J337588J058101
3748.7F02882385J121640J017392P68423Q25644J020133R64165P66873P48337P52985
3767.1F10867977Q52704J014292R16243P99239Q42273Q55446O78658N46515O95527
3785.4F18068874Q33392P67291O28590N31018N87225O48737O77287Q61347P46846N51522
3805.8F24902129O32763N24938M14908N40376P59065O41286M49539N97536N24759M57883
3826.2F30445182N41628N00977M86135N12839N28812N61714N17011M27306L49760K57790
3846.6F35129154K04861K66075O71268R21785M02272Q0407J46210L57568N25236L65079
$$ y = [580601335, 582256198, 583622694, 584937990, 586314559, 587710857, 589044392, 590287983, 591451824, 592631757, 594013691, 595491469, 596785188, 597757399, 598442554, 599211991, 600486696, 601824284, 602882385, 604004025, 605021417, 605789840, 606615484, 607635617, 608599782, 609366655, 610114992, 610867977, 611720681, 612734973, 613651216, 614450455, 615292728, 616148174, 616826832, 617373347, 618068874, 618902266, 619669557, 620298147, 620829165, 621416390, 622065127, 622742414, 623603761, 624350607, 624902129, 625534892, 626059830, 626474738, 627015114, 627774179, 628415465, 628865004, 629462540, 629987299, 630445182, 630986810, 631487787, 631973922, 632486761, 633015573, 633577287, 634094298, 634521604, 634871364, 635129154, 635334015, 635600090, 636271358, 637193143, 637595415, 637675822, 637822032, 638179600, 638704836, 639069915]
3867F39069915K74956M30286L64780K43664J83821K74658M24862L43204L46005K77996
3887.4F42234147J22010K77341L65972J70350J03355K50458L22402K90513K29418O1453
3907.8F44427419R596J35422J95026J79053J80125J65522J70767K33591J85966K9683
3928.2F45912170N4181K45631K87890J60873M6969N3167J81496J97888J06871J50025
3948.6F47397161K14099J37568O0856R1553J63019K11596J72675O8784N9783J15752
3969F48692846R4652Q9825J66118J76787J16885J08123R1076O1452J06514J79529K24530
3991.4F50108337J96815J26481J16706
3997.5F50548339
$$ y = [639069915, 639344871, 639775157, 640139937, 640383601, 640567422, 640842080, 641266942, 641610146, 641956151, 642234147, 642356157, 642633498, 642999470, 643169820, 643273175, 643523633, 643846035, 644136548, 644365966, 644427419, 644437015, 644572437, 644767463, 644946516, 645126641, 645292163, 645462930, 645696521, 645882487, 645912170, 645966351, 646211982, 646499872, 646660745, 646707714, 646760881, 646942377, 647140265, 647247136, 647397161, 647611260, 647748828, 647809684, 647901237, 648064256, 648275852, 648448527, 648517311, 648577094, 648692846, 648787498, 648877323, 649043441, 649220228, 649337113, 649445236, 649536312, 649597764, 649704278, 649883807, 650108337, 650305152, 650431633, 650548339]
##END=$$ End of the data block
