##TITLE=G17-51-CE $$ Begin of the data block
##JCAMP-DX=5.00 $$ ACD/SpecManager v 10.08
##SPECTROMETER/DATA SYSTEM=Alpha
##DATE=23 Oct 2013 10:11:40
##DATA TYPE=INFRARED SPECTRUM
##DATA CLASS=XYDATA
##ORIGIN=
##OWNER=
##NPOINTS=1765
##FIRSTX=399.75695801
##LASTX=3997.56933594
##MAXX=3997.56933594
##MINX=399.75695801
##MAXY=0.73291534
##MINY=0.13897140
##XFACTOR=1.0000000000
##YFACTOR=1.000000000000000e-9
##FIRSTY=0.44655836
##DELTAX=2.03957629
##XUNITS=1/CM
##YUNITS=ARBITRARY UNITS
##XYDATA=(X++(Y..Y))
399.8D46558356l165453k241224j627505q08865m89414m67986k10821J67012K4646
$$ 446558356 443392903 441151679 439524174 438715309 438225895 437757909 437547088 437714100 437738746
418.1D37738746j153826k153188k460361k199530j545340j376063j707464j838535
$$ 437738746 436584920 434431732 431971371 429771841 428226501 426850438 425142974 423304439
434.4D23304439j488209p03752L50088J274287J616896J130193P3612q00282j120448
$$ 423304439 421816230 421112478 421462566 422736853 424353749 425483942 425557554 424757272 423636824
452.8D23636824j121998j403361k012432k293527k632380l043473k844572k429217
$$ 423636824 422514826 421111465 419099033 416805506 414173126 411129653 408285081 405855864
469.1D05855864k421170k542705k281904j709401j192004r42379r63837j112700j224815
$$ 405855864 403434694 400891989 398610085 396900684 395708680 394766301 393802464 392689764 391464949
487.5C91464949j493186k018690k353996k324254k305567k505094k858877l164053
$$ 391464949 389971763 387953073 385599077 383274823 380969256 378464162 375605285 372441232
503.8C72441232l338128l384411l132344k851963k865106l009528k921462k383977
$$ 372441232 369103104 365718693 362586349 359734386 356869280 353859752 350938290 348554313
520.1C48554313j741797j270741q20279l50296O5058N08994J087695J802683K435059
$$ 348554313 346812516 345541775 344721496 344371200 344436258 344945252 346032947 347835630 350270689
538.4C50270689K547353K001792J087547K08377k86310m87119p00325r35853j267671
$$ 350270689 352818042 354819834 355907381 356115758 355829448 355342329 354642004 353706151 352438480
556.8C52438480j708150k019823k138853k159268k297401k349854j838833r27507l4154
$$ 352438480 350730330 348710507 346571654 344412386 342114985 339765131 337926298 336998791 336964637
575.2C36964637Q14229J693845K399147K753138K753049K405733J796484J254231Q29041
$$ 336964637 337778866 339472711 341871858 344624996 347378045 349783778 351580262 352834493 353663534
593.5C53663534L48002q3864k72989j45883O9320J45048J22548J15573J20342J03652
$$ 353663534 354011536 353927672 353654683 353508800 353578120 353723168 353845716 353961289 354081631 354185283
613.9C54185283K48045P58260J427621J976043K305329K413720K511710K545654K436281
$$ 354185283 354433328 355191588 356619209 358595252 360900581 363314301 365826011 368371665 370807946
632.3C70807946K254903J900584J426816J109004J079618J238168J215547Q13484K62678
$$ 370807946 373062849 374963433 376390249 377499253 378578871 379817039 381032586 381846070 382108748
650.6C82108748j01894j34021K2888K00570L42518L18944R4801M3035O92129J282483
$$ 382108748 382006854 381872833 381895721 382096291 382438809 382757753 382852554 382895589 383587718 384870201
671C84870201J489371J661182J512974J271338J210898J236200J273245J179546P08669
$$ 384870201 386359572 388020754 389533728 390805066 392015964 393252164 394525409 395704955 396413624
689.4C96413624m2915q02845j281828j227438n31375N55783J457811J851886K088845
$$ 396413624 396370709 395567864 394286036 393058598 392527223 393083006 394540817 396392703 398481548
707.7C98481548K641231L399521L861308L835291L765255M058927M589170N052805
$$ 398481548 401122779 404522300 408383608 412218899 415984154 420043081 424632251 429685056
724D29685056N255938M925787M118204L211707K476245K113551J957178J624167R52185
$$ 429685056 434940994 439866781 443984985 447196692 449672937 451786488 453743666 455367833 456320018
742.4D56320018J64389l09855k80916o2585l4839l40372r18925j415879j367747p21515
$$ 456320018 456484407 456174552 455893636 455831051 455796212 455455840 454536915 453121036 451753289 451031774
762.8D51031774K73735J499056K685518L610879M368245N065948N625337N815447N333483
$$ 451031774 451305509 452804565 455490083 459100962 463469207 468535155 474160492 479975939 485309422
781.2D85309422M253507L136038K375007K183467K403528K558172K513885K508044
$$ 485309422 489562929 492698967 495073974 497257441 499660969 502219141 504733026 507241070
797.5E07241070K720058L135085L571928L719628L370821K525985J457572O38724L60787
$$ 507241070 509961128 513096213 516668141 520387769 523758590 526284575 527742147 528380871 528741658
815.8E28741658L94523K19583n38110j710654k739310l117084k812744k356171k256513
$$ 528741658 529136181 529355764 528817654 527107000 524367690 521250606 518437862 516081691 513825178
834.2E13825178k646267l102541l193915k871990k220363j503706j040011r40144r69202
$$ 513825178 511178911 508076370 504882455 502010465 499790102 498286396 497246385 496306241 495337039
852.5D95337039p62820k79576M43668J693368L417134M863828N607128N974949O121516
$$ 495337039 494574219 494294643 494738311 496431679 499848813 504712641 510319769 516294718 522416234
870.9E22416234N623877M073441J710892p22408k629042l788948m418671m888237n353629
$$ 522416234 528040111 532113552 533824444 533102036 530472994 526684046 522265375 517377138 512023509
889.3E12023509n758107n865216n528391n011678m808276n196184o066233p012576
$$ 512023509 506265402 500400186 494871795 489860117 485051841 479855657 473789424 466776848
905.6D66776848p614076p679522p351458o934733o451398n760431m762560l406376
$$ 466776848 459162772 451483250 444131792 437197059 430745661 424985230 420222670 416816294
921.9D16816294k002418j023769o37889o90073q11905p35998n13285k53886j83284
$$ 416816294 414813876 413790107 413152218 412462145 411650240 410914242 410400957 410147071 409963787
940.2D09963787p84368k392113m786014p133276q636802r324670r719938j0105252
$$ 409963787 409179419 406787306 402001292 394868016 386231214 376906544 367186606 357081354
956.6C57081354j0438115j0561794j0441661j0186463r895474r599298r189278q524597
$$ 357081354 346643239 336081445 325639784 315453321 305557847 295958549 286769271 278244674
972.9B78244674p569790o341099n023480l921062l134369k574906k186477j906828
$$ 278244674 270674884 264333785 259310305 255389243 252254874 249679968 247493491 245586663
989.2B45586663j611784j320317j082167q67754o59794l79726j03280j15931m93735
$$ 245586663 243974879 242654562 241572395 240704641 240044847 239665121 239561841 239445910 238952175
1007.5B38952175j055569j575276j881480j980007j940012j869187j920715k125293
$$ 238952175 237896606 236321330 234439850 232459843 230519831 228650644 226729929 224604636
1023.9B24604636k363056k482220k393037k134994j971498k040952k201498k282500
$$ 224604636 222241580 219759360 217366323 215231329 213259831 211218879 209017381 206734881
1040.2B06734881k174378j891240j552805j243294r11653m79355K8223N47275J044079
$$ 206734881 204560503 202669263 201116458 199873164 198961511 198482156 198510379 199057654 200101733
1058.5B00101733J469374J828924K033651J789555R09671l23981j125291r21324L9756
$$ 200101733 201571107 203400031 205433682 207223237 208132908 207808927 206683636 205762312 205802068
1076.9B05802068J198977K313674L280237M030109M530385M705488M563034M199609
$$ 205802068 207001045 209314719 212594956 216625065 221155450 225860938 230423972 234623581
1093.2B34623581L724039L176540K557963J956523J558810J493484J698881K027422
$$ 234623581 238347620 241524160 244082123 246038646 247597456 249090940 250789821 252817243
1109.5B52817243K384812K678305K813339K721697K349138J851589J563162J640021
$$ 252817243 255202055 257880360 260693699 263415396 265764534 267616123 269179285 270819306
1125.8B70819306K015472K529830K844333K666295K099365J406818P16955J25140k90871
$$ 270819306 272834778 275364608 278208941 280875236 282974601 284381419 285098374 285223514 284932643
1144.2B84932643n79446p50035p14452m05460J94847J003325J862854K630383L294766
$$ 284932643 284353197 283603162 282888710 282483250 282678097 283681422 285544276 288174659 291469425
1162.6B91469425L954560M577189N112559N656004O234437O722271P015378P178902
$$ 291469425 295423985 300001174 305113733 310769737 317004174 323726445 330741823 337920725
1178.9C37920725P253915P109017O652951N895674M847050L643006K489805J434743
$$ 337920725 345174640 352283657 358936608 364832282 369679332 373322338 375812143 377246886
1195.2C77246886M59850l80128j040817j469284j525998j215160p73519n03093n48750
$$ 377246886 377706736 377326608 376285791 374816507 373290509 372075349 371301830 370798737 370249987
1213.5C70249987q18074j092017j241028j343697j517266j791418k096921k312333
$$ 370249987 369431913 368339896 367098868 365755171 364237905 362446487 360349566 358037233
1229.9C58037233k289623j979470j483023r47327m52995L0041N83053J210480J801253
$$ 358037233 355747610 353768140 352285117 351337790 350884795 350914836 351497889 352708369 354509622
1248.2C54509622K276063K543658K592981K545803K499789K484233K489835K507239
$$ 354509622 356785685 359329343 361922324 364468127 366967916 369452149 371941984 374449223
1264.5C74449223K481163K347439K096177J794546J542539J372844J211315J045168
$$ 374449223 376930386 379277825 381374002 383168548 384711087 386083931 387295246 388340414
1280.8C88340414R59426J003623J120746J166522J008988N33521k23190j040011j638681
$$ 388340414 389299840 390303463 391424209 392590731 393599719 394133240 393910050 392870039 391231358
1299.2C91231358j920432k002030k059192k141029k133458j917124j405657o87330
$$ 391231358 389310926 387308896 385249704 383108675 380975217 379058093 377652436 376965106
1315.5C76965106P569M68672N71906K47419m15176j176328j827269k244205k426475
$$ 376965106 376972675 377441347 378013253 378260672 377845496 376669168 374841899 372597694 370171219
1333.9C70171219k355426k051801j594901j085073o72132n38617p57545j199633j613468
$$ 370171219 367815793 365763992 364169091 363084018 362411886 361873269 361115724 359916091 358302623
1352.2C58302623j870096k014905k146631k536476l356308m182040m510552m333794
$$ 358302623 356432527 354417622 352270991 349734515 346378207 342196167 337685615 333351821
1368.5C33351821l634066l175795l522098m047900m397989m646271m555434l913403
$$ 333351821 329717755 326541960 323019862 318971962 314573973 309927702 305372268 301458865
1384.9C01458865k906978j766413q75235m44621k59429K1279M40568Q76844J309395
$$ 301458865 298551887 296785474 295910239 295465618 295206189 295227468 295668036 296544880 297854275
1403.2B97854275J783549K123028K323985K501369K579004K610057K833843L231883
$$ 297854275 299637824 301760852 304084837 306586206 309165210 311775267 314609110 317840993
1419.5C17840993L104121K882272K742231K233237J448154N01961k51919p75010r23842
$$ 317840993 320945114 323827386 326569617 328802854 330251008 330752969 330501050 329726040 328802198
1437.9C28802198m46319L9547K31117K81304K87921K74777L07560P76142K163827L497690
$$ 328802198 328355879 328395426 328626543 328907847 329195768 329470545 329778105 330554247 332718074 336215764
1458.3C36215764L294826L155589L647357M094899M664540O367386Q929550R326846
$$ 336215764 339510590 342666179 346313536 350408435 355072975 361440361 370369911 379696757
1474.6C79696757P519930N687714L824740J835555k12878k178579m273743o066233
$$ 379696757 387216687 392904401 396729141 398564696 398351818 396173239 391899496 385833263
1490.9C85833263o494462p100612q578658q808196p871270p214278q677393j2248278
$$ 385833263 379338801 372238189 363659531 354851335 346980065 339765787 331088394 318840116
1507.2C18840116j1454761r445667q870542p531315n427838l424257k868682l122896
$$ 318840116 307385355 297939688 289069146 281537831 276109993 272685736 269817054 266694158
1523.6B66694158l213763l346890k944380k516538k467066j972199j331195j207813
$$ 266694158 263480395 260133505 257189125 254672587 252205521 250233322 248902127 247694314
1539.9B47694314p41542K80410J151055J947195K831310L632664M222334M562944N686104
$$ 247694314 246952772 247233182 248384237 250331432 253162742 256795406 261017740 265580684 271266788
1558.2B71266788O369531M529149L886103L992707L888577L725976K987504K538055
$$ 271266788 277636319 282165468 286051571 290044278 293932855 297658831 300646335 303184390
1574.5C03184390K438277J736969J069128P24435N00381K33293j55509p53104j388371
$$ 303184390 305622667 307359636 308428764 309153199 309653580 309886873 309731364 308978260 307589889
1592.9C07589889k014637k626181l321111m176736n058199n861432o683707p669836
$$ 307589889 305575252 302949071 299627960 295451224 290393025 284531593 277847886 270178050
1609.2B70178050q297384q401453r374127j1217907j0418788r877965j1269510j1092186
$$ 270178050 261880666 253479213 244105086 232887179 222468391 212590426 201320916 190228730
1625.5A90228730j0033339r375065q106783p287026p312000n249321k546907j106605
$$ 190228730 180195391 170820326 162713543 155426517 148114517 142865196 140318289 139211684
1641.8A39211684k40281N03078J125053J288816J737297K649054K674699K757549L577769
$$ 139211684 138971403 139474481 140599534 141888350 143625647 146274701 148949400 151706949 155284718
1660.2A55284718M701301N482897N495414O276057P376611P043928P375136Q193925
$$ 155284718 159986019 165468916 170964330 177240387 184616998 191660926 199036062 207229987
1676.5B07229987P903635P767842R068563J1676610J1236384J0273099J1715531J2835116
$$ 207229987 215133622 222901464 231970027 243646637 254883021 265156120 276871651 289706767
1692.8B89706767J5903055J8817455J9260943K1140307J7809838J4948636J4853239
$$ 289706767 305609822 324427277 343688220 364828527 382638365 397587001 412440240
1707.1D12440240J2871206J0961384R698301Q902848Q744687P567227N809486N100339
$$ 412440240 425311446 436272830 445971131 454873979 463618666 471185893 476995379 482095718
1723.4D82095718M773468M241765L883034L589302L839105L882110L413916L789842
$$ 482095718 486869186 491110951 494993985 498583287 502422392 506304502 509718418 513508260
1739.7E13508260M411996M846632N556882O447017P414400P835687P260680P149636
$$ 513508260 517920256 522766888 528323770 534770787 542185187 550020874 557281554 564431190
1756.1E64431190P271112O922483O879032O353497N694628N521357N284190N178273
$$ 564431190 571702302 578624785 585503817 591857314 597551942 603073299 608357489 613535762
1772.4F13535762M718184L900111L567040L458023L253341L104150K950192K682685
$$ 613535762 618253946 622154057 625721097 629179120 632432461 635536611 638486803 641169488
1788.7F41169488K505899K494395K315223K189815K227902K204895K004505J794099
$$ 641169488 643675387 646169782 648485005 650674820 652902722 655107617 657112122 658906221
1805F58906221J771450J850844J887083J761138J639128J569092J503587J478493J582623
$$ 658906221 660677671 662528515 664415598 666176736 667815864 669384956 670888543 672367036 673949659
1823.4F73949659J667142J506388J320302J200617J144171J186668J242877J191854
$$ 673949659 675616801 677123189 678443491 679644108 680788279 681974947 683217824 684409678
1839.7F84409678J078844R97663R39548R18924R74179R78112Q81135Q05796P48396
$$ 684409678 685488522 686486185 687425733 688344657 689318836 690296948 691178083 691983879 692732275
1858F92732275P34031P92682Q76248Q59678P11143N43117N08547O47128P77602P84516
$$ 692732275 693466306 694258988 695135236 695994914 696706057 697249174 697757721 698404849 699182451 699966967
1878.4F99966967P14123O23167N57423O08086P49231P97390O98448N54084M38154M32015
$$ 699966967 700681090 701304257 701861680 702469766 703218997 704016387 704714835 705268919 705707073 706139088
1898.8G06139088N52833O32703N97358M90665L67999K99812L13639M21524N51045N33879
$$ 706139088 706691921 707324624 707921982 708412647 708780646 709080458 709394097 709815621 710366666 710900545
1919.2G10900545L58045K49386K50876L04282L81410M13537L48687J97589J11342J63317
$$ 710900545 711258590 711507976 711758852 712063134 712444544 712858081 713206768 713404357 713515699 713679016
1939.6G13679016K86400L52323L04043K03133J37031J55509K39670L52263M03106L56853
$$ 713679016 713965416 714317739 714621782 714824915 714961946 715117455 715357125 715709388 716112494 716469347
1960G16469347K49386J57774J38640J96278K68400L17097L06844K00689Q7977N9604
$$ 716469347 716718733 716876507 717015147 717211425 717479825 717796922 718103766 718304455 718392432 718452036
1980.4G18452036J44422K40565K74598K18153R0003O795L2008J27435K07960J88113
$$ 718452036 718596458 718837023 719111621 719329774 719419777 719426572 719458580 719586015 719793975 719982088
2000.8G19982088L5226j14381j54078q0884K7955M6849n9783k08736l30865l58284
$$ 719982088 720017314 719902933 719748855 719667971 719695926 719742775 719682992 719474256 719143391 718785107
2021.2G18785107k26855q0586o2763j92106l54111m01557l00228j40489l9875o6638
$$ 718785107 718558252 718477666 718414903 718222797 717868686 717467129 717166901 717026412 716986537 716919899
2041.6G16919899k26200l46839l01957j21653P1645J55448O8367q7798j42634n9425
$$ 716919899 716693699 716346860 716044903 715923250 715994895 716150343 716218710 716130912 715988278 715928853
2062G15928853J12831K58565K51651Q1897r1970j26004O198J87338K49028J42455l2902
$$ 715928853 716041684 716300249 716551900 716633797 716541827 716415823 716422021 716609359 716858387 717000842 716967940
2084.4G16967940j39117r0241J09493K75791K60592J12176p809m0471K8014K02835
$$ 716967940 716828823 716738582 716848075 717123866 717384458 717496634 717488825 717448354 717476368 717679203
2104.8G17679203L14056K31147L4392q8513n1498R7334K40505K66671J40250n7519
$$ 717679203 717993259 718224406 718258798 718170285 718118787 718216121 718456626 718723297 718863547 718806028
2125.2G18806028j43587l9518J55926L07858K91764Q8275q9705q7142N0604K18392
$$ 718806028 718662441 718622923 718778849 719086707 719378471 719466746 719377041 719289899 719340503 719558895
2145.6G19558895K81810J84954M3571k1935L2485K13265M02749M39763L01003J46032
$$ 719558895 719840705 720025659 720069230 720047295 720079780 720293045 720695794 721135557 721436560 721582592
2166G21582592J23977K60830M75168N91994N31017L50357J96695K04682L43204M83632
$$ 721582592 721706569 721967399 722442567 723034561 723565578 723915935 724112630 724317312 724660516 725144148
2186.4G25144148N36263M39703K46227J27971J93715L84868N13255M83394L28421J48535
$$ 725144148 725680411 726120114 726366341 726494312 726688027 727072895 727586150 728069544 728397965 728546500
2206.8G28546500J07110K56955M35651M91380M06623K15233L6359K9385K10285L84927
$$ 728546500 728653610 728910565 729346216 729837596 730244219 730459452 730495811 730525196 730735481 731120408
2227.2G31120408L72171J86264j3351o5327L6002J98900K97249K43067O9917q8036
$$ 731120408 731492579 731678843 731665492 731600165 731636167 731835067 732132316 732375383 732445300 732357264
2247.6G32357264j22726j1206J72436K48134J42992m8936j58667j10150J8955J50978
$$ 732357264 732234538 732223332 732395768 732643902 732786894 732737958 732579291 732469141 732488096 732639074
2268G32639074J97232P9036j28210k18153r2149J10329J98781R2089j66416l65972
$$ 732639074 732836306 732915342 732787132 732568979 732476830 732587159 732785940 732878029 732711613 732345641
2288.4G32345641l56377j76429J2994J9013j35719l29376m31299l58820k28762j54019
$$ 732345641 731989264 731812835 731825829 731844842 731709123 731379747 730948448 730589628 730360866 730206847
2308.8G30206847j46687k58982m68731n94139n10454k97606j80781l03269n49256o06895
$$ 730206847 730060160 729801178 729332447 728738308 728227854 727930248 727749467 727446198 726896942 726290047
2329.2G26290047m41074k82169j91509j74284k71380m63724m88520j31488O8367k00391
$$ 726290047 725848973 725566804 725375295 725201011 724929631 724465907 723977387 723845899 723914266 723713875
2349.6G23713875n49972p91848q97646p59482m71294k36809m1187N5253j08957k11954
$$ 723713875 723163903 722372055 721474409 720714927 720243633 720006824 719965637 720020890 719911933 719699979
2370G19699979p6652R3401J59144N8949j22487k80381l53515l12507k32577k32280
$$ 719699979 719623327 719716728 719875872 719934821 719812334 719531953 719178438 718865931 718633354 718401074
2390.4G18401074l43978n34713o80030o45876n01453m19856m58300n84244p37191p93159
$$ 718401074 718057096 717522383 716842353 716196477 715695024 715275168 714816868 714232624 713495433 712702274
2410.8G12702274p17878n97000n27382n95033p84457r49681r37938p80583o62684o72639
$$ 712702274 711984396 711387396 710860014 710264981 709480524 708530843 707592905 706812322 706149638 705476999
2431.2G05476999p65443q78453r33349q79466p60973o81996p09117q44359r81689r75966
$$ 705476999 704711556 703833103 702899754 702020288 701259315 700577319 699868202 699023843 698042154 697066188
2451.5F97066188q55565p20203o57082p34210q93533r68814q90076p54595o60777o89864
$$ 697066188 696210623 695490420 694833338 694099128 693205595 692236781 691346705 690592110 689931333 689241469
2471.9F89241469q20339r28461r34482q24273p04229o76512p37190q47459r13620q61526
$$ 689241469 688421130 687492669 686558187 685733914 685029685 684353173 683615983 682768524 681854904 680993378
2492.3F80993378p33793o34133o47486p37548p96139q16107p85529o79136n97298o19948
$$ 680993378 680259585 679625452 678977966 678240418 677444279 676628172 675842643 675163507 674566209 673946261
2512.7F73946261p24136q25942q13007p16031o61075o77407p34687q07404q76129q81255
$$ 673946261 673222125 672396183 671583176 670867145 670206070 669528663 668793976 667986572 667110443 666229188
2533.1F66229188q05139p33554p34568q08299q81552r00984q62122p83443p17461p14898
$$ 666229188 665424049 664690495 663955927 663147628 662266076 661365092 660502970 659719527 659002066 658287168
2553.5F58287168q07405q90195q49188p72655p31766o97553p00772p70569q42809q59261
$$ 658287168 657479763 656589568 655740380 654967725 654235959 653538406 652837634 652067065 651224256 650364995
2573.9F50364995q20100p58052p28667p74384q68797q93652q32379p84993p55012p36833
$$ 650364995 649544895 648786843 648058176 647283792 646414995 645521343 644688964 643903971 643148959 642412126
2594.3F42412126p71761q65579r56833r59873q78275q40365r21905j021386j089871
$$ 642412126 641640365 640774786 639817953 638858080 637979805 637139440 636217535 635196149 634106278
2612.7F34106278j156628j147985j076102j094878j199007j288712j332402j327455
$$ 634106278 632949650 631801665 630725563 629630685 628431678 627142966 625810564 624483109
2629F24483109j288414j243711j260638j343787j395643j379430j335561j281739j253426
$$ 624483109 623194695 621950984 620690346 619346559 617950916 616571486 615235925 613954186 612700760
2647.3F12700760j296341j366079j396358j363337j304984j295269j303792j300633
$$ 612700760 611404419 610038340 608641982 607278645 605973661 604678392 603374600 602073967
2663.7F02073967j321852j311421j242995j203299j221776j226783j213670j232624
$$ 602073967 600752115 599440694 598197699 596994400 595772624 594545841 593332171 592099547
2680E92099547j233637j180291j123309j085162j097858j187206j263797j277566j264512
$$ 592099547 590865910 589685619 588562310 587477148 586379290 585192084 583928287 582650721 581386209
2698.3E81386209j263619j295686j315295j349748j438021j484156j437902j397372
$$ 581386209 580122590 578826904 577511609 576161861 574723840 573239684 571801782 570404410
2714.6E70404410j426518j496911j537203j488328j412750j343965j267314j230180
$$ 570404410 568977892 567480981 565943778 564455450 563042700 561698735 560431421 559201241
2731E59201241j265109j335502j344561j265765j179754j136542j159727j214087j209378
$$ 559201241 557936132 556600630 555256069 553990304 552810550 551674008 550514281 549300194 548090816
2749.3E48090816j179338j173556j152038j116157j130104j194477j235306j234770
$$ 548090816 546911478 545737922 544585884 543469727 542339623 541145146 539909840 538675070
2765.6E38675070j195789j150906j188814j284421j340627j383126j441956j460850
$$ 538675070 537479281 536328375 535139561 533855140 532514513 531131387 529689431 528228581
2782E28228581j458287j523733j647413j712799j704872j699567j717865j761496j843453
$$ 528228581 526770294 525246561 523599148 521886349 520181477 518481910 516764045 515002549 513159096
2800.3E13159096j957059k053260k080799k064108k084971k157450k247691k338201
$$ 513159096 511202037 509148777 507067978 505003870 502918899 500761449 498513758 496175557
2816.6D96175557k389788k415747k481490k587050k706349k852768l031343l206134
$$ 496175557 493785769 491370022 488888532 486301482 483595133 480742365 477711022 474504888
2832.9D74504888l375590l641397m109382m790783n613595o422133o991505p088691
$$ 474504888 471129298 467487901 463378519 458587736 452974141 446552008 439560503 432471812
2849.3D32471812o567478n427301l971845k780885k248496k423673l134877m001915
$$ 432471812 425904334 420477033 416505188 413724303 411475807 409052134 405917257 401915342
2865.6D01915342m610300m732609m311025l451080k455621j623571j100988q98063
$$ 401915342 397305042 392572433 388261408 384810328 382354707 380731136 379630148 378732085
2881.9C78732085r18984j074851j295507j506328j729876k005726k285779k526998
$$ 378732085 377813101 376738250 375442743 373936415 372206539 370200813 367915034 365388036
2898.2C65388036k738685k959907l251403l655345m162907m721433n242437n644232
$$ 365388036 362649351 359689444 356438041 352782696 348619789 343898356 338655919 333011687
2914.5C33011687n848795n755723n331039m580915l517837k259552r64463K69830J423657
$$ 333011687 327162892 321407169 316076130 311495215 307977378 305717826 304753363 305023193 306446850
2932.9C06446850K525389L512681M236966M580290M478901L957659L148317K228439
$$ 306446850 308972239 312484920 316721886 321302176 325781077 329738736 332887053 335115492
2949.2C35115492J362920P15673M83871P70747J444131K292008L175377M023225M824370
$$ 335115492 336478412 337194085 337677956 338448703 339892834 342184842 345360219 349383444 354207814
2967.6C54207814N535304O025613O241113O266713O155401N917102N594254N199224
$$ 354207814 359743118 365768731 372009844 378276557 384431958 390349060 395943314 401142538
2983.9D01142538M703015M090219L423691K807886K229243J593858R28462L19212k33113
$$ 401142538 405845553 409935772 413359463 416167349 418396592 419990450 420918912 421238124 421005011
3002.2D21005011p17134j065910j255691j307904j273781j227349j245767j373977
$$ 421005011 420287877 419221967 417966276 416658372 415384591 414157242 412911475 411537498
3018.5D11537498j592964j882076k148539k263278k275019k270699k271235k287298
$$ 411537498 409944534 408062458 405913919 403650641 401375622 399104923 396833688 394546390
3034.9C94546390k312810k376347k480448k584725k639741k658486k675087k652883
$$ 394546390 392233580 389857233 387376785 384792060 382152319 379493833 376818746 374165863
3051.2C74165863k622873k657205k715170k659679k480894k272963k084464j948595
$$ 374165863 371542990 368885785 366170615 363510936 361030042 358757079 356672615 354724020
3067.5C54724020j838774j757055j709372j605481j448065j374602j395613j375228
$$ 354724020 352885246 351128191 349418819 347813338 346365273 344990671 343595058 342219830
3083.8C42219830j254052j099229r94086r54927r49025r49859j002908j103342j147449
$$ 342219830 340965778 339866549 338872463 337917536 336968511 336018652 335015744 333912402 332764953
3102.2C32764953j153320j200854j252383j297117j403361j513660j530230j512260
$$ 332764953 331611633 330410779 329158396 327861279 326457918 324944258 323414028 321901768
3118.5C21901768j558929j661390j748503j816809j872480j886338j890123j955211
$$ 321901768 320342839 318681449 316932946 315116137 313243657 311357319 309467196 307511985
3134.8C07511985k066314k088398k052933k080112k120734k126634k114683k144456
$$ 307511985 305445671 303357273 301304340 299224228 297103494 294976860 292862177 290717721
3151.1B90717721k225488k273471k269923k251089k215773k206683k240896k255231
$$ 290717721 288492233 286218762 283948839 281697750 279481977 277275294 275034398 272779167
3167.4B72779167k252341k246260k232224k218485k214134k201348k171308k157092
$$ 272779167 270526826 268280566 266048342 263829857 261615723 259414375 257243067 255085975
3183.7B55085975k140582k104342k084434k076730k044022k002895j997173j951679
$$ 255085975 252945393 250841051 248756617 246679887 244635865 242632970 240635797 238684118
3200.1B38684118j832620j798361j837373j789287j703038j696796j707956j685634
$$ 238684118 236851498 235053137 233215764 231426477 229723439 228026643 226318687 224633053
3216.4B24633053j673222j661881j671479j677230j637011j648993j766950j849889
$$ 224633053 222959831 221297950 219626471 217949241 216312230 214663237 212896287 211046398
3232.7B11046398j838014j845345j894697j945690k010434k080635k092257k077266
$$ 211046398 209208384 207363039 205468342 203522652 201512218 199431583 197339326 195262060
3249A95262060k116010k155975k159476k170563k195835k210408k155095k055541j993895
$$ 195262060 193146050 190990075 188830599 186660036 184464201 182253793 180098698 178043157 176049262
3267.4A76049262j885593j704812j566514j495585j417607j260638j068965r37193
$$ 176049262 174163669 172458857 170892343 169396758 167979151 166718513 165649548 164712355
3283.7A64712355q32186o93708n68614m82693l97965l00467j94565j18419j07557j02356
$$ 164712355 163880169 163186461 162617847 162135154 161737189 161436722 161242157 161123738 161016181 160913825
3304.1A60913825o3643P272J16229K16469K29061J62914J52558K32295K69740K14309
$$ 160913825 160850182 160857454 160973683 161190152 161419213 161582127 161734685 161966980 162236720 162451029
3324.5A62451029J62244J75401K44007K86340K49237K02462J51694R0435Q3089Q1584
$$ 162451029 162613273 162788674 163032681 163319021 163568258 163770720 163922414 164012849 164095938 164177522
3344.9A64177522L1173Q434L8699M1887M470j699J7003J0207j9416j2666M2319K6837
$$ 164177522 164208695 164217129 164255828 164297715 164302185 164300486 164317489 164327696 164308280 164295614 164337933 164364770
3369.3A64364770p8842j08063j1623N9754M1931K6003N5686O3881Q6218J49116J45897
$$ 164364770 164285928 164177865 164166242 164225996 164267927 164293930 164349616 164413497 164499715 164648831 164794728
3391.8A64794728R6426J16556K08736K95907K78413J74910J96889L30121L69146L40447
$$ 164794728 164891154 165007710 165216446 165512353 165790766 165965676 166162565 166492686 166861832 167202279
3412.2A67202279L94985M75362M75422M64603N27441O64920P92026Q33914P85202Q33720
$$ 167202279 167597264 168072626 168548048 169012651 169540092 170205012 170997038 171830952 172616154 173449874
3432.6A73449874R73850R32634Q12695Q52689R67249J054302J121193J116216J114533
$$ 173449874 174423724 175356358 176169053 177021742 177988991 179043293 180164486 181280702 182395235
3450.9A82395235J173004J246616J310587J338542J326889J351639J458377J554370
$$ 182395235 183568239 184814855 186125442 187463984 188790873 190142512 191600889 193155259
3467.2A93155259J504570J349539J373961J589462J780928J827865J737372J673907
$$ 193155259 194659829 196009368 197383329 198972791 200753719 202581584 204318956 205992863
3483.6B05992863J743942J856461J913205J918882J918852J944542J947910J973450
$$ 205992863 207736805 209593266 211506471 213425353 215344205 217288747 219236657 221210107
3499.9B21210107K030358K011791J969963K048910K136275K185762K236500K179742
$$ 221210107 223240465 225252256 227222219 229271129 231407404 233593166 235829666 238009408
3516.2B38009408K154321K281412K427340K407282K353221K440870K527118K565056
$$ 238009408 240163729 242445141 244872481 247279763 249632984 252073854 254600972 257166028
3532.5B57166028K660692K699256K614975K691894K932847L065556K951026K821774
$$ 257166028 259826720 262525976 265140951 267832845 270765692 273831248 276782274 279604048
3548.8B79604048K889812L021627L109157L208161L317505L334939L297925L459215
$$ 279604048 282493860 285515487 288624644 291832805 295150310 298485249 301783174 305242389
3565.1C05242389L877312L944159L700435L732711L918827L988623M051030M156172
$$ 305242389 309119701 313063860 316764295 320497006 324415833 328404456 332455486 336611658
3581.5C36611658M200280M323930M574298M559339M316121M418075M687041M738152
$$ 336611658 340811938 345135868 349710166 354269505 358585626 363003701 367690742 372428894
3597.8C72428894M706442M709572M644424M619360M890769N049110M918337M779756
$$ 372428894 377135336 381844908 386489332 391108692 395999461 401048571 405966908 410746664
3614.1D10746664M620075M848659N235344M953027M579753M664659N310387N473286
$$ 410746664 415366739 420215398 425450742 430403769 434983522 439648181 444958568 450431854
3630.4D50431854M687726M546523M766911M714549M596502M446744M290939M478931
$$ 450431854 455119580 459666103 464433014 469147563 473744065 478190809 482481748 486960679
3646.7D86960679N057305M941404M034758L820777M263460M194022L852427L721118
$$ 486960679 492017984 496959388 500994146 504814923 509078383 513272405 517124832 520845950
3663E20845950L569841L454089L694833L747403L242076L305196L276229K666474K529084
$$ 520845950 524415791 527869880 531564713 535312116 538554192 541859388 545135617 547802091 550331175
3681.4E50331175K628744K612948K729535K790273K356648J956642J936316J998782
$$ 550331175 552959919 555572867 558302402 561092675 563449323 565405965 567342281 569341063
3697.7E69341063K006650K046586J969456J817703J836539J944721J909136J599849
$$ 569341063 571347713 573394299 575363755 577181458 579017997 580962718 582871854 584471703
3714E84471703J326918J304090J385093J428842J333833J214743J191974J241028J413643
$$ 584471703 585798621 587102711 588487804 589916646 591250479 592465222 593657196 594898224 596311867
3732.4E96311867J481235J239777R22203P58946R01520J272202J223325J074911J239717
$$ 596311867 597793102 599032879 599955082 600714028 601615548 602887750 604111075 605185986 606425703
3750.7F06425703J013517O87122P78616R64045Q85487P45714Q02159Q40783Q75831
$$ 606425703 607439220 608126342 608904958 609869003 610754490 611500204 612302363 613143146 614018977
3769.1F14018977Q83937P62701P69972R03845R02415O77526N50031O89924P81119P56919
$$ 614018977 614902914 615665615 616435587 617339432 618241847 618919373 619469404 620159328 620940447 621697366
3789.5F21697366P14422O06238N70655N87881O58870Q89241P71463N36680N82457N19872
$$ 621697366 622411788 623018026 623588681 624176562 624835432 625724673 626496136 627032816 627615273 628135145
3809.9F28135145M81128O15240P62939O71446N78046N72026L28124L12387M94004N32329
$$ 628135145 628616273 629231513 629994452 630665898 631243944 631815970 632144094 632456481 632950485 633482814
3830.3F33482814N25117N16534N72264O30379N02884M00722L71635K56419K16842L40819
$$ 633482814 634007931 634524465 635096729 635727108 636229992 636630714 637002349 637258768 637475610 637816429
3850.7F37816429O58453P56561L19362J15097J87754L38793M97222M02391L48866M73917
$$ 637816429 638474882 639231443 639550805 639665902 639853656 640192449 640689671 641092062 641440928 641914845
3871.1F41914845L56614K11239J67370K97844M71175L57628K96175K30134J51992L15964
$$ 641914845 642271459 642482698 642650068 642947912 643419087 643776715 644072890 644303024 644455016 644770980
3891.5F44770980L12805J11938J40369L09646L40461K78175J71125J1683K9027J69277
$$ 644770980 645083785 645195723 645336092 645645738 645986199 646264374 646435499 646447182 646476209 646645486
3911.9F46645486J91510J74582K04086J88411J46150J76072J38820J4841P6711K57969
$$ 646645486 646836996 647011578 647215664 647404075 647550225 647726297 647865117 647879958 647956669 648214638
3932.3F48214638K67744J73092J03474N3227P5102R8049J04010J87040K27690J35719
$$ 648214638 648482382 648655474 648758948 648812175 648887277 648985326 649089336 649276376 649504066 649639785
3952.7F49639785O5208J16467J99259K25007J85609J32024J09673Q8274P2062J06871
$$ 649639785 649704993 649821460 650020719 650245726 650431335 650563359 650673032 650761306 650833368 650940239
3973.1F50940239J65761J77264J22130R1970J03474Q9824Q2612J06990J24872J37627
$$ 650940239 651106000 651283264 651405394 651497364 651600838 651690662 651773274 651880264 652005136 652142763
3993.4F52142763J75119J79290
$$ 652142763 652317882 652497172
3997.5F52497172
$$ 652497172
##END=$$ End of the data block
