##TITLE=G15-52-SE $$ Begin of the data block
##JCAMP-DX=5.00 $$ ACD/SpecManager v 10.08
##SPECTROMETER/DATA SYSTEM=Alpha
##DATE=21 Oct 2013 11:04:12
##DATA TYPE=INFRARED SPECTRUM
##DATA CLASS=XYDATA
##ORIGIN=
##OWNER=
##NPOINTS=1765
##FIRSTX=399.75695801
##LASTX=3997.56933594
##MAXX=3997.56933594
##MINX=399.75695801
##MAXY=0.77606404
##MINY=0.17136323
##XFACTOR=1.0000000000
##YFACTOR=1.000000000000000e-9
##FIRSTY=0.41116253
##DELTAX=2.03957629
##XUNITS=1/CM
##YUNITS=ARBITRARY UNITS
##XYDATA=(X++(Y..Y))
$$ plain form
399.8 411162525 408135593 405671746 404058725 403340429 403572947 404319614 405157298 405995756 405917704
418.1 405917704 404331416 402443260 400734454 399292439 397917986 396019161 393939972 392552465
434.4 392552465 392078787 392467558 393728793 395452559 397153974 398372293 398767233 398748904 398534685
452.8 398534685 397730768 396111250 393919170 391694397 389366478 386776686 384132147 381573111 379148036
471.1 379148036 376817673 374715120 373007923 371690989 370794088 370161712 369501501 368729681 367850333
489.5 367850333 366625190 364814848 362676382 360615551 358664274 356358588 353476226 350494474
505.8 350494474 347682863 344871610 341982335 339170635 336542636 334141850 331974864 330067128
522.1 330067128 328711808 328129947 328209966 328700662 329530776 331034988 333430380 336250216 338825643
$$ packed form
399.8D11162525l026932k463847j613021p18296K32518P46667Q37684Q38458p8052
418.1D05917704j586288j888156j708806j442015j374453j898825k079189j387507
434.4C92552465m73678L88771J261235J723766J701415J218319L94940j8329k14219
452.8C98534685q03917j619518k192080k224773k327919k589792k644539k559036k425075
471.1C79148036k330363k102553j707197j316934q96901o32376o60211p71820q79348
489.5C67850333j225143j810342k138466k060831j951277k305686k882362k981752
505.8C50494474k811611k811253k889275k811700k627999k400786k166986j907736
522.1C30067128j355320n81861Q0019M90696Q30114J504212K395392K819836K575427
$$ plain form
540.5 338825643 340874642 342335254 343045771 342805713 341771901 340511024 339338183 337946296 336039513
558.8 336039513 333848566 331618369 329171926 326251149 323314101 321295589 320596009 321014881 322168946
577.2 322168946 324060589 326905280 330351144 333620042 336340696 338633746 340375662 341164172 341154724
595.6 341154724 340993524 341073871 341293097 341362566 341294318 341366142 341697663 342090756 342435539 342946142
616 342946142 343963653 345631689 347839445 350424290 353234261 356203467 359002918 361276627 363255024
634.3 363255024 365238219 367091924 368673354 370001197 371204168 372385561 373332620 373850673 374182522
652.7 374182522 374632835 375116646 375458807 375737429 376142055 376731545 377477676 378395945 379407763 380653232
673.1 380653232 382219642 383938849 385623455 387169778 388582051 389764458 390557200 390972376 391085982
$$ packed form
540.5C38825643K048999J460612P10517k40058j033812j260877j172841j391887j906783
558.8C36039513k190947k230197k446443k920777k937048k018512o99580M18872J154065
577.2C22168946J891643K844691L445864L268898K720654K293050J741916P88510r448
595.6C41154724j61200Q0347K19226O9469o8248P1824L31521L93093L44783N10603
616C42946142J017511J668036K207756K584845K809971K969206K799451K273709J978397
634.3C63255024J983195J853705J581430J327843J202971J181393R47059N18053L31849
652.7C74182522M50313M83811L42161K78622M04626N89490P46131R18269J011818J245469
673.1C80653232J566410J719207J684606J546323J412273J182407P92742M15176J13606
$$ plain form
691.4 391085982 390842080 390092105 388897806 387855440 387666196 388416439 389715075 391406000 393675536
709.8 393675536 396596700 399973631 403651655 407716483 412336528 417446405 422669172 427696764
726.1 427696764 432473660 437014580 441002578 444081008 446431577 448368698 449896395 450801075 451052934
744.4 451052934 450905770 450564116 449906647 448764533 447279572 445701987 444155365 442809731 441952288
762.8 441952288 442004651 443488955 446523696 450815469 456047297 461952239 468200803 474306166 479736894
781.2 479736894 484344482 488383204 491933197 494943857 497511953 499980509 502748132 505924284
797.5 505924284 509375453 513117135 517186880 521146953 524452507 526938081 528812826 530294001
813.8 530294001 531305015 531657875 531358480 530544817 529204726 527118325 524280727 521144569 518106461
$$ packed form
691.4C91085982k43902p49975j194299j042366j89244P50243J298636J690925K269536
709.8C93675536K921164L376931L678024M064828M620045N109877N222767N027592
726.1D27696764M776896M540920L987998L078430K350569J937121J527697R04680K51859
744.4D51052934j47164l41654o57469j142114j484961j577585j546622j345634q57443
762.8D41952288N2363J484304L034741M291773N231828N904942O248564O105363N430728
781.2D79736894M607588M038722L549993L010660K568096K468556K767623L176152
797.5E05924284L451169L741682M069745L960073L305554K485574J874745J481175
813.8E30294001J011014L52860k99395q13663j340091k086401k837598l136158l038108
$$ plain form
832.1 518106461 515064657 511698961 508127272 504832387 502053022 499620497 497356653 495433271
848.5 495433271 494073629 493112147 492152125 491111726 490543753 491546094 494992316 500685096 507787406
866.8 507787406 515619755 523385465 529989243 534678519 537258625 537653327 535704911 531578779 526039660
885.2 526039660 519958615 513762236 507536471 501453221 495818287 490615398 485301137 479379356
901.5 479379356 472857803 465855092 458264381 450047344 441561818 433379948 425918043 419466376
917.8 419466376 414362580 410831422 408712953 407484829 406595379 405868500 405443311 405326664 405263454
936.2 405263454 405040085 404655069 403857887 401677400 396977752 389463753 379807860 368970394 357632369
954.5 357632369 346147239 334709138 323404074 312253565 301327646 290767252 280784130 271639824
$$ packed form
832.1E18106461l041804l365696l571689l294885k779365k432525k263844j923382
848.5D95433271j359642r61482r60022j040399n67973J002341L446222N692780P102310
866.8E07787406P832349P765710O603778M689276K580106L94702j948416m126132n539119
885.2E26039660o081045o196379o225765o083250n634934n202889n314261n921781
901.5D79379356o521553p002711p590711q217037q485526q181870p461905o451667
917.8D19466376n103796l531158k118469j228124q89450p26879m25189j16647o3210
936.2D05263454k23369l85016p97182k180487m699648p513999r655893j0837466j1338025
954.5C57632369j1485130j1438101j1305064j1150509j0925919j0560394r983122r144306
$$ plain form
970.8 271639824 263558447 256697804 251152813 246922076 243897289 241851181 240441784 239366516
987.1 239366516 238460079 237637445 236835524 236094400 235601470 235468477 235620007 235873535 235944614 235565618
1007.5 235565618 234674439 233380467 231894031 230410352 228978544 227568954 226135626 224620089
1023.9 224620089 223006368 221349970 219722897 218130812 216492772 214753702 212939098 211116791
1040.2 211116791 209346890 207678288 206196696 205019802 204271823 204040274 204342693 205137387 206369102
1058.5 206369102 207972005 209920228 212174222 214350581 215625107 215362921 213893816 212366715
1074.8 212366715 211824685 212599874 214536488 217407003 220986754 224988654 229134157 233214244 237052649
1093.2 237052649 240512118 243456841 245751858 247392952 248622581 249828160 251308620 253160387
$$ packed form
970.8B71639824q081377o860643n544991m230737l024787k046108j409397j075268
987.1B39366516r06437q22634q01921p41124m92930j32993J51530K53528P1079l78996
1007.5B35565618q91179j293972j486436j483679j431808j409590j433328j515537
1023.9B24620089j613721j656398j627073j592085j638040j739070j814604j822307
1040.2B11116791j769901j668602j481592j176894p47979k31549L02419P94694J231715
1058.5B06369102J602903J948223K253994K176359J274526k62186j469105j527101
1074.8B12366715n42030P75189J936614K870515L579751M001900M145503M080087L838405
1093.2B37052649L459469K944723K295017J641094J229629J205579J480460J851767
$$ plain form
1109.5 253160387 255363762 257897198 260617882 263217896 265495002 267453045 269190937 270907819
1125.8 270907819 272889465 275357604 278207988 280988634 283211201 284590006 285087228 284869492 284192711
1144.2 284192711 283280283 282328993 281526268 281024843 280950040 281476319 282816917 285069227 288146138
1162.6 288146138 291850030 296030581 300671965 305831790 311578512 317950815 324868858 332178384
1178.9 332178384 339719385 347243190 354484230 361257166 367304802 372272521 375895828 378160655
1195.2 378160655 379290462 379547924 379162550 378392220 377553880 376958132 376739204 376781195 376906604 377031118
1215.6 377031118 377083749 376904309 376324475 375311464 373915255 372187644 370196313 368111759 366189033
1233.9 366189033 364608318 363415867 362668663 362498164 362988919 364118099 365750283 367767960 370113105
$$ packed form
1109.5B53160387K203375K533436K720684K600014K277106J958043J737892J716882
1125.8B70907819J981646K468139K850384K780646K222567J378805M97222k17736o76781
1144.2B84192711r12428r51290q02725n01425p4803N26279J340598K252310L076911
1162.6B88146138L703892M180551M641384N159825N746722O372303O918043P309526
1178.9C32178384P541001P523805P241040O772936O047636M967719L623307K264827
1195.2C78160655J129807K57462l85374p70330q38340n95748k18928M1991J25409J24514
1215.6C77031118N2631j79440n79834j013011j396209j727611j991331k084554j922726
1233.9C66189033j580715j192451p47204j70499M90755J129180J632184K017677K345145
$$ plain form
1252.3 370113105 372683823 375310570 377839386 380240798 382615715 385075569 387603551 390110880
1268.6 390110880 392509669 394684851 396522462 397973031 399073005 400023103 401066929 402261525
1284.9 402261525 403495729 404608905 405480593 405958831 405844361 405059576 403763235 402146995 400286347
1303.3 400286347 398251086 396177202 394258678 392655551 391444862 390679866 390416592 390555739 390809983
1321.6 390809983 390781343 390092999 388579726 386372775 383788526 381140053 378742605 376800567 375296891
1340 375296891 374144077 373298943 372621447 371870488 370827109 369409949 367692024 365783066 363764584
1358.3 363764584 361485630 358522445 354834467 350937784 347198218 343979001 341143191 338074863
1374.7 338074863 334671170 331017256 327046692 323098272 319859475 317638338 316398680 315964252
$$ packed form
1252.3C70113105K570718K626747K528816K401412K374917K459854K527982K507329
1268.6C90110880K398789K175182J837611J450569J099974R50098J043826J194596
1284.9D02261525J234204J113176Q71688M78238j14470p84785j296341j616240j860648
1303.3D00286347k035261k073884j918524j603127j210689p64996k63274J39147K54244
1321.6C90809983k8640o88344j513273k206951k584249k648473k397448j942038j503676
1340C75296891j152814q45134o77496p50959j043379j417160j717925j908958k018482
1358.3C63764584k278954k963185l687978l896683l739566l219217k835810l068328
1374.7C38074863l403693l653914l970564l948420l238797k221137j239658m34428
$$ plain form
1391 315964252 315932006 315904647 315869451 315947473 316331953 317254007 318640560 320205539 321831435 323549122
1411.4 323549122 325375468 327396035 329656631 332036287 334310204 336603254 338849306 340738028
1427.7 340738028 342061847 342743486 343006104 342752248 342018992 341714710 342108130 342833310 343605101
1446 343605101 344234109 344683230 345144898 346065581 347953856 350562513 353181571 356052220 359390736
1464.4 359390736 363124728 367757946 374411136 383621573 393096894 400896817 407227874 412144661
1480.7 412144661 415521830 417282701 417458743 415616482 411692142 407123566 402102023 395736754
1497 395736754 388843685 382595778 377021432 370150149 359412163 348856837 340186656 332150757
1513.4 332150757 325408489 320602924 317645490 315096438 312248290 309387714 306355029 303675741
$$ packed form
1391C15964252l2246k7359l5196P8022L84480R22054J386553J564979J625896J717687
1411.4C23549122J826346K020567K260596K379656K273917K293050K246052J888722
1427.7C40738028J323819O81639K62618k53856p33256l04282L93420P25180P71791
1446C43605101O29008M49121M61668R20683J888275K608657K619058K870649L338516
1464.4C59390736L733992M633218O653190R210437R475321P799923O331057M916787
1480.7D12144661L377169J760871J76042j842261l924340m568576n021543o365269
1497C95736754o893069o247907n574346o871283j0737986j0555326q670181q035899
1513.4C32150757o742268m805565k957434k549052k848148k860576l032685k679288
$$ plain form
1529.7 303675741 301415861 299106747 297372043 296489120 295528740 294482142 294265956 294949949 296558917
1548 296558917 299099773 302435994 306443363 310890704 316015929 320986181 324461281 327684432 331072539
1566.4 331072539 334330231 337246358 339584619 341672987 343396455 344402224 345076740 345527768 345710695
1584.7 345710695 345581800 345091522 344108939 342576087 340373665 337512434 334016800 329728186 324598610
1603.1 324598610 318762690 312209189 304687172 296568334 288483769 279501319 268595815 258634448
1619.4 258634448 249418512 238693461 227886334 217933059 208508968 200463831 193298191 185719132
1635.7 185719132 179919049 176949233 175534904 175118715 175474435 176436633 177760035 179598883 182091132
1654.1 182091132 184680343 187644035 191599175 196723610 202618703 208574891 215342596 223137021
$$ packed form
1529.7C03675741k259880k309114j734704q82923r60380j046598k16186O83993J608968
1548B96558917K540856L336221M007369M447341N125225M970252L475100L223151L388107
1566.4C31072539L257692K916127K338261K088368J723468J005769O74516M51028J82927
1584.7C45710695j28895m90278r82583j532852k202422k861231l495634m288614n129576
1603.1C24598610n835920o553501p522017q118838q084565q982450j0905504r961367
1619.4B58634448r215936j0725051j0807127r953275r424091q045137p165640p579059
1635.7A85719132n800083k969816j414329m16189L55720R62198J323402J838848K492249
1654.1A82091132K589211K963692L955140N124435N895093N956188O767705P794425
$$ plain form
1670.4 223137021 230538890 238296300 246865764 255187631 263500214 273160249 285306960 296873957
1686.7 296873957 307521641 319617629 332782775 348877251 367613077 386293530 406176150
1701 406176150 422761440 436696976 450312018 461956769 472021997 481212467 489747584 497665405
1717.3 497665405 504055202 509071350 513684809 518009126 521849871 525470734 528877974 531977654
1733.6 531977654 534583509 537113726 540166974 543792307 548078120 553317904 559599578 566850901
1749.9 566850901 574531555 581884801 589325130 596915901 604179621 611290514 617787600 623789549
1766.3 623789549 629791021 635548055 640835285 645310640 649118006 652851403 656537771 659894884
1782.6 659894884 662928700 665825963 668771923 671712041 674334943 676542401 678745091 681047559
$$ packed form
1670.4B23137021P401869P757410Q569464Q321867Q312583R660035J2146711J1566997
1686.7B96873957J0647684J2095988J3165146J6094476J8735826J8680453J9882620
1701D06176150J6585290J3935536J3615042J1644751J0065228R190470Q535117P917821
1717.3D97665405O389797N016148M613459M324317L840745L620863L407240L099680
1733.6E31977654K605855K530217L053248L625333M285813N239784O281674P251323
1749.9E66850901P680654P353246P440329P590771P263720P110893O497086O001949
1766.3F23789549O001472N757034N287230M475355L807366L733397L686368L357113
1782.6F59894884L033816K897263K945960K940118K622902K207458K202690K302468
$$ plain form
1798.9 681047559 683225632 685169637 687057137 689089000 691164136 693054676 694724202 696415126
1815.2 696415126 698173285 699880362 701545060 703276336 705035686 706682742 708101749 709246814
1831.5 709246814 710416496 711718261 712969840 714173734 715500772 716808081 717798889 718564272 719328642
1849.9 719328642 720203996 721156895 722093761 722950518 723777831 724657238 725626528 726609528 727404177 727953315
1870.3 727953315 728504717 729180813 729868650 730575621 731364787 732194781 732991278 733799100 734644175 735409617
1890.7 735409617 736082435 736699045 737279892 737893999 738532007 739088178 739588201 740125418 740657926 741096914
1911.1 741096914 741485357 741969824 742530823 743028343 743417501 743719637 744016528 744391680 744777203 745102346
1931.5 745102346 745398104 745708287 746089220 746513426 746847034 747053444 747278690 747562706 747841716 748125136
$$ packed form
1798.9F81047559K178073J944005J887500K031863K075136J890540J669526J690924
1815.2F96415126J758159J707077J664698J731276J759350J647056J419007J145065
1831.5G09246814J169682J301765J251579J203894J327038J307309R90808P65383P64370
1849.9G19328642Q75354R52899R36866Q56757Q27313Q79407R69290R83000P94649N49138
1870.3G27953315N51402O76096O87837P06971P89166Q29994P96497Q07822Q45075P65442
1890.7G35409617O72818O16610N80847O14107O38008N56171N00023N37217N32508M38988
1911.1G41096914L88443M84467N60999M97520L89158L02136K96891L75152L85523L25143
1931.5G45102346K95758L10183L80933M24206L33608K06410K25246K84016K79010K83420
$$ plain form
1951.9 748125136 748457253 748829663 749162912 749443114 749725759 750092566 750494242 750769019 750920057 751118243
1972.3 751118243 751423895 751699448 751881838 752057314 752288938 752525687 752715886 752878249 753047824 753200293
1992.6 753200293 753309548 753383756 753453314 753573835 753673673 753652036 753543735 753461421 753419638 753328621 753133655
2015.1 753133655 752870858 752615154 752369404 752083361 751720190 751349270 751066744 750827730 750505626 750142276
2035.5 750142276 749880254 749699712 749453962 749114275 748849809 748748600 748701692 748581290 748460770 748483181
2055.9 748483181 748593748 748636663 748622656 748692155 748855352 748994648 749032795 749065876 749201417 749364674
2076.3 749364674 749409139 749377489 749463320 749691129 749890089 749969423 750042379 750204504 750400007 750513434
2096.7 750513434 750592351 750799656 751110554 751326323 751387358 751476645 751728833 752022445 752144873 752142608
$$ packed form
1951.9G48125136L32117L72410L33249K80202K82645L66807M01676K74777J51038J98186
1972.3G51118243L05652K75553J82390J75476K31624K36749J90199J62363J69575J52469
1992.6G53200293J09255P4208O9558J20521R9838k1637j08301q2314m1783r1017j94966
2015.1G53133655k62797k55704k45750k86043l63171l70920k82526k39014l22104l63350
2035.5G50142276k62022j80542k45750l39687k64466j01209m6908j20402j20520K2411
2055.9G48483181J10567M2915j4007O9499J63197J39296L8147L3081J35541J63257
2076.3G49364674M4465l1650Q5831K27809J98960P9334P2956J62125J95503J13427
2096.7G50513434P8917K07305L10898K15769O1035Q9287K52188K93612J22428k265
$$ plain form
2117.1 752142608 752244294 752469897 752623975 752639651 752685368 752874792 753084779 753162265 753180683 753294766
2137.5 753294766 753496170 753656745 753726125 753805220 753998458 754240930 754397333 754510045 754731119 755083382
2157.9 755083382 755435765 755717099 756023407 756458580 756969690 757453501 757923424 758454502 759055674 759629250
2178.2 759629250 760113180 760586202 761132419 761703789 762210131 762672961 763169527 763700366 764180601 764572740
2198.6 764572740 764954686 765407979 765919924 766413391 766844511 767268181 767755210 768255115 768683255 769069493
2219 769069493 769470155 769870043 770244956 770584106 770896614 771204293 771501839 771762013 771986067 772228181
2239.4 772228181 772499859 772745311 772913992 773053169 773274302 773536146 773708463 773808777 773957729 774183929
2259.8 774183929 774407864 774582922 774752736 774966836 775191486 775331318 775378287 775433481 775545478 775686622
$$ packed form
2117.1G52142608J01686K25603J54078J5676M5717J89424K09987P7486J8418J14083
2137.5G53294766K01404J60575O9380P9095J93238K42472J56403J12712K21074L52263
2157.9G55083382L52383K81334L06308M35173N11110M83811M69923N31078O01172N73576
2178.2G59629250M83930M73022N46217N71370N06342M62830M96566N30839M80235L92139
2198.6G64572740L81946M53293N11945M93467M31120M23670M87029M99905M28140L86238
2219G69069493M00662L99888L74913L39150L12508L07679K97546K60174K24054K42114
2239.4G72228181K71678K45452J68681J39177K21133K61844J72317J00314J48952K26200
2259.8G74183929K23935J75058J69814K14100K24650J39832M6969N5194J11997J41144
$$ plain form
2280.2 775686622 775791347 775845468 775911272 776002526 776064038 776050150 775999963 776010931 776054263 776019335 775957584
2302.7 775957584 775942266 775972426 776039183 776036084 775901794 775786042 775803924 775806963 775651515 775453806 775365353
2325.1 775365353 775327325 775219083 774991095 774688482 774427533 774245799 774015725 773643017 773214698 772805989
2345.5 772805989 772525847 772403300 772376120 772398353 772375345 772151291 771668375 771147311 770763159 770318091
2365.9 770318091 769667208 769044280 768613636 768272817 767879486 767427504 767047286 766772807 766481459 766082525
2386.3 766082525 765644073 765267432 764927506 764516592 764005959 763487160 763020217 762513340 761871457 761196554
2406.7 761196554 760616243 760044277 759344459 758579493 757887185 757243633 756510317 755656898 754799128 754007816
2427.1 754007816 753231466 752375185 751452863 750593245 749804020 748947799 747991741 747051477 746209502 745402515
$$ packed form
2280.2G75686622J04725N4121O5804R1254O1512j3888n0187J0968M3332l4928o1751
2302.7G75957584j5318L0160O6757l099j34290j15752J7882L039j55448j97709q8453
2325.1G75365353l8028j08242k27988l02613k60949j81734k30074l72708m28319m08709
2345.5G72805989k80142j22547k7180K2233k3008k24054m82916n21064l84152m45068
2365.9G70318091o50883o22928m30644l40819l93331m51982l80218k74479k91348l98934
2386.3G66082525m38452l76641l39926m10914n10633n18799m66943n06877o41883o74903
2406.7G61196554n80311n71966o99818p64966o92308o43552p33316q53419q57770p91312
2427.1G54007816p76350q56281r22322q59618p89225q56221r56058r40264q41975q06987
$$ plain form
2447.5 745402515 744507670 743540525 742630661 741805553 740949154 740013480 739102900 738280773 737485528 736647606
2467.9 736647606 735762715 734891534 734076023 733247757 732360780 731477022 730648279 729853630 729033947 728181720
2488.3 728181720 727380753 726669133 725946605 725166619 724404752 723683715 722963750 722227871 721490085 720774055
2508.7 720774055 720084786 719379067 718634784 717884600 717135727 716370225 715583563 714791358 714002967 713201940
2529 713201940 712350249 711439729 710513949 709595025 708689392 707790852 706872284 705948293 705047131 704159856
2549.4 704159856 703264236 702374339 701513827 700664759 699813724 698958814 698094368 697245419 696421802 695583999
2569.8 695583999 694712222 693831980 692973077 692116499 691234767 690354288 689503014 688676715 687861741 687051177
2590.2 687051177 686234474 685396910 684544444 683690786 682829499 681940317 681002140 679998696 678963959
$$ packed form
2447.5G45402515q94845r67145r09864q25108q56399r35674r10580q22127p95245q37922
2467.9G36647606q84891q71181q15511q28266q86977q83758q28743p94649q19683q52227
2488.3G28181720q00967p11620p22528p79986p61867p21037p19965p35879p37786p16030
2508.7G20774055o89269p05719p44283p50184p48873p65502p86662p92205p88391q01027
2529G13201940q51691r10520r25780r18924r05633q98540r18568r23991r01162q87275
2549.4G04159856q95620q89897q60512q49068q51035q54910q64446q48949q23617q37803
2569.8F95583999q71777q80242q58903q56578q81732q80479q51274q26299q14974q10564
2590.2F87051177q16703q37564q52466q53658q61287q89182r38177j003444j034737
$$ plain form
2608.6 678963959 677936316 676859558 675677240 674434066 673193097 671935141 670602202 669207335
2624.9 669207335 667786241 666311443 664790750 663274109 661775172 660286188 658791304 657277524
2641.2 657277524 655743122 654225469 652739942 651236594 649700344 648172557 646682918 645214140
2657.5 645214140 643725812 642230988 640778661 639360249 637946129 636525691 635111332 633733153
2673.9 633733153 632389128 631045878 629709125 628420591 627167165 625910401 624651670 623395860
2690.2 623395860 622116864 620800555 619442701 618042529 616620123 615178049 613723516 612258494
2706.5 612258494 610770345 609263659 607720971 606143534 604586005 603059411 601527929 599987447
2722.8 599987447 598485053 597078323 595756590 594461858 593136489 591759324 590400577 589120507
$$ packed form
2608.6F78963959j027643j076758j182318j243174j240969j257956j332939j394867
2624.9F69207335j421094j474798j520693j516641j498937j488984j494884j513780
2641.2F57277524j534402j517653j485527j503348j536250j527787j489639j468778
2657.5F45214140j488328j494824j452327j418412j414120j420438j414359j378179
2673.9F33733153j344025j343250j336753j288534j253426j256764j258731j255810
2690.2F23395860j278996j316309j357854j400172j422406j442074j454533j465022
2706.5F12258494j488149j506686j542688j577437j557529j526594j531482j540482
2722.8E99987447j502394j406730j321733j294732j325369j377165j358747j280070
$$ plain form
2739.1 589120507 587879956 586644590 585410237 584175348 582967341 581778049 580578744 579395533
2755.4 579395533 578232586 577040553 575812280 574592710 573388755 572152853 570877910 569604158
2771.8 569604158 568315685 566965759 565557659 564098179 562564075 560950458 559267998 557542622
2788.1 557542622 555816770 554062366 552210689 550258338 548256397 546249866 544224679 542117715
2804.4 542117715 539897144 537591577 535261810 532915950 530501306 528002501 525420666 522754073
2820.7 522754073 520035863 517256021 514341891 511264920 508048058 504699111 501141906 497244984
2837 497244984 492909938 487996936 482319236 475820661 468708515 461457938 454750448 449246883 445205122
2855.4 445205122 442328513 439967394 437394351 434093028 429977238 425297827 420446813 415871382
$$ packed form
2739.1E89120507j240551j235366j234353j234889j208007j189292j199305j183211
2755.4E79395533j162947j192033j228273j219570j203955j235902j274943j273752
2771.8E69604158j288473j349926j408100j459480j534104j613617j682460j725376
2788.1E57542622j725852j754404j851677j952351k001941k006531k025187k106964
2804.4E42117715k220571k305567k329767k345860k414644k498805k581835k666593
2820.7E22754073k718210k779842k914130l076971l216862l348947l557205l896922
2837D97244984m335046m913002n677700o498575p112146p250577o707490n503565m041761
2855.4D45205122k876609k361119k573043l301323m115790m679411m851014m575431
$$ plain form
2871.7 415871382 411961973 408895165 406601489 404865682 403444320 402126998 400769889 399327427
2888 399327427 397769004 396026760 394089043 391981602 389663845 387087196 384264231 381174982 377703846
2906.4 377703846 373729765 369214267 364159524 358625323 352849007 347160816 341877013 337363422
2922.7 337363422 333931595 331728369 330790192 331082880 332564265 335183024 338797331 343149066 347876310
2941 347876310 352550983 356798559 360392779 363221079 365270615 366694421 367838442 369174600 371112078
2959.4 371112078 373837471 377349585 381597668 386542350 392071366 397994995 404124588 410289168
2975.7 410289168 416369170 422264278 427822798 432902932 437447876 441424966 444805741 447560042
2992 447560042 449661344 451123893 451947629 452137679 451733321 450828701 449579358 448143929 446654826
$$ packed form
2871.7D15871382l909409l066808k293676j735807j421362j317322j357109j442462
2888C99327427j558423j742244j937717k107441k317757k576649k822965l089249l471136
2906.4C77703846l974081m515498n054743n534201n776316n688191n283803m513591
2922.7C37363422l431827k203226r38177K92688J481385K618759L614307M351735M727244
2941C47876310M674673M247576L594220K828300K049536J423806J144021J336158J937478
2959.4C71112078K725393L512114M248083M944682N529016N923629O129593O164580
2975.7D10289168O080002N895108N558520N080134M544944L977090L380775K754301
2992D47560042K101302J462549Q23736J90050m04358r04620j249343j435429j489103
$$ plain form
3010.4 446654826 445187837 443786681 442424983 440971464 439290851 437308699 435050964 432659417
3026.7 432659417 430245370 427826583 425408393 422965825 420450807 417842031 415145576 412372559
3043 412372559 409549713 406690776 403809011 400963753 398117930 395229459 392388940 389668614 387082398
3061.4 387082398 384612143 382242501 380025744 377965719 375970870 374021351 372171491 370418459
3077.7 370418459 368704379 367001265 365355611 363829404 362410307 361031502 359662414 358321726
3094 358321726 357006580 355678082 354300559 352866679 351399273 349903136 348368853 346794546 345203936
3112.4 345203936 343597054 341901720 340104342 338255435 336375445 334478229 332545191 330540895
3128.7 330540895 328501880 326464981 324398339 322290778 320180088 318074256 315960854 313811213
$$ packed form
3010.4D46654826j466989j401156j361698j453519j680613j982152k257735k391547
3026.7D32659417k414047k418787k418190k442568k515018k608776k696455k773017
3043D12372559k822846k858937k881765k845258k845823k888471k840519k720326k586216
3061.4C87082398k470255k369642k216757k060025j994849j949519j849860j753032
3077.7C70418459j714080j703114j645654j526207j419097j378805j369088j340688
3094C58321726j315146j328498j377523j433880j467406j496137j534283j574307j590610
3112.4C45203936j606882j695334j797378j848907j879990j897216j933038k004296
3128.7C30540895k039015k036899k066642k107561k110690k105832k113402k149641
$$ plain form
3145 313811213 311589420 309350640 307166547 304998457 302779585 300529659 298291802 296046764 293778062
3163.4 293778062 291533440 289339662 287157774 284953505 282728374 280507803 278304368 276130736
3179.7 276130736 273996890 271890044 269779444 267670125 265610754 263582885 261554956 259569705
3196 259569705 257643968 255743444 253880531 252095670 250381351 248673439 246951163 245244280 243586093
3214.3 243586093 242003024 240419298 238777801 237132788 235506162 233862072 232203633 230553374
3230.7 230553374 228894621 227197170 225442573 223639116 221801102 219932601 218032777 216109544
3247 216109544 214152038 212144062 210119084 208115309 206116900 204075560 202032730 200071096 198193282
3265.3 198193282 196382985 194651440 193025440 191500634 190056831 188711777 187501669 186433196
$$ packed form
3145C13811213k221793k238780k184093k168090k218872k249926k237857k245038k268702
3163.4B93778062k244622k193778k181888k204269k225131k220571k203435k173632
3179.7B76130736k133846k106846k110600k109319k059371k027869k027929j985251
3196B59569705j925737j900524j862913j784861j714319j707912j722276j706883j658187
3214.3B43586093j583069j583726j641497j645013j626626j644090j658439j650259
3230.7B30553374j658753j697451j754597j803457j838014j868501j899824j923233
3247B16109544j957506k007976k024978k003775j998409k041340k042830j961634j877814
3265.3A98193282j810297j731545j626000j524806j443803j345054j210108j068473
$$ plain form
3281.6 186433196 185462669 184576198 183806941 183143318 182556078 182064816 181662977 181328535 181063771 180828631
3302 180828631 180612057 180426270 180243790 180081904 179980680 179924741 179885492 179846630 179804415 179751202 179678932
3324.5 179678932 179602221 179519504 179437935 179367259 179293945 179179549 179002091 178785890 178538397 178281203
3344.9 178281203 178052828 177822322 177538469 177188605 176795095 176439658 176148936 175856575 175522491 175187036
3365.3 175187036 174893513 174576983 174166501 173733175 173373237 173069939 172780216 172491267 172239125 172066554
3385.7 172066554 171998382 171982080 171882138 171695575 171530366 171468601 171521932 171543568 171428666 171363235 171464607
3408.1 171464607 171619296 171756536 171898350 172083944 172307238 172547504 172843218 173263028 173821643 174476072
3428.5 174476072 175141990 175856858 176660091 177375332 177932531 178536326 179338515 180290610 181278393 182220578
$$ packed form
3281.6A86433196r70527q86471p69257o63623n87240m91262m01839l34442k64764k35140
3302A80828631k16574j85787j82480j61886j01224n5939l9249l8862m2215n3213p2270
3324.5A79678932p6711q2717q1569p0676p3314j14396j77458k16201k47493k57194
3344.9A78281203k28375k30506k83853l49864l93510l55437k90722k92361l34084l35455
3365.3A75187036k93523l16530m10482m33326l59938l03298k89723k88949k52142j72571
3385.7A72066554o8172j6302r9942j86563j65209o1765N3331K1636j14902o5431J01372
3408.1A71464607J54689J37240J41814J85594K23294K40266K95714M19810N58615O54429
3428.5A74476072O65918P14868Q03233P15241N57199O03795Q02189R52095R87783R42185
$$ plain form
3448.9 182220578 183177888 184216082 185323209 186507061 187760338 188988701 190229312 191650957
3465.2 191650957 193188399 194591835 195766360 196933478 198304445 199920803 201636404 203212991
3481.5 203212991 204713121 206339300 208045423 209748566 211492240 213267937 215072617 216892466
3497.8 216892466 218752757 220642254 222411066 224094301 225881159 227806628 229863390 231974289
3514.2 231974289 233989790 236001343 238163710 240461186 242707223 244811311 246907726 249144748
3530.5 249144748 251560062 254092067 256611079 259059191 261616826 264397025 267259121 269941807
3546.8 269941807 272512913 275226355 278073013 280978829 283959359 287097901 290401161 293728977
3563.1 293728977 297012329 300408363 303924799 307409078 310946316 314693481 318607390 322629839
$$ packed form
3448.9A82220578R57310J038194J107127J183852J253277J228363J240611J421645
3465.2A91650957J537442J403436J174525J167118J370967J616358J715601J576587
3481.5B03212991J500130J626179J706123J703143J743674J775697J804680J819849
3497.8B16892466J860291J889497J768812J683235J786858J925469K056762K110899
3514.2B31974289K015501K011553K162367K297476K246037K104088K096415K237022
3530.5B49144748K415314K532005K519012K448112K557635K780199K862096K682686
3546.8B69941807K571106K713442K846658K905816K980530L138542L303260L327816
3563.1B93728977L283352L396034L516436L484279L537238L747165L913909M022449
$$ plain form
3579.4 322629839 326767921 330988795 335239440 339442968 343639493 347876340 352230668 356756598
3595.7 356756598 361375988 365979582 370589912 375312507 380117983 385005951 389932156 394824862
3612.1 394824862 399766773 404757828 409796029 414896578 419841290 424743950 429744780 434843808
3628.4 434843808 440016240 444954216 449812353 454740554 459624499 464512140 469541341 474678189
3644.7 474678189 479791701 484843135 489684641 494163275 498441070 502856910 507340431 511630177
3661 511630177 515830576 520149827 524457097 528592288 532675803 536447406 539701819 542802155 545936704
3679.4 545936704 549085975 552403629 555917025 559362650 562263072 564605355 566854894 569201112
3695.7 569201112 571606040 573920786 576014698 578066528 580330551 582718909 584801376 586295843
$$ packed form
3579.4C22629839M138082M220874M250645M203528M196525M236847M354328M525930
3595.7C56756598M619390M603594M610330M722595M805476M887968M926205M892706
3612.1C94824862M941911M991055N038201N100549M944712M902660N000830N099028
3628.4D34843808N172432M937976M858137M928201M883945M887641N029201N136848
3644.7D74678189N113512N051434M841506M478634M277795M415840M483521M289746
3661E11630177M200399M319251M307270M135191M083515L771603L254413L100336L134549
3679.4E45936704L149271L317654L513396L445625K900422K342283K249539K346218
3695.7E69201112K404928K314746K093912K051830K264023K388358K082467J494467
$$ plain form
3712 586295843 587711394 589412272 591285050 593134403 594788492 596177459 597463310 599055529 600973904
3730.3 600973904 602844536 604224324 605154932 606297672 607840657 609174609 610127032 611494482 612924874
3748.7 612924874 613640845 614175320 615255177 616542876 617529809 618370056 619424462 620573223 621638656
3767.1 621638656 622519553 623270452 624158680 625265121 626436412 627414107 628184855 628918707 629662454
3785.4 629662454 630444050 631353199 632405162 633411944 634323716 635388613 636365652 636926055 637542486
3803.8 637542486 638130367 638497055 639170587 640282750 641365528 642155707 642999828 643607318 643780470
3822.1 643780470 644175112 644830942 645569861 646367431 647221029 648189068 648976028 649287522 649471521 649746001
3842.5 649746001 650075793 650698185 651891172 653199136 653347254 652709723 652998924 653780639 654513419
$$ packed form
3712E86295843J415551J700878J872778J849353J654089J388967J285851J592219J918375
3730.3F00973904J870632J379788R30608J142740J542985J333952R52423J367450J430392
3748.7F12924874P15971N34475J079857J287699R86933Q40247J054406J148761J065433
3767.1F21638656Q80897P50899Q88228J106441J171291R77695P70748P33852P43747
3785.4F29662454P81596R09149J051963J006782R11772J064897R77039N60403O16431
3803.8F37542486N87881L66688O73532J112163J082778P90179Q44121O07490J73152
3822.1F43780470L94642O55830P38919P97570Q53598R68039P86960L11494J83999K74480
3842.5F49746001L29792O22392J192987J307964J48118o37531K89201P81715P32780
$$ plain form
3860.9 654513419 655095398 655636430 656219244 656553268 656753182 657018721 657338560 657867730 658388853 658822477
3881.3 658822477 659262180 659509718 659757733 660085380 660226882 660474718 661133289 661861658 662329495 662506998
3901.7 662506998 662391365 662222683 662281752 662525773 662908435 663373768 663715005 663862824 664018154 664220452
3922.1 664220452 664340913 664476812 664761305 665013433 665090919 665183723 665413201 665718913 666017294 666241646
3942.5 666241646 666448057 666692734 666894257 666991293 667078555 667282045 667545915 667744696 667875350 668011248
3962.9 668011248 668201923 668423474 668637931 668834269 669003785 669142723 669293046 669496953 669726253 669925809
3983.2 669925809 670074165 670215786 670395613 670600832 670826674 671046555 671221256
3997.5 671221256
$$ packed form
3860.9F54513419N81979N41032N82814L34024J99914K65539L19839N29170N21123M33624
3881.3F58822477M39703K47538K48015L27647J41502K47836O58571P28369M67837J77503
3901.7F62506998j15633j68682N9069K44021L82662M65333L41237J47819J55330K02298
3922.1F64220452J20461J35899K84493K52128P7486R2804K29478L05712K98381K24352
3942.5F66241646K06411K44677K01523R7036Q7262K03490K63870J98781J30654J35898
3962.9F68011248J90675K21551K14457J96338J69516J38938J50323K03907K29300J99556
3983.2F69925809J48356J41621J79827K05219K25842K19881J74701
3997.5F71221256
##END=$$ End of the data block
