##TITLE=G15-52-SE $$ Begin of the data block
##JCAMP-DX=5.00 $$ ACD/SpecManager v 10.08
##SPECTROMETER/DATA SYSTEM=Alpha
##DATE=21 Oct 2013 11:04:12
##DATA TYPE=INFRARED SPECTRUM
##DATA CLASS=XYDATA
##ORIGIN=
##OWNER=
##NPOINTS=1765
##FIRSTX=399.75695801
##LASTX=3997.56933594
##MAXX=3997.56933594
##MINX=399.75695801
##MAXY=0.77716070
##MINY=0.17127733
##XFACTOR=1.0000000000
##YFACTOR=1.000000000000000e-9
##FIRSTY=0.41243231
##DELTAX=2.03957629
##XUNITS=1/CM
##YUNITS=ARBITRARY UNITS
##XYDATA=(X++(Y..Y))
$$ plain form
399.8 412432313 409392744 406821191 404976696 404361218 404974729 406046331 406697869 407074481 406943589
418.1 406943589 405460268 403453410 401712030 400172114 398616999 396829486 395059228 393865377
434.4 393865377 393277407 393218309 394131064 396014273 398047507 399442077 399933010 399705082 399110198
452.8 399110198 398292124 397023559 395089477 392785072 390481919 388087928 385154277 382072479 379587442
471.1 379587442 377319247 375162482 373579144 372362912 371441215 370903611 370242894 369195938 368068844
489.5 368068844 366905123 365317196 363140106 360850960 358841240 356628180 353744328 350671709
505.8 350671709 347873122 345164627 342370391 339609593 337012082 334590554 332305163 330296218
522.1 330296218 328968734 328554392 328653514 328914404 329668522 331365645 333954424 336841404 339428425
$$ packed form
399.8D12432313l039569k571553j844495o15478O13511J071602O51538L76612j30892
418.1D06943589j483321k006858j741380j539916j555115j787513j770258j193851
434.4C93865377n87970n9098R12755J883209K033234J394570M90933k27928n94884
452.8C99110198q18074j268565j934082k304405k303153k393991k933651l081798k485037
471.1C79587442k268195k156765j583338j216232r21697n37604o60717j046956j127094
489.5C68068844j163721j587927k177090k289146k009720k213060k883852l072619
505.8C50671709k798587k708495k794236k760798k597511k421528k285391k008945
522.1C30296218j327484m14342R9122K60890P54118J697123K588779K886980K587021
$$ plain form
540.5 339428425 341494620 342914283 343473494 343076229 341977894 340783149 339711040 338271320 336266845
558.8 336266845 334051907 331820339 329441309 326694816 323900372 321928799 321188360 321475416 322590798
577.2 322590798 324501276 327246636 330629259 333978385 336778253 338986784 340620935 341492981 341634274
595.6 341634274 341526777 341514230 341580600 341595620 341517657 341568261 341953933 342423618 342754394 343217820 344214916
618 344214916 345837027 347972602 350600630 353592515 356637388 359381467 361680657 363735586 365786403
636.3 365786403 367721826 369288743 370577008 371885031 373105526 373922408 374434382 374878436 375321627
654.7 375321627 375708014 375950068 376179427 376635402 377297580 378024787 378877312 379952699 381314665
673.1 381314665 382946432 384606272 386172026 387715340 389218807 390442997 391245782 391695619 391816735
$$ packed form
540.5C39428425K066195J419663N59211l97265j098335j194745j072109j439720k004475
558.8C36266845k214938k231568k379030k746493k794444j971573p40439K87056J115382
577.2C22590798J910478K745360L382623L349126K799868K208531J634151Q72046J41293
595.6C41634274j07497j2547O6370J5020p7963N0604L85672M69685L30776M63426R97096
618C44214916J622111K135575K628028K991885L044873K744079K299190K054929K050817
636.3C65786403J935423J566917J288265J308023J220495Q16882N11974M44054M43191
654.7C75321627L86387K42054K29359M55975O62178P27207Q52525J075387J361966
673.1C81314665J631767J659840J565754J543314J503467J224190Q02785M49837J21116
$$ plain form
691.4 391816735 391571999 390868962 389710724 388664156 388429880 389074981 390283883 391966760 394264877
709.8 394264877 397205532 400572538 404204369 408267260 412983119 418173462 423377007 428357869
726.1 428357869 433125913 437652707 441601783 444652468 446961194 448860615 450394005 451287538 451514751
744.4 451514751 451395512 451096177 450468928 449387074 447905421 446204305 444573790 443244427 442415714
762.8 442415714 442505002 443993300 447010309 451299369 456484795 462349385 468633592 474760681 480211109
781.2 480211109 484957904 489151686 492721647 495640218 498090148 500478208 503235519 506460071
797.5 506460071 509966016 513759017 517884016 521893144 525240362 527755260 529596388 530972838
813.8 530972838 531888187 532193005 531908691 531181276 529909372 527762294 524787605 521569610 518539727
$$ packed form
691.4C91816735k44736p03037j158238j046568k34276O45101J208902J682877K298117
709.8C94264877K940655L367006L631831M062891M715859N190343N203545M980862
726.1D28357869M768044M526794L949076L050685K308726J899421J533390Q93533K27213
744.4D51514751j19239k99335o27249j081854j481653j701116j630515j329363q28713
762.8D42415714Q9288J488298L017009M289060N185426N864590O284207O127089N450428
781.2D80211109M746795M193782L569961K918571K449930K388060K757311L224552
797.5E06460071L505945L793001M124999M009128L347218K514898J841128J376450
813.8E30972838R15349L04818k84314p27415j271904k147078k974689l217995l029883
$$ plain form
832.1 518539727 515519679 512130618 508535862 505225241 502411783 499934047 497635037 495716870
848.5 495716870 494388133 493414432 492378503 491281003 490781724 491957784 495508492 501186192 508309782
866.8 508309782 516209722 523956716 530497074 535132825 537629128 537939548 535933495 531758487 526204586
885.2 526204586 520167530 513995886 507738590 501647830 496047527 490846962 485494733 479553014
901.5 479553014 472998202 465939283 458340883 450137615 441615462 433394194 425969720 419593871
917.8 419593871 414510965 410952628 408827603 407592088 406672120 405942947 405536681 405408591 405336767
936.2 405336767 405140191 404774874 403998852 401855439 397148550 389576852 379890233 369077682 357770175
954.5 357770175 346280664 334820151 323519498 312393844 301453769 290834099 280810803
$$ packed form
832.1E18539727l020048l389061l594756l310621k813458k477736k299010j918167
848.5D95716870j328737r73701j035929j097500m99279J176060L550708N677700P123590
866.8E08309782P899940P746994O540358M635751K496303L10420k006053m175008n553901
885.2E26204586o037056o171644o257296o090760n600303n200565n352229n941719
901.5D79553014o554812p058919p598400q203268q522153q221268p424474o375849
917.8D19593871n082906l558337k125025j235515r19968p29173m06266j28090p1824
936.2D05336767j96576l65317p76022k143413m706889p571698r686619j0812551j1307507
954.5C57770175j1489511j1460513j1300653j1125654j0940075j0619670j0023296
$$ plain form
968.8 280810803 271687746 263680816 256898463 251366973 247101367 244066790 242035866 240648866
985.1 240648866 239608377 238725588 237897947 237095520 236369476 235850051 235654175 235783607 236048684 236128345
1005.5 236128345 235767961 234892607 233617947 232150182 230616942 229105890 227695078 226334438 224869743
1023.9 224869743 223237976 221555129 219958365 218419567 216760784 214938536 213109314 211349919
1040.2 211349919 209602267 207902074 206409112 205259100 204538271 204324827 204665169 205490097 206700221
1058.5 206700221 208268285 210216880 212470725 214606300 215844184 215574592 214119285 212631553
1074.8 212631553 212093234 212816447 214725316 217624322 221250191 225276262 229417965 233479112 237317234
1093.2 237317234 240796432 243734837 246006086 247645840 248894662 250108391 251567811 253417969
$$ packed form
968.8B80810803r123057q006930o782353n531490m265606l034577k030924j387000
985.1B40648866j040489q82789q27641q02427p26044n19425j95876J29432K65077P9661
1005.5B36128345l60384q75354j274660j467765j533240j511052j410812j360640j464695
1023.9B24869743j631767j682847j596764j538798j658783j822248j829222j759395
1040.2B11349919j747652j700193j492962j150012p20829k13444L40342Q24928J210124
1058.5B06700221J568064J948595K253845K135575J237884k69592j455307j487732
1074.8B12631553n38319P23213J908869K899006L625869M026071M141703M061147L838122
1093.2B37317234L479198K938405K271249J639754J248822J213729J459420J850158
$$ plain form
1109.5 253417969 255682766 258242846 260891348 263444722 265758783 267763853 269538075 271265805
1125.8 271265805 273197383 275606722 278463840 281287968 283514172 284867793 285364091 285163730 284494311
1144.2 284494311 283560395 282570004 281757206 281292975 281268120 281815201 283138245 285369158 288442194
1162.6 288442194 292136908 296285421 300891697 306058556 311830670 318184346 325086534 332425714
1178.9 332425714 339985698 347501904 354723871 361461580 367471844 372417718 376046985 378329128
1195.2 378329128 379466861 379722834 379314512 378519952 377696663 377126127 376905918 376937777 377066910 377214819
1215.6 377214819 377285004 377104193 376513332 375469416 374054521 372360915 370409131 368340701 366452247
1233.9 366452247 364899158 363680989 362896055 362709850 363182276 364291340 365945369 368003696 370344877
$$ packed form
1109.5B53417969K264797K560080K648502K553374K314061K005070J774222J727730
1125.8B71265805J931578K409339K857118K824128K226204J353621M96298k00361o69419
1144.2B84494311r33916r90391q12798m64231k4855N47081J323044K230913L073036
1162.6B88442194L694714M148513M606276N166859N772114O353676O902188P339180
1178.9C32425714P559984P516206P221967O737709O010264M945874L629267K282143
1195.2C78329128J137733K55973m08322p94560q23289n70536k20209L1859J29133J47909
1215.6C77214819P0185j80811n90861j043916j414895j693606j951784k068430j888454
1233.9C66452247j553089j218169p84934j86205M72426J109064J654029K058327K341181
$$ plain form
1252.3 370344877 372877747 375481874 378023535 380452305 382841110 385299116 387817234 390307307
1268.6 390307307 392696559 394882917 396722823 398151666 399228752 400170475 401222348 402439833
1284.9 402439833 403701395 404839128 405740470 406246901 406140685 405333549 403983742 402319640 400474817
1303.3 400474817 398500621 396458626 394537717 392940015 391742021 390970677 390678823 390788496 391032070
1321.6 391032070 391006798 390326709 388834029 386651605 384064257 381396174 378998190 377054036 375538468
1340 375538468 374402404 373575956 372879982 372100979 371032834 369607449 367911696 366031498 364043027
1358.3 364043027 361774206 358782142 355057001 351130635 347373962 344154716 341321349 338257313
1374.7 338257313 334864169 331209153 327237487 323310316 320070773 317799568 316532671 316122860
$$ packed form
1252.3C70344877K532870K604127K541661K428770K388805K458006K518118K490073
1268.6C90307307K389252K186358J839906J428843J077086R41723J051873J217485
1284.9D02439833J261562J137733R01342N06431j06216q07136j349807j664102j844823
1303.3D00474817j974196k041995j920909j597702j197994p71344k91854J09673K43574
1321.6C91032070k5272o80089j492680k182424k587348k668083k397984j944154j515568
1340C75538468j136064q26448o95974p79003j068145j425385j695753j880198j988471
1358.3C64043027k268821k992064l725141l926366l756673l219246k833367l064036
1374.7C38257313l393144l655016l971666l927171l239543k271205j266897m09811
$$ plain form
1391 316122860 316126257 316137701 316129655 316210210 316586792 317492962 318872720 320452511 322086126 323790461
1411.4 323790461 325610489 327644408 329907328 332273245 334531218 336796939 339022934 340903968
1427.7 340903968 342207402 342872232 343128055 342861563 342158705 341905773 342293918 342981666 343745589
1446 343745589 344399452 344874084 345347255 346252203 348099411 350694418 353325099 356192231 359529406
1464.4 359529406 363273352 367887110 374483973 383648127 393129528 400965869 407313257 412201762
1480.7 412201762 415544033 417282820 417426825 415540785 411580533 406995595 401960760 395585954
1497 395585954 388704270 382477701 376919687 370043397 359284461 348768532 340185970 332202166
1513.4 332202166 325451702 320621103 317651480 315120161 312336832 309531987 306513876 303852350
$$ packed form
1391C16122860L397J1444q046Q0555L76582R06170J379758J579791J633615J704335
1411.4C23790461J820028K033919K262920K365917K257973K265721K225995J881034
1427.7C40903968J303434O64830K55823k66492p02858k52932L88145O87748P63923
1446C43745589O53863M74632M73171R04948J847208K595007K630681K867132L337175
1464.4C59529406L743946M613758O596863R164154R481401P836341O347388M888505
1480.7D12201762L342271J738787J44005j886040l960252m584938n034835o374806
1497C95585954o881684o226569n558014o876290j0758936j0515929q582562p983804
1513.4C32202166o750464m830599k969623k531319k783329k804845l018111k661526
$$ plain form
1529.7 303852350 301617980 299325377 297606766 296724498 295747399 294716030 294567555 295339823 297005475
1548 297005475 299554020 302858174 306810379 311219782 316336870 321323365 324832886 328088582 331482142
1566.4 331482142 334695101 337571532 339929789 342035115 343742996 344742805 345426381 345887512 346057296
1584.7 346057296 345895767 345390916 344405383 342846483 340593159 337695986 334202826 329941571 324848294
1603.1 324848294 319021076 312445164 304933578 296860844 288794130 279788852 268861234 258895874
1619.4 258895874 249670297 238937765 228135109 218186960 208767250 200708166 193501890 185903400
1635.7 185903400 180136532 177195653 175792113 175379544 175721318 176671773 178002447 179835200 182332918
1654.1 182332918 184978336 187989146 191952437 197057799 202938318 208902776 215681225 223486125
$$ packed form
1529.7C03852350k234370k292603j718611q82268r77099j031369j48475P72268J665652
1548B97005475K548545L304154L952205M409403N117088M986495L509521L255696L393560
1566.4C31482142L212959K876431K358257K105326J707881R99809O83576M61131J69784
1584.7C46057296j61529n04851r85533j558900k253324k897173l493160m261255n093277
1603.1C24848294n827218o575912p511586q072734q066714r005278j0927618r965360
1619.4B58895874r225577j0732532j0802656r948149r419710q059084p206276p598490
1635.7A85903400n766868k940879j403540m12569L41774R50455J330674J832753K497718
1654.1A82332918K645418L010810L963291N105362N880519N964458O778449P804900
$$ plain form
1670.4 223486125 230924904 238711566 247259676 255552143 263861269 273518145 285655200 297237307
1686.7 297237307 307912767 320032120 333198547 349266440 367977023 386620879 406480193
1701 406480193 423122555 437127262 450789422 462467670 472526282 481678039 490191132 498141885
1717.3 498141885 504597485 509651661 514277875 518619239 522471547 526074409 529441476 532518864
1733.6 532518864 535148978 537698269 540778100 544472158 548791707 553975105 560193479 567466617
1749.9 567466617 575219154 582614839 590055585 597634375 604877353 611957192 618446469 624454558
1766.3 624454558 630446851 636175811 641468227 646016359 649892688 653645098 657322645 660683572
1782.6 660683572 663736701 666643202 669567227 672459483 675067306 677315354 679549694 681856751
$$ packed form
1670.4B23486125P438779P786662Q548110Q292467Q309126R656876J2137055J1582107
1686.7B97237307J0675460J2119353J3166427J6067893J8710583J8643856J9859314
1701D06480193J6642362J4004707J3662160J1678248J0058612R151757Q513093P950753
1717.3D98141885O455600N054176M626214M341364L852308L602862L367067L077388
1733.6E32518864K630114K549291L079831L694058M319549N183398O218374P273138
1749.9E67466617P752537P395685P440746P578790P242978P079839O489277O008089
1766.3F24454558N992293N728960N292416M548132L876329L752410L677547L360927
1782.6F60683572L053129K906501K924025K892256K607823K248048K234340K307057
$$ plain form
1798.9 681856751 684036374 685992539 687898934 689924598 691961884 693824172 695507526 697238564
1815.2 697238564 699019372 700722992 702374399 704090834 705853045 707504809 708911717 710051715
1831.5 710051715 711218953 712513268 713767290 714998126 716342032 717615962 718574584 719344318 720125735
1849.9 720125735 721031070 722017527 722952485 723765790 724560797 725442350 726414502 727387369 728164613 728720129
1870.3 728720129 729317546 730022669 730706692 731410921 732198954 733022571 733801484 734584153 735420346 736197829
1890.7 736197829 736884296 737513125 738109589 738735974 739376664 739916325 740383565 740909934 741480291 741964936
1911.1 741964936 742364585 742839754 743391991 743885994 744279981 744608045 744923115 745272636 745630980 745950401
1931.5 745950401 746250033 746580660 746968746 747363985 747665942 747866273 748100877 748389602 748663843 748943388
$$ packed form
1798.9F81856751K179623J956165J906395K025664K037286J862288J683354J731038
1815.2F97238564J780808J703620J651407J716435J762211J651764J406908J139998
1831.5G10051715J167238J294315J254022J230836J343906J273930R58622P69734P81417
1849.9G20125735R05335R86457R34958Q13305P95007Q81553R72152R72867P77244N55516
1870.3G28720129N97417P05123O84023P04229P88033Q23617P78913P82669Q36193P77483
1890.7G36197829O86467O28829N96464O26385O40690N39661M67240N26369N70357M84645
1911.1G41964936L99649M75169N52237M94003L93987L28064L15070L49521L58344L19421
1931.5G45950401K99632L30627L88086L95239L01957K00331K34604K88725K74241K79545
$$ plain form
1951.9 748943388 749271750 749640048 749985039 750280142 750563383 750926971 751321375 751595438 751762033 751969993
1972.3 751969993 752277732 752568841 752772391 752956569 753201663 753450155 753614008 753735781 753893912 754058778
1992.6 754058778 754185975 754276752 754355490 754476905 754570961 754545748 754446387 754365146 754305959 754198551 753991783
2015.1 753991783 753725767 753490508 753268659 752977312 752602756 752247691 751973331 751714885 751375318 751004696
2035.5 751004696 750743210 750563085 750322998 750001371 749741197 749614596 749522924 749376416 749275625 749334633
2055.9 749334633 749458313 749499500 749510169 749616683 749792039 749932051 749965370 749984801 750121236 750304282
2076.3 750304282 750371695 750363648 750452220 750648499 750821352 750891387 750955522 751129448 751358092 751493454 751569688
2098.7 751569688 751758039 752059340 752289653 752363443 752439857 752660692 752932727 753071010 753108799 753226399
$$ packed form
1951.9G48943388L28362L68298L44991K95103K83241L63588L94404K74063J66595K07960
1972.3G51969993L07739K91109K03550J84178K45094K48492J63853J21773J58131J64866
1992.6G54058778J27197R0777P8738J21415R4056k5213r9361q1241n9187j07408k06768
2015.1G53991783k66016k35259k21849k91347l74556l55065k74360k58446l39567l70622
2035.5G51004696k61486j80125k40087l21627k60174j26601r1672j46508j00791N9008
2055.9G49334633J23680M1187J0669J06514J75356J40012L3319J9431J36435J83046
2076.3G50304282O7413q047Q8572J96279J72853P0035O4135J73926K28644J35362P6234
2098.7G51569688J88351L01301K30313P3790P6414K20835K72035J38283L7789J17600
$$ plain form
2119.1 753226399 753435314 753580928 753598452 753629923 753813267 754043341 754136622 754170060 754309595 754520714
2139.5 754520714 754654884 754687130 754778445 755025089 755294025 755432546 755510986 755707979 756053388 756414652
2159.9 756414652 756709397 757015467 757455945 757992387 758493841 758963525 759490371 760084987 760632873 761086762
2180.3 761086762 761569619 762161613 762754500 763217747 763618648 764101148 764662325 765192389 765630186 766028106
2200.7 766028106 766480148 766983330 767454624 767872214 768317282 768842936 769362867 769785702 770144403 770521820
2221.1 770521820 770936012 771335006 771658897 771925926 772208750 772508860 772775114 773007572 773266077 773547947
2241.5 773547947 773795724 773985624 774153173 774373889 774628282 774800777 774874508 774982750 775201917 775448322
2261.9 775448322 775635362 775800288 775990903 776182055 776342809 776455820 776526272 776610196 776753008 776885390
$$ packed form
2119.1G53226399K08915J45614J7524L1471J83344K30074R3281L3438J39535K11119
2139.5G54520714J34170L2246R1315K46644K68936J38521P8440J96993L45409L61264
2159.9G56414652K94745L06070M40478N36442N01454M69684N26846N94616N47886M53889
2180.3G61086762M82857N91994N92887M63247M00901M82500N61177N30064M37797L97920
2200.7G66028106M52042N03182M71294M17590M45068N25654N19931M22835L58701L77417
2221.1G70521820M14192L98994L23891K67029K82824L00110K66254K32458K58505K81870
2241.5G73547947K47777J89900J67549K20716K54393J72495P3731J08242K19167K46405
2261.9G75448322J87040J64926J90615J91152J60754J13011P0452Q3924J42812J32382
$$ plain form
2282.3 776885390 776943147 776983500 777075529 777160704 777141571 777070940 777065694 777116477 777119458 777081132 777071953 777103722
2306.7 777103722 777143836 777102113 776965976 776872873 776860774 776806593 776665092 776509583 776433289 776431561 776382208
2329.2 776382208 776174724 775870681 775581956 775305271 775008738 774687588 774285316 773809314 773532033 773467302
2349.6 773467302 773446321 773412883 773318529 773083985 772684216 772266328 771920085 771450460 770773172 770117640
2370 770117640 769633889 769242823 768830419 768407881 768073678 767828047 767559111 767168820 766720951 766335547
2390.4 766335547 765967131 765503109 764974117 764492393 764059961 763556302 762905180 762218297 761648774 761131763
2410.8 761131763 760472119 759679198 758935213 758267820 757544935 756712258 755863786 755061090 754252076 753388703
2431.2 753388703 752492487 751632392 750817776 749963045 749027550 748091102 747237802 746421337 745529294 744574189
$$ packed form
2282.3G76885390N7757M0353R2029Q5175j9133p0631n246N0783K981l8326r179L1769
2306.7G77103722M0114m1723j36137r3103j2099n4181j41501j55509p6294j728m9353
2329.2G76382208k07484l04043k88725k76685k96533l21150m02272m76002k77281o4731
2349.6G73467302k0981l3438r4354k34544l99769m17888l46243m69625o77288o55532
2370G70117640m83751l91066m12404m22538l34203k45631k68936l90291m47869l85404
2390.4G66335547l68416m64022n28992m81724m32432n03659o51122o86883n69523n17011
2410.8G61131763o59644p92921p43985o67393p22885q32677q48472q02696q09014q63373
2431.2G53388703q96216q60095q14616q54731r35495r36448q53300q16465q92043r55105
$$ plain form
2451.5 744574189 743660867 742804885 741935849 741017938 740109384 739291251 738511682 737653673 736743212 735895932
2471.9 735895932 735124290 734327018 733442426 732537925 731692672 730882525 730055392 729217231 728443742 727757394
2492.3 727757394 727044642 726249576 725451946 724710763 724002242 723267138 722513914 721815407 721162677 720465541
2512.7 720465541 719699681 718914926 718135715 717377722 716643751 715876520 715056241 714215040 713346660 712467015
2533.1 712467015 711602271 710714638 709794760 708859444 707908869 706984401 706108332 705253303 704382837 703479350
2553.5 703479350 702574313 701699257 700853288 700006008 699136853 698291361 697497666 696693659 695842743 694979548
2573.9 694979548 694104612 693216443 692351401 691497505 690633476 689792931 688968003 688118637 687285841 686492145
2594.3 686492145 685670912 684800088 683910549 683010042 682079613 681075096 680013478 678962588 677892625
$$ packed form
2451.5G44574189r13322q55982q69036r17911r08554q18133p79569q58009r10461q47280
2471.9G35895932p71642p97272q84592r04501q45253q10147q27133q38161p73489o86348
2492.3G27757394p12752p95066p97630p41183p08521p35104p53224o98507o52730o97136
2512.7G20465541p65860p84755p79211p57993p33971p67231q20279q41201q68380q79645
2533.1G12467015q64744q87633r19878r35316r50575r24468q76069q55029q70466r03487
2553.5G03479350r05037q75056q45969q47280q69155q45492p93695q04007q50916q63195
2573.9F94979548q74936q88169q65042q53896q64029q40545q24928q49366q32796p93696
2594.3F86492145q21233q70824q89539r00507r30429j004517j061618j050890j069963
$$ plain form
2612.7 677892625 676736593 675513506 674273014 672990084 671641409 670271516 668875396 667416751
2629 667416751 665911555 664386511 662859380 661358595 659892261 658413053 656888366 655339241 653787434
2647.3 653787434 652260005 650748432 649231732 647758424 646320999 644831240 643320739 641872227
2663.7 641872227 640436053 638969958 637522459 636125088 634767056 633429408 632101715 630789399
2680 630789399 629521489 628282249 627005577 625695229 624419928 623173118 621877074 620513916 619131565
2698.3 619131565 617748201 616340816 614893198 613386631 611833692 610287964 608743370 607175291
2714.6 607175291 605618238 604086101 602554917 601025879 599528193 598118603 596814334 595528781
2731 595528781 594180346 592808306 591502130 590258300 589003801 587726951 586480498 585286796 584096253
$$ packed form
2612.7F77892625j156032j223087j240492j282930j348675j369893j396120j458645
2629F67416751j505196j525044j527131j500785j466334j479208j524687j549125j551807
2647.3F53787434j527429j511573j516700j473308j437425j489759j510501j448512
2663.7F41872227j436174j466095j447499j397371j358032j337648j327693j312316
2680F30789399j267910j239240j276672j310348j275301j246810j296044j363158j382351
2698.3F19131565j383364j407385j447618j506567j552939j545728j544594j568079
2714.6F07175291j557053j532137j531184j529038j497686j409590j304269j285553
2731E95528781j348435j372040j306176j243830j254499j276850j246453j193702j190543
$$ plain form
2749.3 584096253 582871258 581648469 580459476 579273880 578059077 576822340 575595498 574398518
2765.6 574398518 573192000 571945012 570662200 569344103 568006814 566617310 565125644 563570857
2782 563570857 561990678 560336709 558591723 556839883 555091441 553238869 551267087 549278557 547294915
2800.3 547294915 545246899 543107986 540894747 538638055 536360621 534017861 531562388 529027581
2816.6 529027581 526450396 523808777 521080375 518256962 515314996 512233794 508997917 505595803
2832.9 505595803 501992285 498115718 493824303 488906205 483215630 476727903 469607979 462321758
2849.3 462321758 455562025 450016648 445984900 443119645 440738827 438190222 434950203 430829823
2865.6 430829823 426066160 421156168 416602969 412730455 409653693 407315850 405548275 404112369
$$ packed form
2749.3E84096253j224995j222789j188993j185596j214803j236737j226842j196980
2765.6E74398518j206518j246988j282812j318097j337289j389504j491666j554787
2782E63570857j580179j653969j744986j751840j748442j852572j971782j988530j983642
2800.3E47294915k048016k138913k213239k256692k277434k342760k455473k534807
2816.6E29027581k577185k641619k728402k823413k941966l081202l235877l402114
2832.9E05595803l603518l876567m291415m918098n690575o487727p119924p286221
2849.3D62321758o759733n545377m031748k865255k380818k548605l240019m120380
2865.6D30829823m763663m909992m553199l872514l076762k337843j767575j435906
$$ plain form
2881.9 404112369 402787864 401452035 400039643 398494333 396755815 394796818 392644078 390293181
2898.2 390293181 387719333 384906620 381782353 378262877 374272943 369757414 364731342 359259188
2914.5 359259188 353500903 347754538 342431456 337935567 334524751 332331032 331391662 331678510 333158851
2932.9 333158851 335770279 339370281 343726456 348485380 353208125 357500345 361088276 363879055
2949.2 363879055 365940481 367396981 368542790 369875997 371812105 374543071 378087819 382373899
2965.5 382373899 387327313 392839342 398750246 404909164 411147118 417283386 423193008 428773999
2981.8 428773999 433903098 438471377 442437589 445805967 448565036 450697780 452188909 453023851
2998.1 453023851 453229725 452862799 452000767 450782180 449363261 447861254 446371049 444966167 443599343
$$ packed form
2881.9D04112369j324505j335829j412392j545310j738518j958997k152740k350897
2898.2C90293181k573848k812713l124267l519476l989934m515529n026072n472154
2914.5C59259188n758285n746365n323082m495889l410816k193719r39370K86848J480341
2932.9C33158851K611428L600002M356175M758924M722745M292220L587931K790779
2949.2C63879055K061426J456500J145809J333207J936108K730966L544748M286080
2965.5C82373899M953414N512029N910904O158918O237954O136268N909622N580991
2981.8D28773999N129099M568279L966212L368378K759069K132744J491129Q34942
2998.1D53023851K05874l66926q62032j218587j418919j502007j490205j404882j366824
$$ plain form
3016.5 443599343 442136824 440493822 438584805 436353534 433907002 431445122 429039598 426604360
3032.8 426604360 424110413 421578437 418964863 416260183 413507134 410724729 407887518 404998243
3049.1 404998243 402128518 399291873 396452963 393620342 390842050 388189435 385674775 383270681
3065.5 383270681 381036013 378984541 376996368 375031561 373170018 371436685 369742244 368024498
3081.8 368024498 366356373 364818931 363390803 362013578 360658884 359326392 358017653 356693655
3098.1 356693655 355309993 353881985 352433383 350930095 349356025 347756356 346159875 344532907
3114.4 344532907 342832804 341060698 339204937 337280661 335360616 333424330 331416875 329382122
3130.7 329382122 327335566 325237155 323096573 320952356 318813682 316666931 314487070 312278420
$$ packed form
3016.5D43599343j462519j643002j909017k231271k446532k461880k405524k435238
3032.8D26604360k493947k531976k613574k704680k753049k782405k837211k889275
3049.1D04998243k869725k836645k838910k832621k778292k652615k514660k404094
3065.5C83270681k234668k051472j988173j964807j861543j733333j694441j717746
3081.8C68024498j668125j537442j428128j377225j354694j332492j308739j323998
3098.1C56693655j383662j428008j448602j503288j574070j599669j596481j626968
3114.4C44532907j700103j772106j855761j924276j920045j936286k007455k034753
3130.7C29382122k046556k098411k140582k144217k138674k146751k179861k208650
$$ plain form
3147 312278420 310085535 307916582 305742443 303516924 301234692 298952252 296710312 294503897 292290032
3165.4 292290032 290036589 287774771 285564542 283388346 281166852 278908044 276707739 274582535
3181.7 274582535 272478759 270360559 268256366 266226649 264215589 262170911 260157526 258212715
3198 258212715 256322771 254489958 252709389 250954151 249203235 247465357 245756298 244076177 242434129
3216.4 242434129 240807757 239173859 237566352 235985175 234374568 232718408 231043503 229367107
3232.7 229367107 227656484 225853890 224001765 222168341 220297977 218367323 216429651 214470893
3249 214470893 212477565 210460827 208428502 206401601 204379186 202368528 200394377 198488593 196690723
3267.4 196690723 195001215 193365142 191776544 190323815 189022481 187814847 186714962 185724929
$$ packed form
3147C12278420k192885k168953k174139k225519k282232k282440k241940k206415k213865
3165.4B92290032k253443k261818k210229k176196k221494k258808k200305k125204
3181.7B74582535k103776k118200k104193k029717k011060k044678k013385j944811
3198B58212715j889944j832813j780569j755238j750916j737878j709059j680121j642048
3216.4B42434129j626372j633898j607507j581177j610607j656160j674905j676396
3232.7B29367107j710623j802594j852125j833424j870364j930654j937672j958758
3249B14470893j993328k016738k032325k026901k022415k010658j974151j905784j797870
3267.4A96690723j689508j636073j588598j452729j301334j207634j099885r90033
$$ plain form
3283.7 185724929 184827343 184058264 183406666 182826802 182333395 181940347 181614593 181304023 181011572 180804312
3304.1 180804312 180648550 180468559 180301100 180202797 180173010 180169865 180132166 180052042 179973409 179877996 179734498
3326.5 179734498 179609075 179560483 179527655 179436162 179285794 179097071 178869545 178613767 178362325 178115457
3346.9 178115457 177829593 177504480 177166373 176792234 176421121 176101908 175799355 175492749 175187513 174880177
3367.3 174880177 174537048 174109638 173674345 173359439 173110187 172819778 172514006 172275618 172107533 172002479
3387.7 172002479 171947062 171820626 171592295 171408236 171382055 171482980 171523213 171386749 171277329 171328887
3408.1 171328887 171439305 171559632 171716437 171916723 172163889 172461525 172805712 173234805 173763186 174398392
3428.5 174398392 175081745 175771460 176521629 177256003 177876577 178491890 179258391 180177405 181161627 182134256
$$ packed form
3283.7A85724929q97586p69079o51598n79864m93407l93048l25754l10570k92451k07260
3304.1A80804312j55762j79991j67459r8303k9787l145l7699q0124p8633r5413j43498
3326.5A79734498j25423m8592l2828r1493j50368j88723k27526k55778k51442k46868
3346.9A78115457k85864l25113l38107l74139l71113l19213l02553l06606l05236l07336
3367.3A74880177l43129m27410m35293l14906k49252k90409l05772k38388j68085j05054
3387.7A72002479n5417j26436k28331j84059k6181J00925M0233j36464j09420N1558
3408.1A71328887J10418J20327J56805K00286K47166K97636L44187M29093N28381O35206
3428.5A74398392O83353O89715P50169P34374O20574O15313P66501R19014R84222R72629
$$ plain form
3448.9 182134256 183098257 184112817 185244784 186501905 187788397 188975945 190156743 191552445
3465.2 191552445 193093657 194507927 195712104 196907952 198273927 199878156 201588050 203173891
3481.5 203173891 204698533 206338301 208037809 209712431 211439386 213242590 215069801 216866687
3497.8 216866687 218702808 220593974 222382531 224144980 226064831 228045762 230026498 232044458
3514.2 232044458 234037563 236079589 238270625 240578786 242832512 244964674 247125134 249404415
3530.5 249404415 251799256 254331768 256937146 259472579 262053967 264826149 267654151 270306081
3546.8 270306081 272878855 275614619 278513283 281465828 284450471 287541777 290787667 294127136
3563.1 294127136 297469169 300937980 304537505 308078229 311637282 315388083 319290966 323297232
$$ packed form
3448.9A82134256R64001J014560J131967J257121J286492J187548J180798J395702
3465.2A91552445J541212J414270J204177J195848J365975J604229J709894J585841
3481.5B03173891J524642J639768J699508J674622J726955J803204J827211J796886
3497.8B16866687J836121J891166J788557J762449J919851J980931J980736K017960
3514.2B32044458J993105K042026K191036K308161K253726K132162K160460K279281
3530.5B49404415K394841K532512K605378K535433K581388K772182K828002K651930
3546.8B70306081K572774K735764K898664K952545K984643L091306L245890L339469
3563.1B94127136L342033L468811L599525L540724L559053L750801L902883M006266
$$ plain form
3579.4 323297232 327457905 331725717 335991114 340233117 344537854 348864108 353260070 357821256
3595.7 357821256 362508833 367212713 371917218 376720726 381566614 386404693 391245842 396144301
3612.1 396144301 401153803 406121790 411077112 416222394 421328366 426339030 431357592 436464310
3628.4 436464310 441659957 446606129 451455832 456376702 461315453 466290534 471332848 476417303
3644.7 476417303 481452227 486431271 491309524 495885760 500227511 504707038 509243429 513522983
3661 513522983 517668366 521948636 526226640 530278683 534347415 538207710 541465938 544533432 547691703
3679.4 547691703 550872505 554221451 557722688 561079025 563903868 566279173 568633258 571070731
3695.7 571070731 573522806 575876892 577970088 579979300 582220495 584559023 586569250 588064015
$$ packed form
3579.4C23297232M160673M267812M265397M242003M304737M326254M395962M561186
3595.7C57821256M687577M703880M704505M803508M845888M838079M841149M898459
3612.1C96144301N009502M967987M955322N145282N105972N010664N018562N106718
3628.4D36464310N195647M946172M849703M920870M938751M975081N042314N084455
3644.7D76417303N034924M979044M878253M576236M341751M479527M536391M279554
3661E13522983M145383M280270M278004M052043M068732L860295L258228L067494L158271
3679.4E47691703L180802L348946L501237L356337K824843K375305K354085K437473
3695.7E71070731K452075K354086K093196K009212K241195K338528K010227J494765
$$ plain form
3712 588064015 589554787 591314673 593176663 594988048 596637905 598048568 599352419 600958109 602847457
3730.3 602847457 604652882 606044888 607020557 608159423 609708726 611017406 611908197 613281846 614687800
3748.7 614687800 615315199 615844488 616982579 618285775 619271040 620174825 621331513 622528911 623530269
3767.1 623530269 624302149 625019431 625964284 627147436 628326595 629246354 630017936 630796492 631512523
3785.4 631512523 632274866 633239746 634340227 635392189 636372864 637439370 638308823 638802528 639468789
3803.8 639468789 640063047 640351713 640985787 642110169 643205106 644043565 644959867 645542681 645683289
3822.1 645683289 646164000 646896064 647622108 648341417 649102867 650015473 650768101 651077867 651346743 651714087
3842.5 651714087 652053535 652646363 653780222 655000329 655111551 654492497 654809058 655614972 656358182
$$ packed form
3712E88064015J490772J759886J861990J811385J649857J410663J303851J605690J889348
3730.3F02847457J805425J392006R75669J138866J549303J308680Q90791J373649J405954
3748.7F14687800O27399N29289J138091J303196R85265R03785J156688J197398J001358
3767.1F23530269P71880P17282R44853J183152J179159R19759P71582P78556P16031
3785.4F31512523P62343R64880J100481J051962R80675J066506Q69453M93705O66261
3803.8F39468789N94258K88666O34074J124382J094937Q38459R16302N82814J40608
3822.1F45683289M80711P32064P26044P19309P61450R12606P52628L09766K68876L67344
3842.5F51714087L39448N92828J133859J220107J11222o19054L16561Q05914P43210
$$ plain form
3860.9 656358182 656953216 657542527 658185124 658489108 658600569 658850849 659218848 659814954 660359800 660762727
3881.3 660762727 661164761 661348164 661567926 661938190 662145972 662463486 663131893 663823187 664266706 664415121
3901.7 664415121 664278924 664144456 664259553 664525270 664894998 665329754 665661693 665848613 666034341 666244268
3922.1 666244268 666368544 666492641 666786790 667101562 667230129 667294502 667453587 667726755 668046236 668269157
3942.5 668269157 668432355 668670654 668929636 669096172 669195533 669330478 669533968 669774830 669988692 670144379
3962.9 670144379 670287549 670440614 670627296 670882463 671122074 671263516 671388984 671565652 671779633 672007442
3983.2 672007442 672189772 672304630 672427237 672636509 672907412 673134267 673288107
3997.5 673288107
$$ packed form
3860.9F56358182N95034N89311O42597L03984J11461K50280L67999N96106N44846M02927
3881.3F60762727M02034J83403K19762L70264K07782L17514O68407O91294M43519J48415
3901.7F64415121j36197j34468J15097K65717L69728M34756L31939J86920J85728K09927
3922.1F66244268J24276J24097K94149L14772J28567O4373J59085K73168L19481K22921
3942.5F68269157J63198K38299K58982J66536R9361J34945K03490K40862K13862J55687
3962.9F70144379J43170J53065J86682K55167K39611J41442J25468J76668K13981K27809
3983.2F72007442J82330J14858J22607K09272K70903K26855J53840
3997.5F73288107
##END=$$ End of the data block
