##TITLE=G15-52-SE $$ Begin of the data block
##JCAMP-DX=5.00 $$ ACD/SpecManager v 10.08
##SPECTROMETER/DATA SYSTEM=Alpha
##DATE=21 Oct 2013 11:04:12
##DATA TYPE=INFRARED SPECTRUM
##DATA CLASS=XYDATA
##ORIGIN=
##OWNER=
##NPOINTS=1765
##FIRSTX=399.75695801
##LASTX=3997.56933594
##MAXX=3997.56933594
##MINX=399.75695801
##MAXY=0.77821511
##MINY=0.17112775
##XFACTOR=1.0000000000
##YFACTOR=1.000000000000000e-9
##FIRSTY=0.41358328
##DELTAX=2.03957629
##XUNITS=1/CM
##YUNITS=ARBITRARY UNITS
##XYDATA=(X++(Y..Y))
399.8D13583279l579378k988577j938373m52221M46052O83516P05272N23329k83778
418.1D06699121j409173j703501j557559j473903j467109j621634j821577j618952
434.4C94025713r10342N7072J150817J976519J949877J255780N06908o2197n27710
452.8C99422437p80851j131653k013386k445191k339005k520949k819926k804696k543122
471.1C80023658k328992k072632j689315j375794j061171p69496o72758o90103q40991
489.5C68522406j170040j733988k165139k024054j926244k466619l041982k990842
505.8C51003498k783507k817631k831787k740741k704203k692401k415270j837641
522.1C30180317j110613k99633K70695M36961O76990J471430K482325K956778K746313
$$ plain form
399.8 413583279 410003901 407015324 405076951 404624730 405070782 405754298 406459570 406982899 406699121
418.1 406699121 405289948 403586447 402028888 400554985 399087876 397466242 395644665 394025713
434.4 394025713 393115371 393172443 394323260 396299779 398249656 399505436 400012344 399950147 399422437
452.8 399422437 398641586 397509933 395496547 393051356 390712351 388191402 385371476 382566780 380023658
471.1 380023658 377694666 375622034 373932719 372556925 371495754 370726258 370053500 369363397 368522406
489.5 368522406 367352366 365618378 363453239 361429185 359502941 357036322 353994340 351003498
505.8 351003498 348219991 345402360 342570573 339829832 337125629 334433228 332017958 330180317
522.1 330180317 329069704 328770071 329040766 329477727 330154717 331626147 334108472 337065250 339811563
540.5C39811563K104313J309514M89324m41849j011789r64344j128941j706213k075791
558.8C36385787k192587k253533k399772k810657k865851j902819n03510M33356R70363
577.2C22860777J750946K734721L418833L422350K820045K179861J700818R65089Q1926
595.6C41935366k44498N4300K69264R209k32548N782M51207N49585M09364N33730J023561
618C44764322J640648K170920K636492K988488L041476K707749K288670K114326K028614
636.3C66381705J795739J517296J351922J311690J218945R46969O01410L68864L70562
654.7C75865102M71443M44412K66522K23279N30988R29654R44733Q05945J225918J797944
675.1C83505940J915217J590699J433641J511842J323670Q25554L72052N9605l18855
$$ plain form
540.5 339811563 341915876 343225390 343714714 343272865 342261076 341296732 340167791 338461578 336385787
558.8 336385787 334193200 331939667 329539895 326729238 323863387 321960568 321457058 321890414 322860777
577.2 322860777 324611723 327346444 330765277 334187627 337007672 339187533 340888351 341853440 341935366
595.6 341935366 341690868 341745168 342014432 342023641 341791093 341796875 342248082 342797667 343207031 343740761 344764322
618 344764322 346404970 348575890 351212382 354200870 357242346 359950095 362238765 364353091 366381705
636.3 366381705 368177444 369694740 371046662 372358352 373577297 374524266 375125676 375494540 375865102
654.7 375865102 376336545 376780957 377047479 377270758 377801746 378731400 379676133 380482078 381707996 383505940
675.1 383505940 385421157 387011856 388445497 389957339 391281009 392106563 392478615 392538220 392219365
693.5C92219365q09133j139850r50336k07275O49750J161426J564413K231628K962172
711.8C97682160L452897L717900M111737M741817N164266N166709M989535M757315
728.1D33784336M454523L914744L126502K410143J915098J479000Q47488K04593j31160
746.5D52005267l02434o53744j152008j496226j584053j537442j386494r23633Q4966
764.8D43054199J547098L015757M248619N230486N976052O379634O165951N395264
781.2D81013060M592865M029960L488540K919376K501458K431363K700985L135681
797.5E06813288L586590L956318M122615L948092L365219K492726J796365J395881
813.8E31477094R44972L26633k68757p79092j374662k188385k967656l239870l074407
$$ plain form
693.5 392219365 391410232 390270382 389320046 389112771 389762521 390923947 392488360 394719988 397682160
711.8 397682160 401135057 404852957 408964694 413706511 418870777 424037486 429027021 433784336
728.1 433784336 438238859 442153603 445280105 447690248 449605346 451084346 451931834 452136427 452005267
746.5 452005267 451702833 451049089 449897081 448400855 446816802 445279360 443892866 442969233 443054199
764.8 443054199 444601297 447617054 451865673 457096159 463072211 469451845 475617796 481013060
781.2 481013060 485605925 489635885 493124425 496043801 498545259 500976622 503677607 506813288
797.5 506813288 510399878 514356196 518478811 522426903 525792122 528284848 530081213 531477094
813.8 531477094 532422066 532748699 532479942 531700850 530326188 528137803 525170147 521930277 518855870
832.1E18855870l051996l391922l601313l318905k820194k511204k304673j853287
848.5D96002376j272172r82284j042545j034290m34041J106531L360510N528718P072329
866.8E08305132P906139P783652O536126M594028K507865L64721j978457m186153n618453
885.2E26214600o141961o192803o196142o098330n706668n304962n397975n954534
901.5D79221225o515861o993741p597923q227199q486092q148998p387311o395816
917.8D19468284n120874l571451k109110j214653r09031p35878m10975j18404j00702
936.2D05177206k36869l52830p62105k167105m735887p570982r662807j0791511j1280417
954.5C57616693j1480153j1513263j1374891j1159002j0904938j0532529r960323r137303
$$ plain form
832.1 518855870 515803874 512411952 508810639 505491734 502671540 500160336 497855663 496002376
848.5 496002376 494730204 493747920 492705375 491671085 491237044 492343575 495704085 501232803 508305132
866.8 508305132 516211271 523994923 530531049 535125077 537632942 537997663 536019206 531833053 526214600
885.2 526214600 520072639 513879836 507683694 501585364 495878696 490573734 485175759 479221225
901.5 479221225 472705364 465711623 458113700 449886501 441400409 433251411 425864100 419468284
917.8 419468284 414347410 410775959 408666849 407452196 406543165 405807287 405396312 405277908 405177206
936.2 405177206 404940337 404587507 403825402 401658297 396922410 389351428 379688621 368897110 357616693
954.5 357616693 346136540 334623277 323248386 312089384 301184446 290651917 280691594 271554291
970.8B71554291q073389o824464n500883m208520l010779k027706j388654j043498
987.1B39476398q85412q33750p90268p13438n18501j74791J33351K26363M0755l87728
1007.5B35572979q68857j257464j491487j514346j422256j365095j389996j495495
1023.9B24767983j614556j655772j646057j632497j645430j742915j859575j853481
1040.2B11117700j733020j589760j432032j168087p44715k19703L22863Q01832J218259
1058.5B06573337J599908J965597K248720K127513J235873k53335j432493j487539
1074.8B12577581n33446P29784J869843K833649L588140M035011M179329M094258L836453
1093.2B37210602L473296K970830K310872J635864J200542J190305J505315J898289
$$ plain form
970.8 271554291 263480902 256656438 251155555 246947035 243936256 241908550 240519896 239476398
987.1 239476398 238590986 237757236 236966968 236253530 235735029 235560238 235693589 235919952 235960707 235572979
1007.5 235572979 234704122 233446658 231955171 230440825 229018569 227653474 226263478 224767983
1023.9 224767983 223153427 221497655 219851598 218219101 216573671 214830756 212971181 211117700
1040.2 211117700 209384680 207794920 206362888 205194801 204450086 204230383 204553246 205355078 206573337
1058.5 206573337 208173245 210138842 212387562 214515075 215750948 215497613 214065120 212577581
1074.8 212577581 212044135 212773919 214643762 217477411 221065551 225100562 229279891 233374149 237210602
1093.2 237210602 240683898 243654728 245965600 247601464 248802006 249992311 251497626 253395915
1109.5B53395915K261788K558499K668083K522022K238303J985609J815111J763701
1125.8B71209031J956135K426684K842456K787412K227842J396329N24520k03609o80894
1144.2B84485906r41872r89557p98076m52608j6868N44101J307309K218663L054053
1162.6B88411051L690571M184365M638433N147934N726040O338566O922514P361859
1178.9C32421333P574528P507205P181853O690502N978883M923969L601611K272278
1195.2C78152162J153111K81066l78996p81208q39442n99176k42919J9968J31041J69217
1215.6C77064824J15097j56671o13004j067251j432628j714080j936138k030849j896501
1233.9C66332799j575023j192480p45118j67548M94212J143813J658559K030432K337694
$$ plain form
1109.5 253395915 255657703 258216202 260884285 263406307 265644610 267630219 269445330 271209031
1125.8 271209031 273165166 275591850 278434306 281221718 283449560 284845889 285370409 285166800 284485906
1144.2 284485906 283544034 282554477 281756401 281303793 281286925 281831026 283138335 285356998 288411051
1162.6 288411051 292101622 296285987 300924420 306072354 311798394 318136960 325059474 332421333
1178.9 332421333 339995861 347503066 354684919 361375421 367354304 372278273 375879884 378152162
1195.2 378152162 379305273 379586339 379207343 378426135 377586693 376987517 376744598 376764566 376895607 377064824
1215.6 377064824 377179921 377023250 376410246 375342995 373910367 372196287 370260149 368229300 366332799
1233.9 366332799 364757776 363565296 362820178 362652630 363146842 364290655 365949214 367979646 370317340
1252.3C70317340K570391K640605K550095K425492K380609K427936K484828K503395
1268.6C90300691K420873K175182J814663J421243J094252R97573J099050J208484
1284.9D02532011J223654J104325Q81970N03152j06364p97927j311392j630008j835197
1303.3D00564224j955331k032429j957238j641541j207620p57069k67922J37031K53796
1321.6C91135901n1379p33435j525402k165765k554893k647788k401620j969367j518220
1340C75568032j122474q39264p21842p80850j033396j405179j719326j909673k018690
1358.3C64017338k294273k991646l706396l903568l748416l243089k866596l074765
1374.7C38188589l383190l622889l932357l920794l253698k267033j257479m24802
$$ plain form
1252.3 370317340 372887731 375528336 378078431 380503923 382884532 385312468 387797296 390300691
1268.6 390300691 392721564 394896746 396711409 398132652 399226904 400224477 401323527 402532011
1284.9 402532011 403755665 404859990 405741960 406245112 406138748 405340821 404029429 402399421 400564224
1303.3 400564224 398608893 396576464 394619226 392977685 391770065 391012996 390745074 390882105 391135901
1321.6 391135901 391084522 390351087 388825685 386659920 384105027 381457239 379055619 377086252 375568032
1340 375568032 374445558 373606294 372884452 372103602 371070206 369665027 367945701 366036028 364017338
1358.3 364017338 361723065 358731419 355025023 351121455 347373039 344129950 341263354 338188589
1374.7 338188589 334805399 331182510 327250153 323329359 320075661 317808628 316551149 316126347
1391C16126347l8147k7657P987J32620M09991R10670J378923J602531J667261J736551
1411.4C23907077J836837K000779K211630K365023K299309K292782K208739J840174
1427.7C40962350J290828O79851K44766k98529p03544k20567M16845O75678P23750
1446C43771428O52522N14656M84496Q60393J792461K603382K657890K863854L318489
1464.4C59519571L717214M594415O591976R161860R481996P840276O348699M881650
1480.7D12137657L314346J695693J05739j912564l978372m602253n062253o406843
1497C95291150o879896o205350n568177o896496j0712325j0447920q543044p954896
1513.4C32083046o763935m874617k958357k462894k737969k768635k955527k621919
$$ plain form
1391 316126347 316088200 316060543 316068530 316201150 316611141 317521811 318900734 320503265 322170526 323907077
1411.4 323907077 325743914 327744693 329956323 332321346 334620655 336913437 339122176 340962350
1427.7 340962350 342253178 342933029 343177795 342879266 342175722 341955155 342372000 343047678 343771428
1446 343771428 344423950 344938606 345423102 346283495 348075956 350679338 353337228 356201082 359519571
1464.4 359519571 363236785 367831200 374423176 383585036 393067032 400907308 407256007 412137657
1480.7 412137657 415452003 417147696 417253435 415340871 411362499 406760246 401697993 395291150
1497 395291150 388411254 382205904 376637727 369741231 359028906 348580986 340037942 332083046
1513.4 332083046 325319111 320444494 317486137 315023243 312285274 309516639 306561112 303939193
1529.7C03939193k237170k298862j717866q87900r50605r48846q2433P69525J623780
1548B97208816K541244L343969L986180M384578N071193N012005L534317L250390L390074
1566.4C31722766L223211K890706K327293K025932J665473J045287P34627M65244J52081
1584.7C46252620j71810n22733j021951j582474k242863k893776l505110m248292n074352
1603.1C24989259n824059o570041p521033q105964q094042r012074j0906577r936660
1619.4B59018809r214715j0731935j0804758r965434r438887q063391p198975p565081
1635.7A86035633n748421k961814j413286m15608L27810R52199J341299J861050K549142
1654.1A82528004K654940L000408L970787N123124N880609N958915O794199P824510
$$ plain form
1529.7 303939193 301702023 299403161 297685295 296797395 295846790 294897944 294815511 295585036 297208816
1548 297208816 299750060 303094029 307080209 311464787 316535980 321547985 325082302 328332692 331722766
1566.4 331722766 334945977 337836683 340163976 342189908 343855381 344900668 345635295 346100539 346252620
1584.7 346252620 346080810 345558077 344536126 342953652 340710789 337817013 334311903 330063611 324989259
1603.1 324989259 319165200 312595159 305074126 296968162 288874120 279862046 268955469 259018809
1619.4 259018809 249804094 239072159 228267401 218301967 208863080 200799689 193600714 186035633
1635.7 186035633 180287212 177325398 175912112 175496504 175824314 176776513 178117812 179978862 182528004
1654.1 182528004 185182944 188183352 192154139 197277263 203157872 209116787 215910986 223735496
1670.4B23735496P420928P766708Q585647Q346573Q311093R608805J2113064J1597097
1686.7B97485411J0666430J2087435J3132482J6029835J8666655J8636078J9921392
1701D06625718J6700178J4029920J3683826J1702418J0095001R170860Q484274P953882
1717.3D98446077O554276N137324M627824M313290L857017L625810L366887L084541
1733.6E33013046K682566K582968L073930L682733M324436N203903O215095P234753
1749.9E68013430P756173P430077P449567P572353P247508P118582O521166N993008
1766.3F25101864N964637N711138N274892M551947L918827L804207L693521L331363
1782.6F61352396L019929K903938K923310K877474K613544K255380K230764K325952
$$ plain form
1670.4 223735496 231156424 238923132 247508779 255855352 264166445 273775250 285888314 297485411
1686.7 297485411 308151841 320239276 333371758 349401593 368068248 386704326 406625718
1701 406625718 423325896 437355816 451039642 462742060 472837061 482007921 490492195 498446077
1717.3 498446077 505000353 510137677 514765501 519078791 522935808 526561618 529928505 533013046
1733.6 533013046 535695612 538278580 541352510 545035243 549359679 554563582 560778677 568013430
1749.9 568013430 575769603 583199680 590649247 598221600 605469108 612587690 619108856 625101864
1766.3 625101864 631066501 636777639 642052531 646604478 650523305 654327512 658021033 661352396
1782.6 661352396 664372325 667276263 670199573 673077047 675690591 677945971 680176735 682502687
1798.9F82502687K215743J983702J917005K015650K016008J868725J708805J730264
1815.2F97958589J768112J706123J664996J722098J739978J611650J386166J149893
1831.5G10707605J189947J312792J254320J208306J318931J293123J002193P75456
1847.8G20062673P70748R01878R83238R29773Q21233Q16941Q88586R57668R61005Q11220
1868.2G28904963O06536N90504O73353O67155O96182P90656Q23200P77542P93994Q48233
1888.6G36172318P79391O61850N81324N63204O19829O50048N66423N06163N50806N61655
1909G42213011M72307M10557M78625N40376M93288L98457L18169L14773L88026L90291
1929.4G46417880L12448K78532L13699L75927L84986L13521K35617K56955K78950K50995
$$ plain form
1798.9 682502687 684718430 686702132 688619137 690634787 692650795 694519520 696228325 697958589
1815.2 697958589 699726701 701432824 703097820 704819918 706559896 708171546 709557712 710707605
1831.5 710707605 711897552 713210344 714464664 715672970 716991901 718285024 719287217 720062673
1847.8 720062673 720833421 721735299 722718537 723648310 724469543 725286484 726175070 727132738 728093743 728904963
1868.2 728904963 729511499 730102003 730775356 731442511 732138693 732929349 733752549 734530091 735324085 736172318
1888.6 736172318 736951709 737613559 738194883 738758087 739377916 740027964 740594387 741100550 741651356 742213011
1909 742213011 742685318 743095875 743574500 744114876 744608164 745006621 745324790 745639563 746027589 746417880
1929.4 746417880 746730328 747008860 747322559 747698486 748083472 748396993 748632610 748889565 749168515 749419510
1949.8G49419510K78056L52442L86238L41356K87414K90632L71933L85463K63274J75476
1970.2G52551794K29418L13223K83539J99378J70767K21550K49863K00868J35839J32084
1990.6G54688323J56521J35184P6413O6399J26303J01447o736q7916q7738n3227r4414
2013G55020559k18332k93195k49744k18928k83002l60787l26991k51532k72453l66032
2033.4G52179563l62277k34723j67608k46406l35455k60651j21117q5771j28686q2672
2053.8G50154197N7996J09434L2484P868J12772J79589J19626L7313O6578J45495J34587
2076.3G51157939K2769l2484R5367K53499K24590O4075M1247J71601K20061J17600
2096.7G52336264O9618J95205L09944K19584P4744J29998K82705K75850R7930O497
$$ plain form
1949.8 749419510 749697566 750050008 750436246 750777602 751065016 751355648 751727581 752113044 752376318 752551794
1970.2 752551794 752781212 753094435 753377974 753577352 753748119 753969669 754219532 754420400 754556239 754688323
1990.6 754688323 754844844 754980028 755056441 755122840 755249143 755350590 755343854 755255938 755168200 755114973 755020559
2013 755020559 754802227 754509032 754259288 754040360 753757358 753396571 753069580 752818048 752545595 752179563
2033.4 752179563 751817286 751582563 751414955 751168549 750833094 750572443 750451326 750365555 750236869 750154197
2053.8 750154197 750212193 750321627 750354111 750361979 750474751 750654340 750773966 750811279 750877857 751023352 751157939
2076.3 751157939 751180708 751148224 751243591 751497090 751721680 751785755 751827002 751998603 752218664 752336264
2096.7 752336264 752405882 752601087 752911031 753130615 753205359 753335357 753618062 753893912 753991842 753998339
2117.1G53998339J06275K00331J33157L0518O4432J81616K13563J07765L8624J18375
2137.5G55192995K16663J66953N7101R2029K19644K50399J52170J04428K26140L68356
2157.9G57046878L52800K68579L04222M39942N07176M79102M67658N35250O21616N70119
2178.2G61593342M48048M79042N93782N79834M66943M29749N06103N63085N05448M29034
2198.6G66594410M34637M97162N12600M46618L98636M29332M96447N10335M39584L68953
2219G71128714L82900M12762L69967L14712L20196L40522L03387K41637K18511K53439
2239.4G74286747K77102K38299J89543J83761K22624K27153J59681R4771J23501K19226
2259.8G76222408K40028J59859J29939J86324K17318J74403R2686N8889J05858J53959
$$ plain form
2117.1 753998339 754104614 754304945 754438102 754468620 754533052 754714668 754928231 755035996 755074620 755192995
2137.5 755192995 755409658 755576611 755633712 755725741 755945385 756195784 756347954 756452382 756678522 757046878
2157.9 757046878 757399678 757668257 757972479 758412421 758919597 759398699 759866357 760401607 761023223 761593342
2178.2 761593342 762041390 762520432 763114214 763694048 764160991 764590740 765096843 765659928 766165376 766594410
2198.6 766594410 767029047 767526209 768038809 768485427 768884063 769313395 769809842 770320177 770759761 771128714
2219 771128714 771511614 771924376 772294343 772609055 772929251 773269773 773573160 773814797 774033308 774286747
2239.4 774286747 774563849 774802148 774991691 775175452 775398076 775625229 775784910 775879681 776003182 776222408
2259.8 776222408 776462436 776622295 776752234 776938558 777155876 777330279 777422965 777481854 777587712 777741671
2280.2G77741671J16706M9948L9876P6830P3493M410r954M3452M2617j9133k4378J0610
2304.7G78146148L4213L4749n2333j36733r5963j6630m0412j41561j81496j13606o2824
2327.1G77373552q2194j32978k27452k98798k83420k79903l61681m23491l83497k48193
2347.5G74651945j51277p3135K4140l3081k30968l57866m08232m85122n92947o74665
2367.9G71668792n97596m22120l45409l79265l89635l18289k72274l13163l99172m36545
2388.3G67795324l94106l75032m56750n31853m92394m38988n11765o47307o47366n57422
2408.7G62742341n81205p09772p68424o92188o28293p08937q59082q88109q00431p66754
2429.1G55339146q47876r26912q65221p90477q76129r76920r30726q31366q15570q89838
$$ plain form
2280.2 777741671 777858377 777908325 777948201 778025031 778098524 778102934 778092980 778136432 778179049 778159916 778135538 778146148
2304.7 778146148 778180361 778215110 778162777 778026044 777930081 777913451 777873039 777731478 777549982 777436376 777373552
2327.1 777373552 777291358 777158380 776930928 776632130 776348710 776068807 775707126 775283635 774900138 774651945
2347.5 774651945 774500668 774427533 774451673 774418592 774187624 773829758 773421526 772936404 772343457 771668792
2367.9 771668792 771071196 770649076 770303667 769924402 769534767 769216478 768944204 768631041 768231869 767795324
2388.3 767795324 767401218 767026186 766569436 766037583 765545189 765106201 764594436 763947129 763299763 762742341
2408.7 762742341 762161136 761451364 760682940 759990752 759362459 758653522 757794440 756906331 756105900 755339146
2429.1 755339146 754491270 753564358 752699137 751908660 751032531 750055611 749124885 748293519 747477949 746588111
2449.5G46588111r50039r13500q44896q63254r33707r12368q24094q03292q49008q79944
2469.9G37814009q48949p87854p92205q62658q91865q43465p91490q08299q44657q06928
2490.3G29535639p44760p42316p70748p61330p22825p37191p66336p24912o68824o65784
2510.7G22230613p11381p54655p52270p36594p54058p91014q14139q07882q08596q59857
2531.1G14440167r05693r17256r14931q93712q99911r30011r13858q63612q53598r02593
2551.5G05444992r21309q78096q45611q47280q65221q53956q13365q09073q34763q48949
2571.9F96927369q60811q71241q69393q74698q94904q99852q60333q19862q16643q09133
2592.3F88350499q05080q25882q48055q82387r31382r51529r75728j028895j054049
$$ plain form
2449.5 746588111 745638072 744724572 743879676 743016422 742082715 741170347 740346253 739542961 738693953 737814009
2469.9 737814009 736965060 736177206 735385001 734522343 733630478 732787013 731995523 731187224 730342567 729535639
2490.3 729535639 728790879 728048563 727277815 726516485 725793660 725056469 724290133 723565221 722896397 722230613
2510.7 722230613 721519232 720764577 720012307 719275713 718521655 717730641 716916502 716108620 715300024 714440167
2531.1 714440167 713534474 712617218 711702287 710808575 709908664 708978653 708064795 707201183 706347585 705444992
2551.5 705444992 704523683 703645587 702799976 701952696 701087475 700233519 699420154 698611081 697776318 696927369
2571.9 696927369 696066558 695195317 694325924 693451226 692556322 691656470 690796137 689976275 689159632 688350499
2592.3 688350499 687545419 686719537 685871482 684989095 684057713 683106184 682130456 681101561 680047512
2610.6F80047512j077831j158595j227856j227974j263976j356602j390755j389385
2626.9F69954538j448154j531661j545012j502037j473188j478255j494467j518130
2643.3F57963634j545668j542032j513600j509726Tj477123j469850j501680j485467
2661.6F44408762j445114j470626j484513j423955j367152j341104j334369j353383
2677.9F33188546j341224j276612j258493j286447j287758j267255j251876j279831
2694.3F22939050j349747j404285j428187j457453j480341j485169j495540j512110
2710.6F11326218j550675j578748j549780j525939j528561j519144j508772j460552
2726.9E99104047j362920j297891j305461j338005j305401j247883j273156j289606
$$ plain form
2610.6 680047512 678969681 677811086 676583230 675355256 674091280 672734678 671343923 669954538
2626.9 669954538 668506384 666974723 665429711 663927674 662454486 660976231 659481764 657963634
2643.3 657963634 656417966 654875934 653362334 651852608 650342882 648865759 647395909 645894229 644408762
2661.6 644408762 642963648 641493022 640008509 638584554 637217402 635876298 634541929 633188546
2677.9 633188546 631847322 630570710 629312217 628025770 626738012 625470757 624218881 622939050
2694.3 622939050 621589303 620185018 618756831 617299378 615819037 614333868 612838328 611326218
2710.6 611326218 609775543 608196795 606647015 605121076 603592515 602073371 600564599 599104047
2726.9 599104047 597741127 596443236 595137775 593799770 592494369 591246486 589973330 588683724
2743.2E88683724j233339j204252j223922j239479j224756j190305j176416j195133
2759.5E78996122j203299j175999j167715j224220j292884j311839j300871j318455
2775.8E69000840j403332j500189j546979j588106j652002j707018j749158j795709
2792.2E56058347j862347j940668j978993j984835k023279k127707k258420k311111
2808.5E39570987k291977k333462k434493k507030k568841k665639k763153k820611
2824.8E19185781k917706l084183l240824l400147l618538l921748m337281m924565
2841.1D89740789n698204o528288p154346p285058o743193n550742m055947k861291
2857.4D43863720k379686k605438l293961m125059m751504m930257m605621l900916
$$ plain form
2743.2 588683724 587450385 586246133 585022211 583782732 582557976 581367671 580191255 578996122
2759.5 578996122 577792823 576616824 575449109 574224889 572932005 571620166 570319295 569000840
2775.8 569000840 567597508 566097319 564550340 562962234 561310232 559603214 557854056 556058347
2792.2 556058347 554196000 552255332 550276339 548291504 546268225 544140518 541882098 539570987
2808.5 539570987 537279010 534945548 532511055 530004025 527435184 524769545 522006392 519185781
2824.8 519185781 516268075 513183892 509943068 506542921 502924383 499002635 494665354 489740789
2841.1 489740789 484042585 477514297 470359951 463074893 456331700 450780958 446725011 443863720
2857.4 443863720 441484034 438878596 435584635 431459576 426708072 421777815 417172194 413271278
2873.7D13271278l051370k278269j739531j460374j369536j397103j473278j568913
2890.1C98932904j713783j917511k137512k346128k561122k816767l132581l512860
2906.4C78794640l965944m469514n010098n528629n818873n740762n305261m517763
2922.7C38437796l431797k197564r38326K98112J478285K594441L608555M375934M767120
2941C48992556M725486M282207L585070K800942K045154J436919J168698J376301J970411
2959.4C72383744K755910L567636M300236M955471N531132N964667O227374O285012
2975.7D11971182O149649N928487N606532N126446M573465M000544L405810K801835
2992D49563950K178401J520991Q50141K22803l57360q82268j260906j452655j489282
$$ plain form
2873.7 413271278 410219908 407941639 406202108 404741734 403372198 401975095 400501817 398932904
2890.1 398932904 397219121 395301610 393164098 390817970 388256848 385440081 382307500 378794640
2906.4 378794640 374828696 370359182 365349084 359820455 354001582 348260820 342955559 338437796
2922.7 338437796 335005999 332808435 331870109 332168221 333646506 336240947 339849502 344225436 348992556
2941 348992556 353718042 358000249 361585319 364386261 366431415 367868334 369037032 370413333 372383744
2959.4 372383744 375139654 378707290 383007526 387962997 393494129 399458796 405686170 411971182
2975.7 411971182 418120831 424049318 429655850 434782296 439355761 443356305 446762115 449563950
2992 449563950 451742351 453263342 454113483 454336286 453978926 453096658 451835752 450383097 448893815
3010.4D48893815j434445j371205j357466j438856j634926j928270k246022k437830
3026.7D35044795k460509k439231k443612k461701k528668k639562k712369k775073
3043D14584070k848416k882391k869785k823532k820670k865822k860337k776116k638459
3061.4C89198542k493054k376586k231479k054810j975626j970321j891434j755149
3077.7C72450083j706212j714766j647771j559138j482755j381069j324445j325190
3094C60308737j326681j337707j387566j459658j498312j514226j543641j584411j626402
3112.4C47030133j644433j684874j777261j863450j922846j929253j930416j991719
3128.7C32285881k033651k055585k101004k123863k111077k109111k142071k200216
$$ plain form
3010.4 448893815 447459370 446088165 444730699 443291843 441656917 439728647 437482625 435044795
3026.7 435044795 432584286 430145055 427701443 425239742 422711074 420071512 417359143 414584070
3043 414584070 411735654 408853263 405983478 403159946 400339276 397473454 394613117 391837001 389198542
3061.4 389198542 386705488 384328902 382097423 380042613 378066987 376096666 374205232 372450083
3077.7 372450083 370743871 369029105 367381334 365822196 364339441 362958372 361633927 360308737
3094 360308737 358982056 357644349 356256783 354797125 353298813 351784587 350240946 348656535 347030133
3112.4 347030133 345385700 343700826 341923565 340060115 338137269 336208016 334277600 332285881
3128.7 332285881 330252230 328196645 326095641 323971778 321860701 319751590 317609519 315409303
3145C15409303k249986k233565k184540k213210k289683k293348k255797k246440k243429
3163.4B95199305k240867k237022k208650k178669k191305k224475k235740k204150
3179.7B77478427k177090k182126k157748k095013k042085k032072k041667k001167
3196B60749459j923501j885414j879067j838535j747787j696497j730487j767203j727104
3214.3B44553864j650527j628593j638755j641095j642659j652867j673713j665890
3230.7B31359765j628414j682758j820997j875415j852229j862690j905397j927808
3247B16804057j958191k000213k027437k053708k064332k051637k025559j979828j897782
3265.3A98745370j807615j722187j627177j533181j433536j351267j250088j088485
$$ plain form
3145 315409303 313159317 310925752 308741212 306528002 304238319 301944971 299689174 297442734 295199305
3163.4 295199305 292958438 290721416 288512766 286334097 284142792 281918317 279682577 277478427
3179.7 277478427 275301337 273119211 270961463 268866450 266824365 264792293 262750626 260749459
3196 260749459 258825958 256940544 255061477 253222942 251475155 249778658 248048171 246280968 244553864
3214.3 244553864 242903337 241274744 239635989 237994894 236352235 234699368 233025655 231359765
3230.7 231359765 229731351 228048593 226227596 224352181 222499952 220637262 218731865 216804057
3247 216804057 214845866 212845653 210818216 208764508 206700176 204648539 202622980 200643152 198745370
3265.3 198745370 196937755 195215568 193588391 192055210 190621674 189270407 188020319 186931834
3281.6A86931834r54196q61958p73787o89045o07222n11870m10616l48360k93478k40937
3302A81240365k09183k00674k07111j61096r0450o7175p2851o6638m5404m5985o7160
3324.5A80006638p4953q1703r8690j29700j48013j37314j52245k12118k68877k90379
3344.9A78412646k72736k46644k84403l70682l96937l34382k92957l40253l95939l71530
3365.3A75106183l28675l46631l95060m09931l48463k91884k95744l03298k67088k01792
3385.7A71917617j01775l367o4358k15084k09853m3124Q1584l070j53973p6846R0704
3408.1A71218455J20893J26481J78039K04027K03371K35736L23773M30062N30824O37502
3428.5A74209163O72876P07299P88376P29322N83887O20559Q08686R50307R92372R41098
$$ plain form
3281.6 186931834 185977638 185115680 184341893 183652848 183045626 182533756 182123140 181774780 181481302 181240365
3302 181240365 181031182 180830508 180623397 180462301 180371851 180304676 180231825 180165187 180119783 180073798 180006638
3324.5 180006638 179931685 179849982 179751292 179621592 179473579 179336265 179184020 178971902 178703025 178412646
3344.9 178412646 178139910 177893266 177608863 177238181 176841244 176506862 176213905 175873652 175477713 175106183
3365.3 175106183 174777508 174430877 174035817 173625886 173277423 172985539 172689795 172386497 172119409 171917617
3385.7 171917617 171815842 171812475 171748117 171533033 171323180 171280056 171361640 171358570 171204597 171127751 171218455
3408.1 171218455 171339348 171465829 171643868 171847895 172051266 172287002 172610775 173040837 173571661 174209163
3428.5 174209163 174882039 175589338 176377714 177107036 177690923 178311482 179120168 180070475 181062847 182003945
3448.9A82003945R47222J048893J136899J212746J249328J198113J223862J421228
3465.2A91442236J553089J424208J198187J200736J400113J616031J681686J562520
3481.5B03078806J547769J692921J727030J678362J715630J773134J825720J863793
3497.8B16903165J905143J919195J800835J703635J836762K001748K046913K058163
3514.2B32175559K043515K080918K189308K301484K260387K151996K199277K306596
3530.5B49709040K379388K486377K545089K524734K664238K877831K871394K658487
3546.8B70716578K621740K785206K878755K924651L023922L157944L264159L325492
3563.1B94698447L369063L504694L583490L534645L588200L793091L966003M071981
$$ plain form
3448.9 182003945 182951167 184000060 185136959 186349705 187599033 188797146 190021008 191442236
3465.2 191442236 192995325 194419533 195617720 196818456 198218569 199834600 201516286 203078806
3481.5 203078806 204626575 206319496 208046526 209724888 211440518 213213652 215039372 216903165
3497.8 216903165 218808308 220727503 222528338 224231973 226068735 228070483 230117396 232175559
3514.2 232175559 234219074 236299992 238489300 240790784 243051171 245203167 247402444 249709040
3530.5 249709040 252088428 254574805 257119894 259644628 262308866 265186697 268058091 270716578
3546.8 270716578 273338318 276123524 279002279 281926930 284950852 288108796 291372955 294698447
3563.1 294698447 298067510 301572204 305155694 308690339 312278539 316071630 320037633 324109614
3579.4C24109614M191965M298120M302949M224986M279226M358798M450292M621476
3595.7C58837426M735619M733592M761040M807860M780560M880310M980146M963100
3612.1C97479653N014927M987955M976391N161435N107820M979461M997164N188138
3628.4D37892944N356133N007922M829526M936397M973203M993022N056560N066961
3644.7D78112668N026758N033403M909396M531443M283011M463911M531265M285574
3661E15177429M201948M329384M282355M064024M047215L756642L205716L111184L221810
3679.4E49397707L257990L369152L428758L294587K856850K436459K370418K461195
3695.7E72873116K473831K284527K045571K082050K291799K298593J949311J492321
$$ plain form
3579.4 324109614 328301579 332599699 336902648 341127634 345406860 349765658 354215950 358837426
3595.7 358837426 363573045 368306637 373067677 377875537 382656097 387536407 392516553 397479653
3612.1 397479653 402494580 407482535 412458926 417620361 422728181 427707642 432704806 437892944
3628.4 437892944 443249077 448256999 453086525 458022922 462996125 467989147 473045707 478112668
3644.7 478112668 483139426 488172829 493082225 497613668 501896679 506360590 510891855 515177429
3661 515177429 519379377 523708761 527991116 532055140 536102355 539858997 543064713 546175897 549397707
3679.4 549397707 552655697 556024849 559453607 562748194 565605044 568041503 570411921 572873116
3695.7 572873116 575346947 577631474 579677045 581759095 584050894 586349487 588298798 589791119
3712E89791119J527310J772403J837969J774848J667916J491607J316785J525104J865805
3730.3F04570866J866400J393199R12130J140058J556456J268685Q60154J342595J416564
3748.7F16327107P58529O44683J129509J264512R79245Q79168J065970J113415R70900
3767.1F25133038P98881Q22901J004756J147091J164913R71973Q03054P48574P23720
3785.4F33318901P98643R40978J066983J041949R47773J037836Q85666N07533O51777
3803.8F41198039O31392M30465P38919J084148R69232O97493Q44836O36042K24292
3822.1F47454858M93645P32899P31707O92665P55072R21309P26163L12448K85506L86298
3842.5F53492570M37021O83248J100302J120269R9063n57601L00109P63834P49349
$$ plain form
3712 589791119 591318429 593090832 594928801 596703649 598371565 599863172 601179957 602705061 604570866
3730.3 604570866 606437266 607830465 608742595 609882653 611439109 612707794 613567948 614910543 616327107
3748.7 616327107 617085636 617730319 618859828 620124340 621103585 621982753 623048723 624162138 625133038
3767.1 625133038 625931919 626754820 627759576 628906667 630071580 631043553 631846607 632595181 633318901
3785.4 633318901 634117544 635058522 636125505 637167454 638115227 639153063 640038729 640546262 641198039
3803.8 641198039 641829431 642259896 642998815 644082963 645052195 645749688 646594524 647230566 647454858
3822.1 647454858 647948503 648681402 649413109 650105774 650860846 651782155 652508318 652820766 653106272 653492570
3842.5 653492570 653929591 654612839 655713141 656833410 656932473 656374872 656674981 657438815 658188164
3860.9F58188164O35743N55039N26607K82764J97172L11614M05669N91516N26607M58360
3881.3F62679255M96924K61724K15769L28421K10107K70724N27024N57244M37141K43425
3901.7F66227758m6551n9605J40190K35379L38852M19200K88725J04606J47641K44975
3922.1F68041170J84774J77920K81632K42710R5725P6950J74880K91824L39210K50995
3942.5F70157790J62006J77383K13385J99675J61588J74642K36869K76029K15590J19448
3962.9F72094405J12950J53184J67788J87337K38717K55644K12729J51932J18136J47760
3983.2F73840582J94431K06947K14338K01762J58548J44422J46330
3997.5F75107360
$$ plain form
3860.9 658188164 658823907 659378946 659905553 660188317 660385489 660697103 661102772 661694288 662220895 662679255
3881.3 662679255 663176179 663437903 663653672 663982093 664192200 664462924 664989948 665547192 665984333 666227758
3901.7 666227758 666181207 666121602 666261792 666497171 666836023 667255223 667543948 667648554 667796195 668041170
3922.1 668041170 668225944 668403864 668685496 668928206 669023931 669100881 669275761 669567585 669906795 670157790
3942.5 670157790 670319796 670497179 670710564 670910239 671071827 671246469 671483338 671759367 671974957 672094405
3962.9 672094405 672207355 672360539 672528327 672715664 672954381 673210025 673422754 673574686 673692822 673840582
3983.2 673840582 674035013 674241960 674456298 674658060 674816608 674961030 675107360
3997.5 675107360
##END=$$ End of the data block
