##TITLE=G15-52-CE $$ Begin of the data block
##JCAMP-DX=5.00 $$ ACD/SpecManager v 10.08
##SPECTROMETER/DATA SYSTEM=Alpha
##DATE=21 Oct 2013 11:04:12
##DATA TYPE=INFRARED SPECTRUM
##DATA CLASS=XYDATA
##ORIGIN=
##OWNER=
##NPOINTS=1765
##FIRSTX=399.75695801
##LASTX=3997.56933594
##MAXX=3997.56933594
##MINX=399.75695801
##MAXY=0.78854054
##MINY=0.19565791
##XFACTOR=1.0000000000
##YFACTOR=1.000000000000000e-9
##FIRSTY=0.46943036
##DELTAX=2.03957629
##XUNITS=1/CM
##YUNITS=ARBITRARY UNITS
##XYDATA=(X++(Y..Y))
399.8D69430357j758575j604676j629830j147777k37345M45991K93404m44919j085490
$$ 469430357 467671782 466067106 464437276 463289499 463052154 463498145 463791549 463346630 462261140
418.1D62261140r98705r71318j405924j460791j261145j420170j723796j649588q83937
$$ 462261140 461262435 460291117 458885193 457424402 456163257 454743087 453019291 451369703 450485766
436.5D50485766J63346O83964R15438J211434J105398K90096o92308q26657m42594
$$ 450485766 450649112 451333076 452248514 453459948 454565346 454855442 454163134 453336477 452893883
454.8D52893883j047581k141715k205967j978636k221078k582669k634019k340406
$$ 452893883 451846302 449704587 447498620 445519984 443298906 440716237 438082218 435741812
471.1D35741812k022356j928031j832545j408607q02934m86672p20471j070261j195699
$$ 435741812 433719456 431791425 429958880 428550273 427747339 427260667 426540196 425469935 424274236
489.5D24274236j423240j857221k197355k176732k056449k431065k937168k969951
$$ 424274236 422850996 420993775 418796420 416619688 414563239 412132174 409195006 406225055
505.8D06225055k750247k666295k774298k799511k741516k522438k148986j795620
$$ 406225055 403474808 400808513 398034215 395234704 392493188 389970750 387821764 386026144
522.1C86026144j092046j71066J19925L87M34369J330256K035171K264709K135932
$$ 386026144 384934098 384763032 384882957 384883344 385317713 386647969 388683140 390947849 393083781
540.5C93083781J980990J512379M11868n65768p20202o32853j032382j545578j608342
$$ 393083781 395064771 396577150 396989018 396423250 395703048 395070195 394037813 392492235 390883893
558.8C90883893j476407j772076k468467k765626k235710j463235q43197n6892R64671
$$ 390883893 389407486 387635410 385166943 382401317 380165607 378702372 377859175 377802283 378766954
577.2C78766954J807809K269119K594292K805948K694488K107680J242816N86420L51489
$$ 378766954 380574763 382843882 385438174 388244122 390938610 393046290 394289106 394875526 395227015
595.6C95227015K77042J04487J7405J51575K74896J89930J39773K84106M35561M81486
$$ 395227015 395504057 395608544 395625949 395777524 396052420 396242350 396382123 396666229 397101790 397583276
616C97583276O09994J304001K298712K720356K603054K562255K596498K506434K259523
$$ 397583276 398193270 399497271 401795983 404516339 407119393 409681648 412278146 414784580 417044103
634.3D17044103J899302J685023J700759J563788J181364R86904J110017J047611N60552
$$ 417044103 418943405 420628428 422329187 423892975 425074339 426061243 427171260 428218871 428779423
652.7D28779423J06514J00851L76165M19438K80082L43352P25687J297980J184881
$$ 428779423 428885937 428986788 429362953 429782391 430062473 430405825 431131512 432429492 433614373
671D33614373J131296J617104K002925J840532J492947J366198J290977R12845L15279
$$ 433614373 434745669 436362773 438365698 440206230 441699177 443065375 444356352 445269197 445584476
689.4D45584476q7053k40266n26160r17315o98805L12030J394153J857310J932293
$$ 445584476 445497423 445257157 444730997 443813682 443114877 443426907 444821060 446678370 448610663
707.7D48610663K378703L133684L476858L414184L625214M339725M933357M827678
$$ 448610663 450989366 454123050 457599908 461014092 464639306 468979031 473912388 478740066
724D78740066M494161M421830M340738L711075K661258K008825J933873J699745Q66831
$$ 478740066 483234227 487656057 491996795 495707870 498369128 500377953 502311826 504011571 504878402
742.4E04878402J75595K00093M18961J03533n80847q65340p78020r22322j122952p65681
$$ 504878402 505053997 505254090 505673051 505776584 505195737 504330397 503552377 502630055 501507103 500741422
762.8E00741422J64569J295328K274394L286123M554689N458832N475580M983306M542709
$$ 500741422 500905991 502201319 504475713 507761836 512316525 517775357 523250937 528234243 532776952
781.2E32776952M211247L605902K694249K142847K122819K191246K083182K100110
$$ 532776952 536988199 540594101 543288350 545431197 547554016 549745262 551828444 553928554
797.5E53928554K760649L668904L789663L085494K571643K515435K120495J165926
$$ 553928554 556689203 560358107 564147770 567233264 569804907 572320342 574440837 575606763
813.8E75606763N09918M65751K47359o37054j663268k081513j950503k011835k408028
$$ 575606763 576116681 576582432 576829791 576192737 574529469 572447956 570497453 568485618 566077590
832.1E66077590k533555k225459k010882k310633k521575j959979j241744j138627
$$ 566077590 563544035 561318576 559307694 556997061 554475486 552515507 551273763 550135136
848.5E50135136j271248r50694l63231k15650l29315O02543K937496N103171N787551
$$ 550135136 548863888 547913194 547549963 547334313 547004998 547607541 550545037 555648208 561435759
866.8E61435759N641818N688965N398095L846705J563668k37286j468003k889633m438400
$$ 561435759 567077577 572766542 578164637 582011342 583575010 583337724 581869721 578980088 574541688
885.2E74541688n189300m974782m690349m900456n093693m716456m364550m866302
$$ 574541688 569352388 564377606 559687257 554786801 549693108 544976652 540612102 535745800
901.5E35745800n861998o466031o617785o918192p469058p566213o767750n596280
$$ 535745800 529883802 523417771 516799986 509881794 502412736 494846523 488078773 482482493
917.8D82482493m602313l571808k293975j280129j038760j184970r76681m30018k26885
$$ 482482493 477880180 474308372 472014397 470734268 469695508 468510538 467533857 467103839 466876954
936.2D66876954n69850r30786j159847k079189m264027o864101q667200r538889j0081232
$$ 466876954 466307104 465376318 464216471 462137282 457873255 451009154 442341954 432803065 422721833
954.5D22721833j0572374j0775953j0631532j0552108j0716409j0738194j0327130
$$ 422721833 412149459 401373506 390741974 380189866 369473457 358735263 348408133
968.8C48408133r629607q845568p950842o810666n448281m152835l176540k440512
$$ 348408133 338778526 329932958 321982116 315171450 309723169 305570334 302393794 299953282
985.1B99953282j778633j312762j189232j196146j031876o89268l72082k03311j61350
$$ 299953282 298174649 296861887 295672655 294476509 293444633 292755365 292383283 292179972 292018622
1003.5B92018622k84225o77049j256495j750023j939833j897067j880616j967758k040475
$$ 292018622 291734397 291057348 289800853 288050830 286110997 284213930 282333314 280365556 278325081
1021.8B78325081k063394k109557k225787k317816k223134k040207k065241k254665
$$ 278325081 276261687 274152130 271926343 269608527 267385393 265345186 263279945 261025280
1038.1B61025280k239913k028316j867980j738995j494080j025736l92795K02328O59466
$$ 261025280 258785367 256757051 254889071 253150076 251655996 250630260 250237465 250439793 251099259
1056.5B51099259J074701J487732J840770K042592J872331J075148k05874j188964
$$ 251099259 252173960 253661692 255502462 257545054 259417385 260492533 260286659 259097695
1072.8B59097695j173734k20448J137048K397269L319919L946096M362374M530967
$$ 259097695 257923961 257703513 258840561 261237830 264557749 268503845 272866219 277397186
1089.1B77397186M413515M111558L736436L277183K655953J927793J435697J433224
$$ 277397186 281810701 285922259 289658695 292935878 295591831 297519624 298955321 300388545
1105.4C00388545J799851K243013K610236K958119L185093L034652K609640K263129
$$ 300388545 302188396 304431409 307041645 309999764 313184857 316219509 318829149 321092278
1121.8C21092278K123058K112507K250940K685219L143907L072917K419293J524806
$$ 321092278 323215336 325327843 327578783 330264002 333407909 336480826 338900119 340424925
1138.1C40424925O74725J9163m47929p65205q36253o19650k68549J23442P27266J639932
$$ 340424925 341099650 341118813 340670884 339905679 339069426 338449776 338181227 338304669 339031935 340671867
1158.5C40671867K618283L401846L998071M570961N212009N850166O408691O933689
$$ 340671867 343290150 346691996 350690067 355261028 360473037 366323203 372731894 379665583
1174.8C79665583P430077P738203P648378P231385O732732O126285N188226L899932
$$ 379665583 387095660 394833863 402482241 409713626 416446358 422572643 427760869 431660801
1191.1D31660801K586037J501024N15759m44621j100928j282692j177877j027345q76964
$$ 431660801 434246838 435747862 436263621 435819000 434718072 433435380 432257503 431230158 430353194
1209.5D30353194o84350n04285n44608q41469j121610j267880j460076j818299k142608
$$ 430353194 429668844 429164559 428619951 427778482 426656872 425388992 423928916 422110617 419968009
1227.8D19968009k196252k022893j828730j620114j183241n14060J26153O30110J142949
$$ 419968009 417771757 415748864 413920134 412300020 411116779 410602719 410728872 411358982 412501931
1246.2D12501931J730025K234578K451837K455235K467394K526044K506376K371669
$$ 412501931 414231956 416466534 418918371 421373606 423841000 426367044 428873420 431245089
1262.5D31245089K287119K354682K429723K286345J945675J605004J330137J056582
$$ 431245089 433532208 435886890 438316613 440602958 442548633 444153637 445483774 446540356
1278.8D46540356Q77171R44019J168579J279026J097411P59929L97474q1211p71583
$$ 446540356 447417527 448361546 449530125 450809151 451906562 452666491 453063965 452982754 452211171
1297.2D52211171j475751j893908k042740k173424k297133k171606j777947j264632
$$ 452211171 450735420 448841512 446798772 444625348 442328215 440156609 438378662 437114030
1313.5D37114030p53730k47807K90692O12885L47793m10110j225829j845240k245576
$$ 437114030 436360300 436112493 436403185 437016070 437363863 436953753 435727924 433882684 431637108
1331.8D31637108k443313k383769k001941j319468p19518n27888n80698p13557r86278
$$ 431637108 429193795 426810026 424808085 423488617 422769099 422241211 421660513 420946956 419960678
1350.2D19960678j367957j682967j847952k056986k582342l252268l657043l871798
$$ 419960678 418592721 416909754 415061802 413004816 410422474 407170206 403513163 399641365
1366.5C99641365l920913l500879l224939l344625l439754l741026m182428m223079
$$ 399641365 395720452 392219573 388994634 385650009 382210255 378469229 374286801 370063722
1382.8C70063722l675878k697408j446039n96344m50462m11004r7007L19124Q59916
$$ 370063722 366387844 363690436 362244397 361648053 361197591 360786587 360689580 361008704 361868620
1401.2C61868620J351714J804769K149105K252758K329439K332538K158731K181471
$$ 361868620 363220334 365025103 367174208 369426966 371756405 374088943 376247674 378429145
1417.5C78429145K918005L302693K964437K534777J873761J130879M37945l92794j183629
$$ 378429145 381347150 384649843 387614280 390149057 392022818 393153697 393591642 393198848 392015219
1435.9C92015219r12816J3948L06815K74181L25740N25355O13063L37393K18302J243174
$$ 392015219 391102403 391116351 391423166 391697347 392023087 392548442 393161505 393498898 393717200 394960374
1456.2C94960374L551840M245758L587306L563672M262626M882008O001294Q449554
$$ 394960374 398512214 402757972 406345278 409908950 414171576 419053584 425054878 433504432
1472.6D33504432R636909Q264989O274164M253417K404809M06056j851469l949851
$$ 433504432 443141341 451406330 457680494 461933911 464338720 464744776 462893307 458943456
1488.9D58943456n056053n224973o394178q155673p921815o823331o817103r337455
$$ 458943456 453887403 448662430 442268252 434112579 426190764 419367433 412550330 403212875
1505.2D03212875j2900770j0563522q271218q364498p701814n806029l691375k981067
$$ 403212875 390312105 379748583 371477365 363112867 355411053 349605024 345913649 342932582
1521.5C42932582k822459k755999k920121k640397k671718k767414j993746j679539
$$ 342932582 340110123 337354124 334434003 331793606 329121888 326354474 324360728 322681189
1537.8C22681189j947999o71238J027852J844824K341508K927006L545314L917664
$$ 322681189 320733190 320061952 321089804 322934628 325276136 328203142 331748456 335666120
1554.1C35666120L845692M666686O480187N345970M127890L673256L201425L102541
$$ 335666120 339511812 344178498 350658685 356004655 360132545 363805801 367007226 370109767
1570.5C70109767K600133J770795J455217J326949P89433J25706l22520p38174j208156
$$ 370109767 372709900 374480695 375935912 377262861 378052294 378178000 377855480 377117306 375909150
1588.8C75909150j730532k252906k871991l451675m039496m804760n591542o314844
$$ 375909150 374178618 371925712 369053721 365602046 361562550 356757790 351166248 344851404
1605.1C44851404p096618p985651q506090q707076r903848j1518747j0204226r821445
$$ 344851404 337754786 329769135 321263045 312555969 302652121 291133374 280929148 271107703
1621.4B71107703j1521726j1251048j0146230r520412q292988p770508p958263n350188
$$ 271107703 259585977 248334929 238188699 228668287 220375299 212604791 204646528 199296340
1637.8A99296340k334281j011312k92838M59477J495704J749680J910418L386840M000053
$$ 199296340 196962059 195950747 195657909 196117386 197613090 199362770 201273188 204660028 208660081
1656.1B08660081L797099M311934N439401O434351O321475O852493Q123606P916376
$$ 208660081 212457180 216769114 222208515 228642866 234964341 241816834 249940440 257856816
1672.4B57856816Q152247R047001Q673996Q126080R075731J2190968J2399673J1207193
$$ 257856816 266009063 275056064 283730060 291856140 300931871 313122839 325522512 336729705
1688.8C36729705J2337774J2981862J5336275J7871231J8164277K0307690J7401278
$$ 336729705 349067479 362049341 377385616 395256847 413421124 433728814 451130092
1703D51130092J4158458J3821870J2013972R927153Q205235P008732P217466P314146
$$ 451130092 465288550 479110420 491124392 501051545 509256780 516265512 523482978 530797124
1719.3E30797124N909502M652143M058838L449023K825796K147019K255678L339887
$$ 530797124 536706626 541358769 545417607 548866630 551692426 553839445 556095123 559435010
1735.7E59435010L377676L235817L819287M552781N184889N781889O869793Q109987
$$ 559435010 562812686 566048503 569867790 574420571 579605460 585387349 592257142 600367129
1752F00367129P942200P495224P343531O901323P057250O861150N866945N141974M773438
$$ 600367129 608309329 615804553 623148084 630049407 637106657 643967807 649834752 654976726 659750164
1770.3F59750164N141496N450607M619300L812909L586471L436327L139556K933859
$$ 659750164 664891660 670342267 674961567 678774476 682360947 685797274 688936830 691870689
1786.7F91870689K529204J979053K247691K748371K496779K093374K087593K241314
$$ 691870689 694399893 696378946 698626637 701375008 703871787 705965161 708052754 710294068
1803G10294068K179742J962721J706839J667142J807570J830578J735270J614213J354813
$$ 710294068 712473810 714436531 716143370 717810512 719618082 721448660 723183930 724798143 726152956
1821.3G26152956J146257J263559J274944J180350J565934J752317J380980J145660
$$ 726152956 727299213 728562772 729837716 731018066 732584000 734336317 735717297 736862957
1837.6G36862957J025200O72996N51582J102030J422048J284182J100600R00208P91669
$$ 736862957 737888157 738561153 739112735 740214765 741636813 742920995 744021595 744921803 745713472
1856G45713472P86662Q25346P77841N63263K32041K92421R41813J205206R34422P44641
$$ 745713472 746500134 747325480 748103321 748666584 748898625 749191046 750132859 751338065 752272487 753017128
1876.4G53017128O86705O32465O48915O97017O02603M32908N85139P89881O88076O15954
$$ 753017128 753703833 754336298 754985213 755682230 756284833 756717741 757302880 758092761 758780837 759396791
1896.8G59396791O14524N91994N50031M34518K98619L26276N07176N08130K17378N9128
$$ 759396791 760011315 760603309 761153340 761587858 761886477 762212753 762719929 763228059 763445437 763504565
1917.2G63504565L74019N63741M43875M57287M89772M10080K88248J81198J86980K75969
$$ 763504565 763878584 764442325 764886200 765343487 765833259 766243339 766531587 766712785 766899765 767175734
1937.6G67175734J66774m6253J16348M43637M55380K65538J62304K40207L43442K71618
$$ 767175734 767342508 767296255 767412603 767856240 768311620 768577158 768739462 768979669 769323111 769594729
1958G69594729J41859J74522K70427K29895J71006K08973K83063L07977J94669P9632
$$ 769594729 769736588 769911110 770181537 770411432 770582438 770791411 771074474 771382451 771577120 771656752
1978.4G71656752J26540K21849J37150m0054n0783Q3386J84715J59025J01805J74105
$$ 771656752 771783292 772005141 772142291 772102237 772051454 772134840 772319555 772478580 772580385 772754490
1998.8G72754490K26498M6253j28388p2301M7684k7597k35796l06010j45733j8418
$$ 772754490 772980988 773027241 772898853 772826552 772874236 772846639 772610843 772304833 772159100 772140682
2019.2G72140682j72079l18110k18332j00732j70946k89976k73645j67728j67310k89678
$$ 772140682 771968603 771650493 771432161 771331429 771160483 770870507 770596862 770429134 770261824 769972146
2039.6G69972146k82884q1301L0995j00196k00033o3598R7513L7551r2328l4272J30534
$$ 769972146 769689262 769607961 769638956 769538760 769338727 769275129 769372642 769410193 769317865 769283593 769414127
2062G69414127J54614N3466M8220J50919K02417J00672k3067O736J43230J67608M9651
$$ 769414127 769568741 769622207 769670427 769821346 770023763 770124435 770101368 770108104 770251334 770418942 770468593
2084.4G70468593K9683J57654K18391J01805K1935J13249K34901K09690Q0466O6101
$$ 770468593 770498276 770655930 770874321 770976126 770998061 771111310 771346211 771555901 771636367 771702468
2104.8G71702468J84000K33829J21534M4465J40250K27809J32203J7821P5341J94370
$$ 771702468 771886468 772120297 772241831 772286296 772426546 772654355 772786558 772804379 772879720 773074090
2125.2G73074090J73331K9862M77J35123K24948J57178O2167R3520J95086J80364O5624
$$ 773074090 773247421 773277283 773277760 773412883 773637831 773795009 773857176 773950696 774145782 774326146 774391770
2147.7G74391770O2228J93297K58625J72019J16825K44379L83139L10123J85191K63393
$$ 774391770 774453998 774647295 774905920 775077939 775194764 775439143 775822282 776132405 776317596 776580989
2168G76580989M47929M75467L33607K92718M33266N00918L70085K65717L49820M73917
$$ 776580989 777028918 777504385 777837992 778130710 778563976 779064894 779434979 779700696 780050516 780524433
2188.4G80524433M39524L00825K80619L86476M02689K67387K15947L51131M29332L05534
$$ 780524433 780963957 781264782 781545401 781931877 782334566 782601953 782817900 783169031 783598363 783903897
2208.8G83903897J99735K86579L89874L45349K18392J78218K70843L09944K03312J29461
$$ 783903897 784103632 784390211 784780085 785125434 785343826 785522044 785792887 786102831 786306143 786435604
2229.2G86435604J88351K33054J81556J27732J51873K00391J61111M3631L576P9692
$$ 786435604 786623955 786857009 787038565 787166297 787318170 787518561 787679672 787723303 787726879 787806571
2249.6G87806571J17003N6088J4127N4180Q4937P7963P4863Q1480P8142O3598J0073
$$ 787806571 787923574 787979662 787993789 788047969 788132906 788210869 788285732 788367212 788445354 788508952 788519025
2272.1G88519025q8394o7413P3076J04248n603o6161m0114n3227j24275j45376p2718
$$ 788519025 788430631 788363218 788436294 788540542 788534939 788468778 788428664 788375437 788251162 788105786 788033068
2294.5G88033068k1219p7307j68324j57833r5665j01507j54615j99317k12133k04206
$$ 788033068 788011849 787934542 787766218 787608385 787512720 787411213 787256598 787057281 786845148 786640942
2314.9G86640942j89602k27273k60293k04146j63198k08795k48730k52902k97547l50773
$$ 786640942 786451340 786224067 785963774 785759628 785596430 785387635 785138905 784886003 784588456 784237683
2335.3G84237683l84331l73125l07858k97427l59476k76565j23799j22488l16977m54366
$$ 784237683 783853352 783480227 783172369 782874942 782515466 782238901 782115102 781992614 781675637 781221271
2355.7G81221271l38138k97606m02450m52280m27008l65972l48211l62336l21806k15530
$$ 781221271 780883133 780585527 780183077 779730797 779303789 778937817 778589606 778227270 777905464 777689934
2376.1G77689934j56462k36869l30448l00289k51591l16083m62711n27859m45962l76165
$$ 777689934 777533472 777296603 776966155 776665866 776414275 776098192 775635481 775107622 774661660 774285495
2396.5G74285495m43160n51522n72026n50151n73039o24418o20127n57065n58793o69360
$$ 774285495 773842335 773290813 772718787 772168636 771595597 770971179 770351052 769793987 769235194 768565834
2416.9G68565834p57158p13945o50704p22348q17597p68602o84023p11918p94172p99000
$$ 768565834 767808676 767094731 766444027 765721679 764904082 764135480 763451457 762739539 761945367 761146367
2437.3G61146367p32661p18534p96973q47161p84517p30395p80403q41916q20637p56383
$$ 761146367 760413706 759695172 758898199 758051038 757266521 756536126 755755723 754913807 754093170 753336787
2457.7G53336787p37667p74324q09252p87616p46608p62939p81536p31290o86943p21336
$$ 753336787 752599120 751824796 751015544 750227928 749481320 748718381 747936845 747205555 746518612 745797276
2478.1G45797276q04603q39769p79808p04706o99401p42256p48933p06076o88792p26699
$$ 745797276 744992673 744152904 743373096 742668390 741968989 741226733 740477800 739771724 739082932 738356233
2498.5G38356233p45058p08402o65426o73592p19726p06852o63101o82354p03216o82056
$$ 738356233 737611175 736902773 736237347 735563755 734844029 734137177 733474076 732791722 732088506 731406450
2518.9G31406450o83963p21574p59244p55071p15316p17222p89404q50141q16882p54714
$$ 731406450 730722487 730000913 729241669 728486598 727771282 727054060 726264656 725414515 724597633 723842919
2539.2G23842919p57218q17418q55445p93517p06792p16507p73251p82013p47025p25747
$$ 723842919 723085701 722268283 721412838 720619321 719912529 719196022 718422771 717640758 716893733 716167986
2559.6G16167986p61747p79092p17759o86765p42257p95841p78258p21991p13229p69675
$$ 716167986 715406239 714627147 713909388 713222623 712480366 711684525 710906267 710184276 709471047 708701372
2580G08701372p90119p51436p47859p94828p93994p19666p06494p97451q47756p93398
$$ 708701372 707911253 707159817 706411958 705617130 704823136 704103470 703396976 702599525 701751769 700958371
2600.4G00958371p66218q44061r33885r53734r24349r40562j041710j111030j080752
$$ 700958371 700192153 699348092 698414207 697460473 696536124 695595562 694553852 693442822 692362070
2618.8F92362070j086354j183272j230955j177311j166045j259446j334429j308143
$$ 692362070 691275716 690092444 688861489 687684178 686518133 685258687 683924258 682616115
2635.1F82616115j250923j261890j313210j313865j236558j178860j233816j309813
$$ 682616115 681365192 680103302 678790092 677476227 676239669 675060809 673826993 672517180
2651.4F72517180j306414j276910j290441j309574j263380j187265j198232j245916
$$ 672517180 671210766 669933856 668643415 667333841 666070461 664883196 663684964 662439048
2667.7F62439048j225412j172721j149774j154363j144826j121760j092612j091421
$$ 662439048 661213636 660040915 658891141 657736778 656591952 655470192 654377580 653286159
2684.1F53286159j112223j097977j070916j079023j132906j188934j209616j221717
$$ 653286159 652173936 651075959 650005043 648926020 647793114 646604180 645394564 644172847
2700.4F44172847j262903j311660j318574j309693j346647j397670j391351j361608
$$ 644172847 642909944 641598284 640279710 638970017 637623370 636225700 634834349 633472741
2716.7F33472741j351059j344323j351178j340508j277566j246631j255214j223267
$$ 633472741 632121682 630777359 629426181 628085673 626808107 625561476 624306262 623082995
2733F23082995j179337j160204j151979j134396j106441j114607j140416j117050j079619
$$ 623082995 621903658 620743454 619591475 618457079 617350638 616236031 615095615 613978565 612898946
2751.4F12898946j073361j058399j042724j072526j106501j092791j075328j114130
$$ 612898946 611825585 610767186 609724462 608651936 607545435 606452644 605377316 604263186
2767.7F04263186j186311j218200j199126j204192j276315j342415j372219j416683
$$ 604263186 603076875 601858675 600659549 599455357 598179042 596836627 595464408 594047725
2784E94047725j495242j581907j578331j536906j621008j744926j788378j789271j816869
$$ 594047725 592552483 590970576 589392245 587855339 586234331 584489405 582701027 580911756 579094887
2802.3E79094887j896680j976490k014994k041579k103030k178073k217114k266228
$$ 579094887 577198207 575221717 573206723 571165144 569062114 566884041 564666927 562400699
2818.7E62400699k374053k479971k553463k651155k804577k979040l128588l304303
$$ 562400699 560026646 557546675 554993212 552342057 549537480 546558440 543429852 540125549
2835E40125549l610671m098713m757226n527556o336629o992102p169842o649137n436569
$$ 540125549 536514878 532416165 527658939 522131383 515794754 508802652 501632810 494983673 489547104
2853.3D89547104l878951k586812k012015k202928k896368l712297m318863m501074
$$ 489547104 485668153 483081341 481069326 478866398 475970030 472257733 467938870 463437796
2869.7D63437796m161358l402621k521038j778841j287877j061678j062155j205832
$$ 463437796 459276438 455873817 453352779 451573938 450286061 449224383 448162228 446956396
2886D46956396j386583j561135j795083k063543k269059k457887k695262k995998l348082
$$ 446956396 445569813 444008678 442213595 440150052 437880993 435423106 432727844 429731846 426383764
2904.3D26383764l706515m102528m618556n207061n723715o012947n954057n515247
$$ 426383764 422677249 418574721 413956165 408749104 403025389 397012442 391058385 385543138
2920.6C85543138m673481l505200k190620q65728L81440J566977K724707L736138M440308
$$ 385543138 380869657 377364457 375173837 374308109 374689549 376256526 378981233 382717371 387157679
2939C87157679M768550M698128M218429L381520K416045J573533R59962P14034R56774
$$ 387157679 391926229 396624357 400842786 404224306 406640351 408213884 409173846 409887880 410844654
2957.4D10844654J589477K390563L219515M046947M824668N464644N902320O101608
$$ 410844654 412434131 414824694 418044209 422091156 426915824 432380468 438282788 444384396
2973.7D44384396O108105N998045N792261N466729M994601M432023L874987L335208
$$ 444384396 450492501 456490546 462282807 467749536 472744137 477176160 481051147 484386355
2990D84386355K745390K090901J433313Q03619J96964l66122p98940j057715j208305
$$ 484386355 487131745 489222646 490655959 491459578 491656542 491290420 490491480 489433765 488225460
3008.3D88225460j295417j293272j211405j155704j242519j490563j776755k018213
$$ 488225460 486930043 485636771 484425366 483269662 482027143 480536580 478759825 476741612
3024.7D76741612k210975k280861k225458k160609k170950k265692k396852k475888
$$ 476741612 474530637 472249776 470024318 467863709 465692759 463427067 461030215 458554327
3041D58554327k499640k542704k621710k674133k645462k620876k658546k641112k514511
$$ 458554327 456054687 453511983 450890273 448216140 445570678 442949802 440291256 437650144 435135633
3059.3D35135633k392292k315730k201617j995295j780451j725345j762301j677305
$$ 435135633 432743341 430427611 428225994 426230699 424450248 422724903 420962602 419285297
3075.6D19285297j528054j485348j476675j405567j326352j243204j147121j116097
$$ 419285297 417757243 416271895 414795220 413389653 412063301 410820097 409672976 408556879
3092D08556879j135171j123935j123965j165688j226812j286209j316190j351326j411289
$$ 408556879 407421708 406297773 405173808 404008120 402781308 401495099 400178909 398827583 397416294
3110.3C97416294j484871j555383j604468j667261j719386j752555j827896j904100
$$ 397416294 395931423 394376040 392771572 391104311 389384925 387632370 385804474 383900374
3126.6C83900374j953929k002985k036899k039522k047926k099365k172649k220720
$$ 383900374 381946445 379943460 377906561 375867039 373819113 371719748 369547099 367326379
3143C67326379k225727k224892k214164k199888k266973k377004k371669k304107k313882
$$ 367326379 365100652 362875760 360661596 358461708 356194735 353817731 351446062 349141955 346828073
3161.3C46828073k345443k355992k361298k336770k324820k362549k376080k328664
$$ 346828073 344482630 342126638 339765340 337428570 335103750 332741201 330365121 328036457
3177.6C28036457k287924k323359k356768k284974k225250k253413k248496k189576
$$ 328036457 325748533 323425174 321068406 318783432 316558182 314304769 312056273 309866697
3193.9C09866697k142221k106190k071738k019733j959712j943707j967073j964807
$$ 309866697 307724476 305618286 303546548 301526815 299567103 297623396 295656323 293691516
3210.3B93691516j915544j844436j782030j796037j850486j816362j772106j829862
$$ 293691516 291775972 289931536 288149506 286353469 284502983 282686621 280914515 279084653
3226.6B79084653j882702j884848j914025j980751k020121k052695k132356k191663
$$ 279084653 277201951 275317103 273403078 271422327 269402206 267349511 265217155 263025492
3242.9B63025492k224087k257973k272547k323240k392143k366304k332419k375528
$$ 263025492 260801405 258543432 256270885 253947645 251555502 249189198 246856779 244481251
3259.2B44481251k379135k320692k269268k195239k047151j894861j785890j682162
$$ 244481251 242102116 239781424 237512156 235316917 233269766 231374905 229589015 227906853
3275.5B27906853j577213j436010j274392j165748j050890r07227p88957o69971n42730
$$ 227906853 226329640 224893630 223619238 222453490 221402600 220495373 219706416 219036445 218493715
3293.9B18493715m66541m42713l96550l18885k31936j85117k05368k07037j60202j23710
$$ 218493715 218027174 217584461 217187911 216869026 216637090 216451973 216246605 216039568 215879366 215755656
3314.3B15755656j02996o8784p8753j24231j26302j57163k20626k10956j74627j56700
$$ 215755656 215652660 215583876 215505123 215380892 215254590 215097427 214876801 214665845 214491218 214334518
3334.7B14334518j70961k34723k99529l58566l99545m01184m11362m50104m91515n29095
$$ 214334518 214163557 213928834 213629305 213270739 212871194 212470010 212058648 211608544 211117029 210587934
3355.1B10587934n06118m55439m75094n14850n15789m91619n14254o15388o23644m97743
$$ 210587934 210081816 209626377 209151283 208636433 208120644 207629025 207114771 206499383 205875739 205377996
3375.5B05377996m16368m07428m18722l85836k99663k23606j86474k19121k89962k93553
$$ 205377996 204961628 204554200 204135478 203749642 203449979 203226373 203039899 202820778 202530816 202237263
3395.9B02237263j73181n0232r8616k13042j57073j8954N0649P3656J00703J42887
$$ 202237263 202064082 202013850 201915234 201702192 201545119 201526165 201576814 201650470 201751173 201894060
3416.3B01894060J71020K22743L42578M94793O13779O95824P31230P99566Q92580Q15451
$$ 201894060 202065080 202287823 202630401 203125194 203738973 204434797 205166027 205965593 206858173 207673624
3436.6B07673624O66678P13080Q88348J023039J112610J155466J201764J251355J306623
$$ 207673624 208340302 209053382 209941730 210964769 212077379 213232845 214434609 215685964 216992587
3455B16992587J407921J486212J469687J486331J664341J817032J691163J445994J470312
$$ 216992587 218400508 219886720 221356407 222842738 224507079 226324111 228015274 229461268 230931580
3473.4B30931580J680091J861468J922190J851484J841039J962229K055184K061843
$$ 230931580 232611671 234473139 236395329 238246813 240087852 242050081 244105265 246167108
3489.7B46167108K072201K067267K084136K130658K170980K198398K160817K119720
$$ 246167108 248239309 250306576 252390712 254521370 256692350 258890748 261051565 263171285
3506B63171285K184719K299071K429187K473086K363652K320051K424538K601981K609522
$$ 263171285 265356004 267655075 270084262 272557348 274921000 277241051 279665589 282267570 284877092
3524.4B84877092K471178K504439K713173K883852K964526K975077K892911K932400
$$ 284877092 287348270 289852709 292565882 295449734 298414260 301389337 304282248 307214648
3540.7C07214648L095358L153294L095866L120571L232151L356547L459811L504544
$$ 307214648 310310006 313463300 316559166 319679737 322911888 326268435 329728246 333232790
3557C33232790L575564L648758L576457L489763L908038M482746M454017M230439M292518
$$ 333232790 336808354 340457112 344033569 347523332 351431370 355914116 360368133 364598572 368891090
3575.3C68891090M458428M568904M651934M576564M430741M628420N093127N107731
$$ 368891090 373349518 377918422 382570356 387146920 391577661 396206081 401299208 406406939
3591.7D06406939M907668M992991N201698N251079N248756N161583M869551M850089
$$ 406406939 411314607 416307598 421509296 426760375 432009131 437170714 442040265 446890354
3608D46890354N141229N306363N381584N244374N206466N719930N814463N166739M460931
$$ 446890354 452031583 457337946 462719530 467963904 473170370 478890300 484704763 489871502 494332433
3626.3D94332433M630655N733520N842268N411208N211115M988372M814386M650832
$$ 494332433 498963088 504696608 510538876 515950084 521161199 526149571 530963957 535614789
3642.6E35614789M194200L692030M089952N246699N302071M559935M501819M732430
$$ 535614789 539808989 543501019 547590971 552837670 558139741 562699676 567201495 571933925
3659E71933925M392505L942013L595411L055573K769589L220201L116429K809703L621638
$$ 571933925 576326430 580268443 583863854 586919427 589689016 592909217 596025646 598835349 602456987
3677.3F02456987L973901L497243L060043K595603K117932K141238K761125L014565
$$ 602456987 606430888 609928131 612988174 615583777 617701709 619842947 622604072 625618637
3693.6F25618637K660751K129316J668096J591146J950085J941025J335144Q61585
$$ 625618637 628279388 630408704 632076800 633667946 635618031 637559056 638894200 639755785
3709.9F39755785J290739K209067K223611J589597J139223J040876J091778J224161
$$ 639755785 641046524 643255591 645479202 647068799 648208022 649248898 650340676 651564837
3726.3F51564837J407623J114905M97758M60565J249969J885176J486361L26395m2498
$$ 651564837 652972460 654087365 654585123 655045688 656295657 658180833 659667194 659993589 659951091
3744.6F59951091J047075J094281O00517J352072J903176J450122J017749J162171
$$ 659951091 660998166 662092447 662692964 664045036 665948212 667398334 668416083 669578254
3760.9F69578254J185239P88927N78820O56963R81927J282453J074314O21379M54724
$$ 669578254 670763493 671552420 672131240 672788203 673770130 675052583 676126897 676748276 677203000
3779.3F77203000O94215Q08418P96854R26733R13203P18355M19200J41561J71899P1705
$$ 677203000 677897215 678705633 679502487 680429220 681342423 682060778 682479978 682621539 682793438 682865143
3799.7F82865143J63019R57489R71317P60019J109481R46819K02537j96397J16527
$$ 682865143 683028162 683985651 684956968 685716987 686826468 687773287 687975824 687779427 687895954
3818F87895954J28567N14388J263082J073003O71804L42726J63019L07977O9559j58668
$$ 687895954 688024521 688538909 689801991 690874994 691546798 691889524 692052543 692360520 692430079 692271411
3838.4F92271411M41134R98497J110733R84251N01454m86612j306653O8963J734077
$$ 692271411 692712545 693711042 694821775 695806026 696307480 695820868 694514215 694583178 696317255
3856.8F96317255J345397L94344q6427J85728L80337l7312J05560O87659Q55386O75022
$$ 696317255 697662652 698056996 697970569 698156297 698536634 698499322 698604882 699292541 700147927 700822949
3877.2G00822949Q4222j6332L52800L61562N19216M17948R4473M06384N15581j00494
$$ 700822949 700907171 700890839 701243639 701605201 702124417 702542365 702636838 703043222 703558803 703458309
3897.6G03458309n42342l29257K25068Q58604J054645O67393K78056O5327j78516j55986
$$ 703458309 702915967 702586710 702811778 703670382 704725027 705392420 705670476 705735803 705557287 705401301
3918G05401301K30670L52025J50741J32739J96815J09672J70291L98159L89516J63615
$$ 705401301 705631971 705983996 706134737 706267476 706464291 706573963 706744254 707142413 707531929 707695544
3938.4G07695544j5974k0623J40726K04682K05934L06666K75433J46449J41680J80006
$$ 707695544 707679570 707658947 707799673 708004355 708210289 708516955 708792388 708938837 709080517 709260523
3958.8G09260523J62304J58906J50561J05977Q5294J00911J51873J74820J50800J65224
$$ 709260523 709422827 709581733 709732294 709838271 709923565 710024476 710176349 710351169 710501969 710667193
3979.2G10667193K03550J79708J35839R7453N0247J06752J87993J80185K01046
$$ 710667193 710870743 711050451 711186290 711283743 711333990 711440742 711628735 711808920 712009966
3997.5G12009966
$$ 712009966
##END=$$ End of the data block
