##TITLE=G15-52-CE $$ Begin of the data block
##JCAMP-DX=5.00 $$ ACD/SpecManager v 10.08
##SPECTROMETER/DATA SYSTEM=Alpha
##DATE=21 Oct 2013 11:04:12
##DATA TYPE=INFRARED SPECTRUM
##DATA CLASS=XYDATA
##ORIGIN=
##OWNER=
##NPOINTS=1765
##FIRSTX=399.75695801
##LASTX=3997.56933594
##MAXX=3997.56933594
##MINX=399.75695801
##MAXY=0.79031610
##MINY=0.19597888
##XFACTOR=1.0000000000
##YFACTOR=1.000000000000000e-9
##FIRSTY=0.46957478
##DELTAX=2.03957629
##XUNITS=1/CM
##YUNITS=ARBITRARY UNITS
##XYDATA=(X++(Y..Y))
399.8D69574779k161383j783491j624852r83208j23680L98725K00838o89924j398623
418.1D61409181j123517p99418q92043j108974j422167j510561j627624j613080q97318
436.5D50414479J997O42597J080543J288265J253098N24372n77003r69469r74447j467824
456.9D51216608k007454k021581j998633k190054k420515k433210k245903j966119
473.2D33933139j774252j749694j428306q41916n32984p82311j159996j164496j283348
491.5D23215836j808166k183318k173603k229035k604335k961338k993464k697707
507.9D03564870k583086k832204k778173k390265k224237k313554j980573j020283
524.2C85442495k42680j50919j17779N27263J445085K002477K187580K273172K118081
$$ y = [469574779, 467413396, 465629905, 464005053, 463021845, 462898165, 463296890, 463497728, 462807804, 461409181, 460285664, 459486246, 458594203, 457485229, 456063062, 454552501, 452924877, 451311797, 450414479, 450416476, 451059073, 452139616, 453427881, 454680979, 455205351, 454628348, 453658879, 452684432, 451216608, 449209154, 447187573, 445188940, 442998886, 440578371, 438145161, 435899258, 433933139, 432158887, 430409193, 428980887, 428138971, 427605987, 426823676, 425663680, 424499184, 423215836, 421407670, 419224352, 417050749, 414821714, 412217379, 409256041, 406262577, 403564870, 400981784, 398149580, 395371407, 392981142, 390756905, 388443351, 386462778, 385442495, 385199815, 385048896, 384931117, 385458380, 386903465, 388905942, 391093522, 393366694, 395484775]
542.5C95484775J383543L51191l47197n60820p74533j302272j662731j497865j341194
560.9C89732897j782119k539635k756357k166152j470297r81808k41310Q94517J900613
579.2C80590349K342582K578289K987891L016353K115547J017303N47051N62698M75913
597.6C96233976Q2195j18465J19508K85804J33812J06276M26381P25419O19888N61565
618C99176359J164586K145260K804279K755553K504915K601743K738982K367199J747578
636.3D20006454J624644J840383J646667J238078J103610J080215Q84533M71115J55300
654.7D30050999K32965N13851M44442J32233K47866R48906J590729J150548J086235
673.1D36398774J537592J820057J753211J562685J452893J292527R03934L87996J6362
$$ y = [395484775, 396868318, 397219509, 396872312, 396311492, 395536959, 394234687, 392571956, 391074091, 389732897, 387950778, 385411143, 382654786, 380488634, 379018337, 378036529, 377795219, 378689736, 380590349, 382932931, 385511220, 388499111, 391515464, 393631011, 394648314, 395195365, 395758063, 396233976, 396316171, 396197706, 396317214, 396603018, 396736830, 396843106, 397269487, 397994906, 398614794, 399176359, 400340945, 402486205, 405290484, 408046037, 410550952, 413152695, 415891677, 418258876, 420006454, 421631098, 423471481, 425118148, 426356226, 427459836, 428540051, 429424584, 429895699, 430050999, 430283964, 430797815, 431242257, 431374490, 431622356, 432571262, 434161991, 435312539, 436398774, 437936366, 439756423, 441509634, 443072319, 444525212, 445817739, 446721673, 447109669, 447126031]
691.4D47126031k48730o00636r86487q52644J65939J370788J904934K016515K420932
709.8D52316642L082514L506869L588915L745704M350663M923850M793376M427045
726.1D84735578M379809M312158L706038K787113K199262J990080J647890Q54313J61469
744.4E06773710J16766K94447K265o03259q86619q67486j039505j246512q50201J73927
764.8E01867533J399636K451777L398836M540503N483389N510807M920602M527986
781.2E34101069M288793L651022K626360J979709K077579K298951K088845K014101
797.5E55126429K734363L686905L809452L085851K561272K480387K079129J120210
813.8E76683998L51608K65360J88052n75780j572192k012551j974761k134920k550900
$$ y = [447126031, 446877301, 446276665, 445290178, 444437534, 444603473, 445974261, 447879195, 449895710, 452316642, 455399156, 458906025, 462494940, 466240644, 470591307, 475515157, 480308533, 484735578, 489115387, 493427545, 497133583, 499920696, 502119958, 504110038, 505757928, 506612241, 506773710, 506890476, 507184923, 507187188, 506583929, 505697310, 504829824, 503790319, 502543807, 501693606, 501867533, 503267169, 505718946, 509117782, 513658285, 519141674, 524652481, 529573083, 534101069, 538389862, 542040884, 544667244, 546646953, 548724532, 551023483, 553112328, 555126429, 557860792, 561547697, 565357149, 568443000, 571004272, 573484659, 575563788, 576683998, 577035606, 577300966, 577489018, 576913238, 575341046, 573328495, 571353734, 569218814, 566667914]
832.1E66667914k605319k215266k017498k356470k564370k004326j276791j188576
848.5E50439298j346886r58741k68459j02103k86639N46992K855420N053401N794466
866.8E61726749N706191N659342N269289L784418J508772l36051j543522k957999m511118
885.2E74306071n241573m991651m702806m904866n075932m729390m375696m841626
901.5E35442531n851865o507158o697297o979764p470071p496625o691396n590976
917.8D82157379m644841l597587k286404j274765j037836j152605r32276m21703k62290
936.2D66547072o03944r05991j108765k069742m277378o886602q693039r535313j0073632
954.5D22392666j0572403j0750026j0611594j0581553j0763138j0764778j0327697
$$ y = [566667914, 564062595, 561847329, 559829831, 557473361, 554908991, 552904665, 551627874, 550439298, 549092412, 548133671, 547865212, 547763109, 547476470, 548023462, 550878882, 555932283, 561726749, 567432940, 573092282, 578361571, 582145989, 583654761, 583318710, 581775188, 578817189, 574306071, 569064498, 564072847, 559370041, 554465175, 549389243, 544659853, 540284157, 535442531, 529590666, 523083508, 516386211, 509406447, 501936376, 494439751, 487748355, 482157379, 477512538, 473914951, 471628547, 470353782, 469315946, 468163341, 467231065, 466809362, 466547072, 465943128, 465037137, 463928372, 461858630, 457581252, 450694650, 442001611, 432466298, 422392666, 411820263, 401070237, 390458643, 379877090, 369113952, 358349174, 348021477]
968.8C48021477r612470q834392p940769o780088n426109m164100l186583k418668
985.1B99658298j728475j277178j190961j180172r84787o57618l65407k10494j72615
1003.5B91890591k87622o91235j297712j774878j915693j861870j874596j992106k064288
1021.8B78130591k062589k130985k270252k308219k178640k050161k105325k238900
1038.1B60785520k215415k039939j870573j735002j477658r61036l24190J94282O05881
1056.5B50961870J051128J517385J898795K054036J811445J010746k26558j198798
1072.8B58880049j161128j38313J217157K392292L282904L944844M367412M501938
1089.1B77287155M357398M086405L778011L313511K637893J895249J441002J504838
$$ y = [348021477, 338409007, 329574615, 321633846, 314853758, 309427649, 305263549, 302076966, 299658298, 297929823, 296652645, 295461684, 294281512, 293296725, 292639107, 292273700, 292063206, 291890591, 291602969, 290911734, 289614022, 287839144, 285923451, 284061581, 282186985, 280194879, 278130591, 276068002, 273937017, 271666765, 269358546, 267179906, 265129745, 263024420, 260785520, 258570105, 256530166, 254659593, 252924591, 251446933, 250485897, 250161707, 250355989, 250961870, 252012998, 253530383, 255429178, 257483214, 259294659, 260305405, 260078847, 258880049, 257718921, 257580608, 258797765, 261190057, 264472961, 268417805, 272785217, 277287155, 281644553, 285730958, 289508969, 292822480, 295460373, 297355622, 298796624, 300301462]
1105.4C00301462J882464K262533K615958K977878L167272L006190K607316K272695
1121.8C21093768K117723K098501K256274K685607L142356L111273K474457J545311
1138.1C40525270O77853J9998m83424q04245q19683n61416k22892J31071P13676J622885
1158.5C40799093K602220L378808L975928M567772N190194N774587O335318O941647
1174.8C79565567P483035P721394P570565P166982O696910O129622N210787L918678
1191.1D31463540K592235J465708M54754m88937j110852j264274j156419j030922r04203
1209.5D30020630o86794m80950n45323q48681j100570j242518j453549j813829k114832
1227.8D19733584k148569j982987j798242j584619j159013n14507J18077O44356J187146
$$ y = [300301462, 302183926, 304446459, 307062417, 310040295, 313207567, 316213757, 318821073, 321093768, 323211491, 325309992, 327566266, 330251873, 333394229, 336505502, 338979959, 340525270, 341203123, 341223121, 340739697, 339935452, 339115769, 338554353, 338331461, 338462532, 339176208, 340799093, 343401313, 346780121, 350756049, 355323821, 360514015, 366288602, 372623920, 379565567, 387048602, 394769996, 402340561, 409507543, 416204453, 422334075, 427544862, 431463540, 434055775, 435521483, 435976237, 435487300, 434376448, 433112174, 431955755, 430924833, 430020630, 429333836, 428852886, 428307563, 427458882, 426358312, 425115794, 423662245, 421848416, 419733584, 417585015, 415602028, 413803786, 412219167, 411060154, 410545647, 410663724, 411308080, 412495226]
1246.2D12495226J759886K225668K428949K425014K440542K526582K527445K384723
1262.5D31214035K291441K379208K444595K248884J911401J635045J387000J082003
1278.8D46593612Q81821R60917J174241J244456J067578P68483M09245r0599p64966
1297.2D52244788j416772j838625k043962k172947k269536k175302j803308j254648
1313.5D37269688p30485k55078K72751O18428L67135m04954j238347j852780k247095
1331.8D31799263k453089k379745j989305j336783p42734n25892n68211p07119r79454
1350.2D20116931j351952j673848j852929k066553k611905l313631l709167l900886
1366.5C99636060l953874l536970l269255l393084l456056l723025m152030m188806
$$ y = [412495226, 414255112, 416480780, 418909729, 421334743, 423775285, 426301867, 428829312, 431214035, 433505476, 435884684, 438329279, 440578163, 442489564, 444124609, 445511609, 446593612, 447475433, 448436350, 449610591, 450855047, 451922625, 452691108, 453100353, 453009754, 452244788, 450828016, 448989391, 446945429, 444772482, 442502946, 440327644, 438524336, 437269688, 436539203, 436284125, 436556876, 437175304, 437542439, 437137485, 435899138, 434046358, 431799263, 429346174, 426966429, 424977124, 423640341, 422897607, 422371715, 421803504, 421096385, 420116931, 418764979, 417091131, 415238202, 413171649, 410559744, 407246113, 403536946, 399636060, 395682186, 392145216, 388875961, 385482877, 382026821, 378303796, 374151766, 369962960]
1382.8C69962960l653496k687156j420617n67049m48585m32312r9957L69131R46731
1401.2C61969650J422703J846105K174288K264261K333284K336263K169162K189190
1417.5C78704906K933561L328592K964854K523154J865775J122623M26561m34309j247347
1435.9C92188370r21339N9575L45409K98381L23802N15312O27995L41713J99408J218557
1456.2C95197183L537416M238725L559798L532589M235267M822672N911409Q353830
1472.6D33388889R574741Q239686O238044M187077K335936L37779j930207m019349
1488.9D58352596n093605n235284o417632q199186p925748o784618o827474r405255
1505.2D02463794j2830794j0359287q140684q332431p722527n815327l664195k906561
$$ y = [369962960, 366309464, 363622308, 362201691, 361634642, 361186057, 360753745, 360653788, 361022919, 361969650, 363392353, 365238458, 367412746, 369677007, 372010291, 374346554, 376515716, 378704906, 381638467, 384967059, 387931913, 390455067, 392320842, 393443465, 393870026, 393435717, 392188370, 391267031, 391326606, 391672015, 391970396, 392294198, 392809510, 393437505, 393779218, 393978626, 395197183, 398734599, 402973324, 406533122, 410065711, 414300978, 419123650, 425035059, 433388889, 442963630, 451203316, 457441360, 461628437, 463964373, 464302152, 462371945, 458352596, 453258991, 448023707, 441606075, 433406889, 425481141, 418696523, 411869049, 402463794, 389633000, 379273713, 371133029, 362800598, 355078071, 349262744, 345598549, 342691988]
1521.5C42691988k729714k680004k855837k609283k655387k720028j950383j681179
1537.8C22810173j919746n47052J155883J965940K457798K987951L546506L892213
1554.1C36349666L778488M589408O568194N477219M162074L659814L164560L064185
1570.5C70813608K569974J702368J371264J290352P93725J53452l14742p63864j217037
1588.8C76399100j724661k289742k957195l527015m058004m763156n546659o312668
1605.1C45220000p083327p940710q485853q732111r939402j1507243j0165572r826124
1621.4B71539658j1570215j1299431j0166869r501278q290112p837713q017391n324110
1637.8A99532539k296687r85443k71529M66764J512244J766920J913235L436863M062191
$$ y = [342691988, 339962274, 337282270, 334426433, 331817150, 329161763, 326441735, 324491352, 322810173, 320890427, 320343375, 321499258, 323465198, 325922996, 328910947, 332457453, 336349666, 340128154, 344717562, 351285756, 356762975, 360925049, 364584863, 367749423, 370813608, 373383582, 375085950, 376457214, 377747566, 378541291, 378694743, 378380001, 377616137, 376399100, 374674439, 372384697, 369427502, 365900487, 361842483, 357079327, 351532668, 345220000, 338136673, 330195963, 321710110, 312977999, 303038597, 291531354, 281365782, 271539658, 259969443, 248670012, 238503143, 229001865, 220711753, 212874040, 204856649, 199532539, 197235852, 196250409, 195978880, 196445644, 197957888, 199724808, 201638043, 205074906, 209137097]
1656.1B09137097L816187M322619N473584O484001O348104O837040Q087858P891715
1672.4B58398205Q156508R082556Q689821Q087486R000629J2180775J2476325J1244446
1688.8C37316751J2305946J2886107J5198409J7781496J8170506K0368248J7448366
1703D51475829J4207631J3920844J2107432R960711Q218586P054210P296383P400215
1719.3E31641841N959511M666686M066586L441871K791941K110362K259969L390313
1735.7E60329080L403663L248275L875374M608274N185008N758285O879330Q158505
1752F01445794P948399P432818P283151O882668P076382O892920N864918N105257M727125
1770.3F60659432N135417N509675M689217L861129L622591L472150L144741K891361
$$ y = [209137097, 212953284, 217275903, 222749487, 229233488, 235581592, 242418632, 250506490, 258398205, 266554713, 275637269, 284327090, 292414576, 301415205, 313595980, 326072305, 337316751, 349622697, 362508804, 377707213, 395488709, 413659215, 434027463, 451475829, 465683460, 479604304, 491711736, 501672447, 509891033, 516945243, 524241626, 531641841, 537601352, 542268038, 546334624, 549776495, 552568436, 554678798, 556938767, 560329080, 563732743, 566981018, 570856392, 575464666, 580649674, 586407959, 593287289, 601445794, 609394193, 616827011, 624110162, 630992830, 638069212, 644962132, 650827050, 655932307, 660659432, 665794849, 671304524, 675993741, 679854870, 683477461, 686949611, 690094352, 692985713]
1786.7F92985713K473474J951814K263009K782822K526224K098739K090215K262533
1803G11434543K193332J956940J689016J663804J831294J846611J723111J612484J373947
1821.3G27325082J133442J223802J243830J169086J599431J791358J374721J127422
1837.6G37988174J022756O46532N12778J132071J487911J318574J112163Q93355P77065
1856G46891379P83682Q02875P21037N24461K47062L27468R59694J230955R72569P66337
1876.4G54227519O88672O22869O30200O67929N71907M37319O15418P89881O86705O31213
1896.8G60569632O10709N82040N53608M45663L03030L29614N20528N13613K03371N1141
1917.2G64682949L75926N49197M32015M59373M91082M17412L10957K06709K02537K83062
$$ y = [692985713, 695459187, 697411001, 699674010, 702456832, 704983056, 707081795, 709172010, 711434543, 713627875, 715584815, 717273831, 718937635, 720768929, 722615540, 724338651, 725951135, 727325082, 728458524, 729682326, 730926156, 732095242, 733694673, 735486031, 736860752, 737988174, 739010930, 739657462, 740170240, 741302311, 742790222, 744108796, 745220959, 746114314, 746891379, 747675061, 748477936, 749198973, 749723434, 749970496, 750297964, 751257658, 752488613, 753461182, 754227519, 754916191, 755539060, 756169260, 756837189, 757409096, 757846415, 758461833, 759251714, 759938419, 760569632, 761180341, 761762381, 762315989, 762761652, 763064682, 763394296, 763914824, 764428437, 764631808, 764682949, 765058875, 765608072, 766040087, 766499460, 766990542, 767407954, 767718911, 767925620, 768128157, 768411219]
1937.6G68411219J50442p9453J13726M66823M58062K55346J55807K45512L71873K93910
1958G70843267J48237J77324K50220J85848J47998K21550L07560L37839K12133P6116
1978.4G72908092J24931K28286J35958m0054l7551Q9526J74939J42813R6202J95742
1998.8G74018884K46882L3081j62781r3340N7101J19j95265k75910j51276l1054j68026
2021.2G73278415l05593j96993p8261j80483l17752k84016j66953j74522l02613k70844
2041.6G71000385o1333K3365j11699j88351n6743Q3089L0338q2254n603J52946J50263
2064G70934403M5657M8399J42515J71065P9870N186O1154J75417J67131M4048L4034
2086.5G71908879J64211K37227J37448M0769J09613K38061K29776J05858Q3029J78099
$$ y = [768411219, 768561661, 768482208, 768595934, 769062757, 769520819, 769776165, 769931972, 770177484, 770549357, 770843267, 770991504, 771168828, 771419048, 771604896, 771752894, 771974444, 772282004, 772619843, 772831976, 772908092, 773033023, 773261309, 773397267, 773357213, 773319662, 773409188, 773584127, 773726940, 773823142, 774018884, 774265766, 774298847, 774136066, 774042726, 774099827, 774099946, 773904681, 773628771, 773477495, 773446441, 773278415, 772972822, 772775829, 772697568, 772517085, 772199333, 771915317, 771748364, 771573842, 771271229, 771000385, 770939052, 770962417, 770850718, 770662367, 770605624, 770688713, 770719051, 770636797, 770631194, 770784140, 770934403, 770980060, 771028459, 771170974, 771342039, 771421909, 771427095, 771488249, 771663666, 771830797, 771874845, 771908879, 772073090, 772310317, 772447765, 772488534, 772598147, 772836208, 773065984, 773171842, 773254871, 773432970]
2106.9G73432970K04325R6321M3034J48654K35320J36494P391N6803J92702J97590
2127.3G74751604N7995J9431J55747K29418J28806L0875Q9526J92106J64270O7533
2147.7G75887311Q9704K33055K88129J83343J23084K40445L56078K84195J86920K94269
2168G78166533M93228M98116L39627K94268M10021M72307L68237K83301L63589M68373
2188.4G82157600M09305K60115K61187M06325M31955K88427K43366L80158M43339L02911
2208.8G85584688J97351K86460L80874L36587K26319J94132K79248L16322J90318R1374
2229.2G88083673J74999K53498J78874J02222J40667K00689J77145O8724K2888R5963
2249.6G89499342J28508O0797L576N8413J31785J05203N4001N0307O2227O9678K0444
$$ y = [773432970, 773637295, 773733616, 773776650, 773925304, 774160624, 774297118, 774304509, 774361312, 774554014, 774751604, 774809599, 774829030, 774984777, 775214195, 775343001, 775373876, 775463402, 775655508, 775819778, 775887311, 775977015, 776210070, 776498199, 776681542, 776804626, 777045071, 777401149, 777685344, 777872264, 778166533, 778659761, 779157877, 779497504, 779791772, 780201793, 780674100, 781042337, 781325638, 781689227, 782157600, 782566905, 782827020, 783088207, 783494532, 783926487, 784214914, 784458280, 784838438, 785281777, 785584688, 785782039, 786068499, 786449373, 786785960, 787012279, 787206411, 787485659, 787801981, 787992299, 788083673, 788258672, 788512170, 788691044, 788793266, 788933933, 789134622, 789311767, 789380491, 789403379, 789499342, 789627850, 789688647, 789692223, 789750636, 789882421, 789987624, 790041625, 790091932, 790154159, 790223837, 790244281]
2272.1G90244281p9810o2287O4909J09494L9518j8478k9742n2452r3758j02640m1544
2294.5G89977491K3067k7239j39952j22488k0861K5570l636q3923j20700q2492m1128
2316.9G89383709o4790j08838r6202o5684j13905k00510k43246k55525k66195l13758
2337.3G87655056l61383l53873l54469n09620m85122j70469N6982n841j72616j72197
2357.7G85126448k30074l92795n00917o25253p07686o66738o08444n55038m80771m70460
2378.1G79888272n22375n26190m32908l28720l46541m86434n46336m46856l86178m68433
2398.5G75397301n55873n49078n14567n40555o21676o30379n54979n56588o49690p25031
2418.9G69498885p25508o96838p39634p93993p46072o89387p30693q09134q16285p50065
$$ y = [790244281, 790164471, 790102184, 790167093, 790276587, 790316105, 790297627, 790267885, 790215433, 790121675, 790019035, 789977491, 790000558, 789973319, 789833367, 789710879, 789690018, 789715588, 789711952, 789628029, 789507329, 789424837, 789383709, 789318919, 789210081, 789113879, 789048195, 788934290, 788733780, 788490534, 788235009, 787968814, 787655056, 787293673, 786939800, 786585331, 786075711, 785590589, 785420120, 785477102, 785471261, 785298645, 785126448, 784896374, 784503579, 784002662, 783377409, 782669723, 782002985, 781394541, 780839503, 780358732, 779888272, 779365897, 778839707, 778406799, 778078079, 777731538, 777245104, 776698768, 776251912, 775865734, 775397301, 774841428, 774292350, 773777783, 773237228, 772615552, 771985173, 771430194, 770873606, 770223916, 769498885, 768773377, 768076539, 767336905, 766542912, 765796840, 765107453, 764376760, 763567626, 762751341, 762001276]
2439.3G62001276p24912p72059q11815q00073p61569p77006q36313q05497p20858p28965
2459.7G54262209q00669q16763p51912p14600p56920p90357p52271o97016p27594q11815
2480.1G46642292q10922p42495p18713p48693p81775p59125p01666o99579p49588p55549
2500.5G39174187o94752o47127o62208o92189o63638o44922p11918p42078o79135o50465
2520.9G32385755p12514p75338p51435o94692p07210p86244q46744q01146p09117p22527
2541.3G24878788q34405q89242q05438p16567p41303p65204p24793p02023p22230p76410
2561.7G17201173p97510p27296o99401p76052q04424p45118p07030p47145q08298p70271
2582.1G09618628o99818p51495q40545q17359p29739p04944p67708q33452q22783p95006
$$ y = [762001276, 761276364, 760504305, 759692490, 758892417, 758130848, 757353842, 756517529, 755712032, 754991174, 754262209, 753461540, 752644777, 751892865, 751178265, 750421345, 749630988, 748878717, 748181701, 747454107, 746642292, 745831370, 745088875, 744370162, 743621469, 742839694, 742080569, 741378903, 740679324, 739929736, 739174187, 738479435, 737832308, 737170100, 736477911, 735814273, 735169351, 734457433, 733715355, 733036220, 732385755, 731673241, 730897903, 730146468, 729451776, 728744566, 727958322, 727111578, 726310432, 725601315, 724878788, 724044383, 723155141, 722349703, 721633136, 720891833, 720126629, 719401836, 718699813, 717977583, 717201173, 716403663, 715676367, 714976966, 714200914, 713396490, 712651372, 711944342, 711197197, 710388899, 709618628, 708918810, 708167315, 707326770, 706509411, 705779672, 705074728, 704307020, 703473568, 702650785, 701855779]
2602.5G01855779q29578r10938r59813r37462r43005j033545j095533j071513j100540
2620.8F92973852j192748j205326j165509j185775j272916j337827j296818j216471
2637.1F83100462j223505j293182j315713j257896j225710j278401j320183j296639
2653.5F72889233j250387j248478j271368j248002j206696j214027j239300j228392
2669.8F62982583j185834j154542j149118j136780j103520j068712j066088j107812
2686.1F54010177j159966j149893j097322j108229j157462j161635j177848j256287
2702.4F44741535j310050j314879j333654j383066j421809j406729j352251j328409
2718.7F33890688j356542j373708j351714j314402j283168j246393j191437j141489
$$ y = [701855779, 701026201, 700115263, 699155450, 698217988, 697274983, 696241438, 695145905, 694074392, 692973852, 691781104, 690575778, 689410269, 688224494, 686951578, 685613751, 684316933, 683100462, 681876957, 680583775, 679268062, 678010166, 676784456, 675506055, 674185872, 672889233, 671638846, 670390368, 669119000, 667870998, 666664302, 665450275, 664210975, 662982583, 661796749, 660642207, 659493089, 658356309, 657252789, 656184077, 655117989, 654010177, 652850211, 651700318, 650602996, 649494767, 648337305, 647175670, 645997822, 644741535, 643431485, 642116606, 640782952, 639399886, 637978077, 636571348, 635219097, 633890688, 632534146, 631160438, 629808724, 628494322, 627211154, 625964761, 624773324, 623631835]
2735F23631835j126289j150787j158715j122057j098931j114189j123250j107752j084030
2753.4F13545835j067877j065254j068950j074850j071692j073539j105845j154721
2769.7F04863107j200199j209319j203358j260519j331210j367688j422227j486241
2786E94382346j538933j573980j584649j646697j755774j769602j722396j768470j901745
2804.4E79120100k010286k040744k046108k094508k162933k214968k303243k429604
2820.7E61817706k496124k519428k627075k810419k976358l124475l318489l639877
2837E38305461m112839m734695n531192o413221p091344p241487o694198n474508l905743
2855.4D87106234k615482k068519k246857k909958l721446m326940m522115m173219
$$ y = [623631835, 622505546, 621354759, 620196044, 619073987, 617975056, 616860867, 615737617, 614629865, 613545835, 612477958, 611412704, 610343754, 609268904, 608197212, 607123673, 606017828, 604863107, 603662908, 602453589, 601250231, 599989712, 598658502, 597290814, 595868587, 594382346, 592843413, 591269433, 589684784, 588038087, 586282313, 584512711, 582790315, 581021845, 579120100, 577109814, 575069070, 573022962, 570928454, 568765521, 566550553, 564247310, 561817706, 559321582, 556802154, 554175079, 551364660, 548388302, 545263827, 541945338, 538305461, 534192622, 529457927, 523926735, 517513514, 510422170, 503180683, 496486485, 491011977, 487106234, 484490752, 482422233, 480175376, 477265418, 473543972, 469217032, 464694917, 460521698]
2871.7D60521698l374100k511292j823992j342952j100272j069993j192063j406312
2888D46700722j605183j785606k032578k292573k489627k692580k981573l339619l723204
2906.4D23758179m147321m656315n217522n718023o017476n981535n519718m647761
2922.7C81852508l502042k209424q86947L69817J579016K731323L739357M480481M818857
2941C92972946M707128M192680L381133K457291J615495R80198P07298R35019J590639
2959.4D13539827K452344L321558M136950M885614N500346N937278O170869O183297
2975.7D52128083O053537N851626N504131M997015M461468L957003L429055K819210
2992D89201128K145052J494587Q71539K21252l80903q02934j039088j185209j266568
$$ y = [460521698, 457147598, 454636306, 452812314, 451469362, 450369090, 449299097, 448107034, 446700722, 445095539, 443309933, 441277355, 438984782, 436495155, 433802575, 430821002, 427481383, 423758179, 419610858, 414954543, 409737021, 404018998, 398001522, 392019987, 386500269, 381852508, 378350466, 376141042, 375254095, 375623912, 377202928, 379934251, 383673608, 388154089, 392972946, 397680074, 401872754, 405253887, 407711178, 409326673, 410306871, 411014169, 411949188, 413539827, 415992171, 419313729, 423450679, 428336293, 433836639, 439773917, 445944786, 452128083, 458181620, 464033246, 469537377, 474534392, 478995860, 482952863, 486381918, 489201128, 491346180, 492840767, 493712306, 493933558, 493552655, 492749721, 491710633, 490525424, 489258856]
3010.4D89258856j229018j121402j120091j278430j494408j741290k020776k228171
3026.7D77025270k285569k230078k150268k154052k264500k400756k488792k518028
3043D58533227k520471k563239k650469k673328k638161k638996k627224k516686k384752
3061.4D35319901k289862k179146k038181j883208j777888j721888j626999j518100
3077.7D20284629j488924j505554j464873j351744j220584j127750j103520j133353
3094D09888327j158923j155019j162409j218975j310408j385808j404911j413167j474470
3112.4C98204237j545310j589775j644820j724362j826495j908451j921833j913071
3128.7C84130120j936525k002001k074271k121925k149046k173692k212286k244294
$$ y = [489258856, 488029838, 486908436, 485788345, 484509915, 483015507, 481274217, 479253441, 477025270, 474739701, 472509623, 470359355, 468205303, 465940803, 463540047, 461051255, 458533227, 456012756, 453449517, 450799048, 448125720, 445487559, 442848563, 440221339, 437704653, 435319901, 433030039, 430850893, 428812712, 426929504, 425151616, 423429728, 421802729, 420284629, 418795705, 417290151, 415825278, 414473534, 413252950, 412125200, 411021680, 409888327, 408729404, 407574385, 406411976, 405193001, 403882593, 402496785, 401091874, 399678707, 398204237, 396658927, 395069152, 393424332, 391699970, 389873475, 387965024, 386043191, 384130120, 382193595, 380191594, 378117323, 375995398, 373846352, 371672660, 369460374, 367216080]
3145C67216080k256006k250522k263337k306819k336294k328515k327949k363354k378404
3163.4C46404880k358764k339870k338856k369345k406597k401530k366960k337099
3179.7C27485859k338141k342433k294629k248198k246112k269417k251684k153606
3196C09341639k092957k086759k027869j971871j980990j975775j915455j882195j900703
3214.3B91507065j876741j819730j801968j821488j872778j908332j888126j887977
3230.7B76629925j923293j964390k043218k123058k160817k197534k231479k250820
3247B59735316k308309k365232k381026k410353k438992k417832k363995k311811k258748
3265.3B38479018k185598k097338j993522j838014j675561j570642j437530j257613
$$ y = [367216080, 364960074, 362709552, 360446215, 358139396, 355803102, 353474587, 351146638, 348783284, 346404880, 344046116, 341706246, 339367390, 336998045, 334591448, 332189918, 329822958, 327485859, 325147718, 322805285, 320510656, 318262458, 316016346, 313746929, 311495245, 309341639, 307248682, 305161923, 303134054, 301162183, 299181193, 297205418, 295289963, 293407768, 291507065, 289630324, 287810594, 286008626, 284187138, 282314360, 280406028, 278517902, 276629925, 274706632, 272742242, 270699024, 268575966, 266415149, 264217615, 261986136, 259735316, 257427007, 255061775, 252680749, 250270396, 247831404, 245413572, 243049577, 240737766, 238479018, 236293420, 234196082, 232202560, 230364546, 228688985, 227118343, 225680813, 224423200]
3281.6B24423200j157865j079872r26167p96646p15479o01500m92186m47750m04313
3300B17801422l23668k47121k28882k55972k31206j58862j25602j29223j14351q3581
3320.4B15902954r6827j65150k37182k49222j90913j57118j78576k07588k37986k83793
3340.8B13898599l38614l98591m35770m55886n00768n28962n32269n06461m86761n17815
3361.2B09196702n34118n21197n05478n30317o21319o26698n11617m51073m51207m51252
3381.6B03992426m12270l29554k14905j31592k24531l83213l57225j43215J8984n3615
3402B01761290k13518j88887n4762K4050P4908J10120J34930J90109K38359L05504
3422.4B02382103M77805O23227O83397P28249Q24526Q97065P98911O79627P44104R15244
$$ y = [224423200, 223265335, 222185463, 221259296, 220462650, 219747171, 219145671, 218653485, 218205735, 217801422, 217477754, 217230633, 217001751, 216745779, 216514573, 216355711, 216230109, 216100886, 215986535, 215902954, 215806127, 215640977, 215403795, 215154573, 214963660, 214806542, 214627966, 214420378, 214182392, 213898599, 213559985, 213161394, 212725624, 212269738, 211768970, 211240008, 210707739, 210201278, 209714517, 209196702, 208662584, 208141387, 207635909, 207105592, 206484273, 205857575, 205345958, 204894885, 204443678, 203992426, 203580156, 203250602, 203035697, 202904105, 202679574, 202296361, 201939136, 201795921, 201814905, 201761290, 201547772, 201358885, 201304123, 201328173, 201403081, 201513201, 201648131, 201838240, 202076599, 202382103, 202859908, 203483135, 204166532, 204894781, 205719307, 206616372, 207415283, 208094910, 208839014, 209754258]
3442.8B09754258J051754J152083J180172J206324J291379J341716J382187J451060
3459.1B19810933J447573J473770J673639J834958J725003J482353J484379J710892
3475.4B32643500J920611J971900J874596J882076K036870K072289K001599K021834
3491.7B48425275K079129K143354K192318K227992K224594K137572K115905K216280
3508B65762419K341538K484322K517849K392113K385736K523362K623141K563983K496332
3526.4B88090795K620667K813072K909570K956868K962052K925575L017426L154754
3542.7C11450779L217042L208607L236056L316581L393829L485203L574490L661215
3559C38543802L650696L489405L472685M039824M623801M532248M297375M335910M493475
$$ y = [209754258, 210806012, 211958095, 213138267, 214344591, 215635970, 216977686, 218359873, 219810933, 221258506, 222732276, 224405915, 226240873, 227965876, 229448229, 230932608, 232643500, 234564111, 236536011, 238410607, 240292683, 242329553, 244401842, 246403441, 248425275, 250504404, 252647758, 254840076, 257068068, 259292662, 261430234, 263546139, 265762419, 268103957, 270588279, 273106128, 275498241, 277883977, 280407339, 283030480, 285594463, 288090795, 290711462, 293524534, 296434104, 299390972, 302353024, 305278599, 308296025, 311450779, 314667821, 317876428, 321112484, 324429065, 327822894, 331308097, 334882587, 338543802, 342194498, 345683903, 349156588, 353196412, 357820213, 362352461, 366649836, 370985746, 375479221]
3577.4C75479221M671097M778057M646779M466801M723192N243450N188346M958332
3593.7D14155275N081564N295276N395383N416244N221635M841865M862457N221635
3610D55491334N375266N431384N303979N259216N798399N928934N231321M458606M623473
3628.4E02901912N763948N885541N429983N203605M976630M803837M629135M141986
3644.7E43736577L624618M120171N393207N385220M557312M510760M741728M370928
3661E80440521L926397L527999K893269K627611L187179L107369K777815L633320M009247
3679.4F10130727L518105L086209K581418K025902K105534K863884L117681K694666
3695.7F32124126K117097J641989J598001J987457J920640J216889P23064J252591
$$ y = [375479221, 380150318, 384928375, 389575154, 394041955, 398765147, 404008597, 409196943, 414155275, 419236839, 424532115, 429927498, 435343742, 440565377, 445407242, 450269699, 455491334, 460866600, 466297984, 471601963, 476861179, 482659578, 488588512, 493819833, 498278439, 502901912, 508665860, 514551401, 519981384, 525184989, 530161619, 534965456, 539594591, 543736577, 547361195, 551481366, 556874573, 562259793, 566817105, 571327865, 576069593, 580440521, 584366918, 587894917, 590788186, 593415797, 596602976, 599710345, 602488160, 606121480, 610130727, 613648832, 616735041, 619316459, 621342361, 623447895, 626311779, 629429460, 632124126, 634241223, 635883212, 637481213, 639468670, 641389310, 642606199, 643329263, 644581854]
3712F44581854K262712K284765J608610J118481J075864J204133J338721J436233J006723
3730.3F57918096L44216L56973J220047J929045J480400J91987j61648J026750J036703
3748.7F65342569O00517J525998K078116J499653R59814J105308J169801P74145N63502
3767.1F75619423O67751J024127J291216J040995O26266N15282P41422P84218P36297
3785.4F83046997Q95619R23157P28488L98338J28984J61111L2604J99616J064837R91404
3805.8F88571155P19845J100541R31382J28925k53201J60635J56343N21063J309336
3824.2F93346024J060187O20842L63768K04920K28346n2870j09434N86629J051784
3842.5F97300196J071810Q90136L95835n44608j329064P9691J808941J453698M84228
$$ y = [644581854, 646844566, 649129331, 650737941, 651856422, 652932286, 654136419, 655475140, 656911373, 657918096, 658262312, 658619285, 659839332, 661768377, 663248777, 663440764, 663279116, 664305866, 665342569, 665943086, 667469084, 669547200, 671046853, 672006667, 673111975, 674281776, 675055921, 675619423, 676287174, 677311301, 678602517, 679643512, 680269778, 680785060, 681526482, 682310700, 683046997, 683942616, 684865773, 685594261, 685992599, 686121583, 686282694, 686315298, 686514914, 687579751, 688571155, 689291000, 690391541, 691322923, 691451848, 691198647, 691359282, 691515625, 692036688, 693346024, 694406211, 695027053, 695390821, 695595741, 695824087, 695771217, 695661783, 696248412, 697300196, 698372006, 699262142, 699657977, 699113369, 697784305, 697863996, 699672937, 701126635, 701610863]
3860.9G01610863q1956J19090L08216o7056J65820P64788Q80122O62267N5075l1889
3881.3G04385340L10421K85089N00977M44532J16765M30584N31852j14798n74887l33190
3901.7G05982685K55466Q86619J079082P12574L31878O5446k63571k44558K24054M14788
3922.1G09444463K37286J95623J84536K7835J07229L70800L97742K40326N3227Q106
3942.5G11267173J68264K10881J60337K17795K20180J70529K03848K36690J58071P9453
3962.9G13093221J00732J37448J60873J77503J48833J36792J96040K00272J53362J56999
3983.2G14662075J39594O3241L9160J25050J99914J78516J28746
3997.5G15536296
$$ y = [701610863, 701528907, 701647997, 701956213, 701889157, 702054977, 702819765, 703699887, 704362154, 704417229, 704385340, 704695761, 704980850, 705481827, 705926359, 706043124, 706473708, 707005560, 706890762, 706315875, 705982685, 706238151, 707124770, 708203852, 708916426, 709248304, 709313750, 709050179, 708805621, 709029675, 709444463, 709681749, 709877372, 710061908, 710089743, 710196972, 710567772, 710965514, 711205840, 711259067, 711267173, 711435437, 711646318, 711806655, 712024450, 712244630, 712415159, 712619007, 712855697, 713013768, 713093221, 713193953, 713331401, 713492274, 713669777, 713818610, 713955402, 714151442, 714351714, 714505076, 714662075, 714801669, 714864910, 714904070, 715029120, 715229034, 715407550, 715536296]
##END=$$ End of the data block
