##TITLE=G15-52-CE $$ Begin of the data block
##JCAMP-DX=5.00 $$ ACD/SpecManager v 10.08
##SPECTROMETER/DATA SYSTEM=Alpha
##DATE=21 Oct 2013 11:04:12
##DATA TYPE=INFRARED SPECTRUM
##DATA CLASS=XYDATA
##ORIGIN=
##OWNER=
##NPOINTS=1765
##FIRSTX=399.75695801
##LASTX=3997.56933594
##MAXX=3997.56933594
##MINX=399.75695801
##MAXY=0.79116052
##MINY=0.19647996
##XFACTOR=1.0000000000
##YFACTOR=1.000000000000000e-9
##FIRSTY=0.47242430
##DELTAX=2.03957629
##XUNITS=1/CM
##YUNITS=ARBITRARY UNITS
##XYDATA=(X++(Y..Y))
$$ plain form
399.8 472424299 470616817 469024122 467124820 465755016 465429932 465949029 466315418 465624869 464315206
418.1 464315206 463504136 462589562 460949570 459460407 458334088 456947029 455145270 453394502 452379346
436.5 452379346 452295125 452870101 453977674 455506504 456979156 457522154 456781656 455608279 454666615
454.8 454666615 453441620 451509297 449248075 447028041 444892019 442426085 439544618 437025696
471.1 437025696 435297370 433688790 431799203 430276662 429534614 429050952 428124487 426900804 425951868
489.5 425951868 424892992 422977120 420502901 418171436 416021526 413574964 410691053 407817721
505.8 407817721 405200720 402523696 399490207 396510690 394107521 392039716 389883935 387919486
522.1 387919486 386736780 386420995 386393189 386348844 386832207 388232440 390310884 392664224 394958645
$$ packed form
399.8D72424299j807482j592695j899302j369804l25084N19097L66389o90549j309663
418.1D64315206q11070r14574j639992j489163j126319j387059j801759j750768j015156
436.5D52379346q4221N74976J107573J528830J472652N42998p40498j173377r41664
454.8D54666615j224995j932323k261222k220034k136022k465934k881467k518922
471.1D37025696j728326j608580j889587j522541p42048m83662r26465j223683r48936
489.5D25951868j058876j915872k474219k331465k149910k446562k883911k873332
505.8D07817721k617001k677024l033489k979517k403169k067805k155781j964449
522.1C87919486j182706l15785k7806m4345M83363J400233K078444K353340K294421
$$ plain form
540.5 394958645 396927059 398111522 398269266 397851050 397366852 396733433 395626932 394127399 392579436
558.8 392579436 391108125 389324784 386783421 383917987 381598592 380021095 379102230 379084557 380153954
577.2 380153954 382140696 384613574 387224764 389948875 392671615 394784451 395918131 396492511 397022247
595.6 397022247 397451788 397542417 397459716 397581756 397975743 398300558 398381233 398521960 398997903 399661928
616 399661928 400404990 401617527 403739214 406503022 409247667 411888421 414624929 417297155 419570982
634.3 419570982 421390414 423086762 424926698 426601410 427781254 428761125 429867476 430818081 431275666
652.7 431275666 431471974 431790322 432254642 432567179 432747602 433219105 434317350 435784459 436780363
671 436780363 437840968 439475656 441434115 443206429 444674164 446055681 447422981 448483497 448959053
$$ packed form
540.5C94958645J968414J184463J57744m18216m84198o33419j106501j499533j547963
558.8C92579436j471311j783341k541363k865434k319395j577497r18865j7673J069397
577.2C80153954J986742K472878K611190K724111K722740K112836J133680N74380N29736
595.6C97022247M29541R0629q2701J22040L93987L24815Q0675J40727M75943O64025
616C99661928P43062J212537K121687K763808K744645K640754K736508K672226K273827
634.3D19570982J819432J696348J839936J674712J179844R79871J106351R50605M57585
652.7D31275666J96308L18348M64320L12537J80423M71503J098245J467109R95904
671D36780363J060605J634688J958459J772314J467735J381517J367300J060516M75556
$$ plain form
689.4 448959053 449018717 448832721 448232055 447194278 446351230 446527541 447836816 449635178 451544046
707.7 451544046 453893155 456958681 460456967 464006037 467767507 472123384 476948768 481719732
724 481719732 486230671 490638405 494936436 498670697 501460731 503598928 505545795 507143557 507895350
742.4 507895350 508002698 508172214 508535385 508519530 507863581 507009625 506240427 505278170 504010916 503015459
762.8 503015459 503049791 504398525 506815612 510219514 514828026 520332694 525857329 530852497 535404682
781.2 535404682 539640725 543234706 545880616 547981501 550090551 552256703 554293573 556420326
797.5 556420326 559279084 563021958 566778421 569770515 572365403 574978769 577131271 578262627
813.8 578262627 578621328 578850567 578981876 578357577 576700926 574622214 572660327 570533693 567911506
$$ packed form
689.4D48959053N9664j85996o00666j037777q43048J76311J309275J798362J908868
707.7D51544046K349109L065526L498286L549070L761470M355877M825384M770964
724D81719732M510939M407734M298031L734261K790034K138197J946867J597762P51793
742.4E07895350J07348J69516L63171j5855o55949q53956p69198r62257j267254r95457
762.8E03015459L4332J348734K417087L403902M608512N504668N524635M995168M552185
781.2E35404682M236043L593981K645910K100885K109050K166152K036870K126753
797.5E56420326K858758L742874L756463K992094K594888K613366K152502J131356
813.8E78262627L58701K29239J31309o24299j656651k078712j961887k126634k622187
$$ plain form
832.1 567911506 565258145 563071907 561037123 558620572 556091726 554192781 552937329 551668048
848.5 551668048 550228417 549197614 548888028 548755229 548437297 549045801 552003384 557039380 562754273
866.8 562754273 568418026 574084878 579369724 583108246 584575832 584241152 582657218 579629302 575099051
885.2 575099051 569876313 564863384 560115516 555185795 550088942 545330942 540911376 536026478
901.5 536026478 530126989 523577988 516901255 509983540 502543926 495025963 488294035 482671082
917.8 482671082 478018045 474424958 472132325 470851362 469810307 468642741 467668056 467188179 466921836
936.2 466921836 466374427 465523720 464452982 462381065 458065361 451179832 442523748 432985723 422868222
954.5 422868222 412259400 401498973 390903354 380351692 369615555 358851492 348486245
$$ packed form
832.1E67911506k653361k186238k034784k416551k528846j898945j255452j269281
848.5E51668048j439631j030803l09586j32799l17932O08504K957583N035996N714893
866.8E62754273N663753N666852N284846L738522J467586l34680j583934l027916m530251
885.2E75099051n222738n012929m747868m929721n096853m758000m419566m884898
901.5E36026478n899489o549001o676733o917715p439614p517963o731928n622953
917.8D82671082m653037l593087k292633j280963j041055j167566r74685m79877k66343
936.2D66921836n47409q50707j070738k071917m315704o885529q656084r538025j0117501
954.5D22868222j0608822j0760427j0595619j0551662j0736137j0764063j0365247
$$ plain form
968.8 348486245 338841438 329996407 322035670 315262735 309888303 305745900 302546889 300144941
985.1 300144941 298432261 297135174 295925438 294695556 293634951 292967021 292634577 292431325 292247564
1003.5 292247564 291962266 291300237 290047288 288289934 286341488 284446359 282557338 280539274 278465688
1021.8 278465688 276435941 274336874 272061378 269731075 267545521 265506446 263421476 261197090
1038.1 261197090 258986086 256945461 255082399 253368229 251892954 250907063 250561476 250767261 251395583
1056.5 251395583 252436191 253913164 255764276 257807344 259671479 260721534 260481089 259276897
1072.8 259276897 258108348 257938057 259132773 261491537 264718145 268641382 273041427 277614474
1089.1 277614474 282062739 286182314 289926618 293217659 295845896 297725767 299158871 300674170
$$ packed form
968.8C48486245r644807q845031p960737o772935n374432m142403l199011k401948
985.1C00144941j712680j297087j209736j229882j060605o67930l32444k03252j83761
1003.5B92247564k85298o62029j252949j757354j948446j895129j889021k018064k073586
1021.8B78465688k029747k099067k275496k330303k185554k039075k084970k224386
1038.1B61197090k211004k040625j863062j714170j475275r85891l45587K05785O28322
1056.5B51395583J040608J476973J851112K043068J864135J050055k40445j204192
1072.8B59276897j168549j70291J194716K358764L226608L923237M400045M573047
1089.1B77614474M448265M119575L744304L291041K628237J879871J433104J515299
$$ plain form
1105.4 300674170 302579761 304847032 307447106 310422182 313602805 316624641 319264621 321574271
1121.8 321574271 323690981 325749010 327975541 330661178 333782226 336842626 339292973 340875894
1138.1 340875894 341598868 341615707 341136128 340352774 339506596 338892579 338646948 338789493 339523464 341141075
1158.5 341141075 343728721 347124755 351131707 355687886 360817134 366554409 372886300 379795700
1174.8 379795700 387224227 394925982 402518511 409718335 416450024 422587365 427760452 431643695
1191.1 431643695 434232652 435694486 436128944 435628444 434514076 433249176 432094365 431048483 430117041
1209.5 430117041 429428190 428984940 428487211 427660108 426552713 425301641 423839957 422017962 419901252
1227.8 419901252 417743534 415753752 413971394 412423164 411291480 410770237 410893798 411583126 412798464
$$ packed form
1105.4C00674170J905591K267271K600074K975076L180623L021836K639980K309650
1121.8C21574271K116710K058029K226531K685637L121048L060400K450347J582921
1138.1C40875894P22974J6839m79579p83354q46178o14017k45631J42545P33971J617611
1158.5C41141075K587646L396034M006952M556179N129248N737275O331891O909400
1174.8C79795700P428527P701755P592529P199824O731689O137341N173087L883243
1191.1D31643695K588957J461834M34458n00500j114368j264900j154811j045882r31442
1209.5D30117041o88851m43250m97729q27103j107395j251072j461684j821995k116710
1227.8D19901252k157718j989782j782358j548230j131684n21243J23561O89328J215338
$$ plain form
1246.2 412798464 414546847 416750193 419165194 421591818 424046785 426589876 429122746 431505889
1262.5 431505889 433801651 436174452 438597113 440847993 442777306 444388568 445728004 446799904
1278.8 446799904 447710365 448708028 449919999 451199025 452294856 453083634 453490525 453389376 452604026
1297.2 452604026 451139510 449276149 447261751 445123971 442868322 440707326 438927114 437678009
1313.5 437678009 436919659 436643630 436926812 437543601 437895328 437498003 436268717 434401721 432136267
1331.8 432136267 429677993 427299976 425310791 423988491 423259228 422700405 422081292 421367973 420411915
1350.2 420411915 419061303 417370141 415513963 413471460 410875231 407537341 403803229 399905890
1366.5 399905890 395965457 392434120 389167041 385763735 382276386 378550559 374445826 370306313
$$ packed form
1246.2D12798464J748383K203346K415001K426624K454967K543091K532870K383143
1262.5D31505889K295762K372801K422661K250880J929313J611262J339436J071900
1278.8D46799904R10461R97663J211971J279026J095831P88778M06891j01149p85350
1297.2D52604026j464516j863361k014398k137780k255649k160996j780212j249105
1313.5D37678009p58350k76029K83182O16789L51727l97325j229286j866996k265454
1331.8D32136267k458274k378017j989185j322300p29263n58823o19113p13319r56058
1350.2D20411915j350612j691162j856178k042503k596229l337890l734112l897339
1366.5C99905890l940433l531337l267079l403306l487349l725827m104733m139513
$$ plain form
1382.8 370306313 366662234 363947779 362508595 361957818 361547887 361148119 361053526 361427724 362381190
1401.2 362381190 363786012 365602612 367774576 370061994 372409761 374745756 376921982 379130185
1417.5 379130185 382041514 385321498 388269871 390784919 392648846 393773377 394169331 393696427 392451197
1435.9 392451197 391551226 391604304 391934872 392225385 392550558 393071413 393685132 394002885 394190490 395402163
1456.2 395402163 398921788 403150320 406716943 410239428 414444685 419262141 425188541 433560044
1472.6 433560044 443141758 451350272 457561493 461758882 464090854 464411497 462485671 458459437
1488.9 458459437 453329951 448079616 441676766 433480084 425534278 418734848 411931992 402604878
1505.2 402604878 389838517 379456162 371265203 362933308 355272174 349521935 345892102 342996985
$$ packed form
1382.8C70306313l644079k714455j439184n50777m09931l99768r4593L74198R53466
1401.2C62381190J404822J816600K171964K287418K347767K335995K176226K208203
1417.5C79130185K911329L279984K948373K515048J863927J124531L95954m72904j245230
1435.9C92451197q99971N3078L30568K90513L25173N20855O13719L17753J87605J211673
1456.2C95402163L519625M228532L566623L522485M205257M817456N926400Q371503
1472.6D33560044R581714Q208514O211221M197389K331972L20643j925826m026234
1488.9D58459437n129486n250335o402850q196682p945806o799430o802856r327114
1505.2D02604878j2766361j0382355q190959q331895p661134n750239l629833k895117
$$ plain form
1521.5 342996985 340301931 337671697 334845662 332278818 329681277 326986820 325044185 323413074
1537.8 323413074 321575820 321036637 322132915 324054211 326493204 329495370 333099276 337038815
1554.1 337038815 340832651 345417082 351918966 357347161 361516297 365185767 368340492 371398687
1570.5 371398687 373984367 375698388 377045006 378325999 379132539 379275501 378930569 378114611 376839697
1588.8 376839697 375099599 372840047 369921535 366419762 362367094 357576936 352004707 345717818
1605.1 345717818 338668108 330712169 322195947 313463181 303540051 292044133 281908125 272119015
1621.4 272119015 260540277 249204278 239007682 229469061 221168429 213359788 205335990 199951157
1637.8 199951157 197633848 196691141 196479961 196974322 198459953 200219244 202165037 205579832 209615812
$$ packed form
1521.5C42996985k695054k630234k826035k566844k597541k694457j942635j631111
1537.8C23413074j837254n39183J096278J921296K438993L002166L603906L939539
1554.1C37038815L793836M584431O501884N428195M169136L669470L154725L058195
1570.5C71398687K585680J714021J346618J280993Q06540J42962l44932q15958j274914
1588.8C76839697j740098k259552k918512l501773m052668m790158n572229o286889
1605.1C45717818p049710p955939q516222q732766r923130j1495918j0136008r789110
1621.4B72119015j1578738j1335999j0196596r538621q300632p808641q023798n384833
1637.8A99951157k317309r42707k11180M94361J485631J759291J945793L414795M035980
$$ plain form
1656.1 209615812 213461474 217813805 223285928 229759872 236087039 242876574 250940502 258853614
1672.4 258853614 267015576 276075333 284765035 292895317 301926851 314016998 326389372 337628067
1688.8 337628067 349941730 362817079 378001601 395774931 413938969 434286863 451735228
1703 451735228 465961486 479908377 492067486 502079904 510317206 517373562 524686933 532133520
1719.3 532133520 538150847 542854905 546920657 550341964 553119481 555219769 557455599 560832560
1735.7 560832560 564272225 567566752 571450055 576068580 581288695 587050855 593896747 602033257
1752 602033257 609986186 617441177 624744534 631614387 638651073 645536959 651430845 656559289 661282778
1770.3 661282778 666381717 671873927 676584721 680455446 684059680 687510312 690657437 693581879
$$ packed form
1656.1B09615812L845662M352331N472123O473944O327167O789535Q063928P913112
1672.4B58853614Q161962R059757Q689702Q130282R031534J2090147J2372374J1238695
1688.8C37628067J2313663J2875349J5184522J7773330J8164038K0347894J7448365
1703D51735228J4226258J3946891J2159109J0012418Q237302P056356P313371P446587
1719.3E32133520O017327M704058M065752L421307K777517K100288K235830L376961
1735.7E60832560L439665L294527L883303M618525N220115N762160O845892Q136510
1752F02033257P952929P454991P303357O869853P036686O885886N893886N128444M723489
1770.3F61282778N098939N492210M710794L870725L604234L450632L147125K924442
$$ plain form
1786.7 693581879 696106434 698079348 700301349 703053832 705590367 707699835 709781766 712041318
1803 712041318 714263797 716238320 717892945 719513774 721347153 723220110 724952638 726558924 727928519
1821.3 727928519 729062080 730276644 731506765 732680380 734297514 736101389 737476528 738590419
1837.6 738590419 739608526 740260661 740747213 741847873 743347049 744682908 745790243 746684611 747484386
1856 747484386 748290420 749120414 749878645 750412881 750622630 750903130 751847625 753084779 754062295 754814804
1876.4 754814804 755486250 756115019 756766021 757452250 758023798 758435726 759033322 759848595 760553956 761182070
1896.8 761182070 761806428 762382686 762899518 763335347 763670743 764021635 764531195 765033543 765239775 765288532
1917.2 765288532 765642941 766181231 766626775 767120957 767643809 768052757 768330276 768516302 768718243 768999279
$$ packed form
1786.7F93581879K524555J972914K222001K752483K536535K109468K081931K259552
1803G12041318K222479J974523J654625J620829J833379J872957J732528J606286J369595
1821.3G27928519J133561J214564J230121J173615J617134J803875J375139J113891
1837.6G38590419J018107O52135M86552J100660J499176J335859J107335Q94368P99775
1856G47484386Q06034Q29994P58231N34236K09749K80500R44495J237154R77516P52509
1876.4G54814804O71446O28769O51002O86229N71548M11928N97596Q15273P05361O28114
1896.8G61182070O24358N76258N16832M35829L35396L50892N09560N02348K06232M8757
1917.2G65288532L54409N38290M45544M94182N22852M08948K77519J86026K01941K81036
$$ plain form
1937.6 768999279 769153893 769091845 769200087 769654810 770128906 770405412 770567238 770795941 771131337 771414757
1958 771414757 771595836 771804869 772058606 772227645 772368014 772621870 772961199 773270071 773439348 773527265
1978.4 773527265 773688257 773922205 774043620 774010420 774009585 774132967 774316192 774440408 774498940 774663866
1998.8 774663866 774898469 774937153 774819970 774786949 774839997 774767101 774519920 774277210 774178863 774136305 773936033
2021.2 773936033 773637176 773467720 773407340 773233056 772914410 772641003 772497237 772322476 771999478 771714628
2041.6 771714628 771650016 771675408 771568239 771389842 771351635 771437347 771448195 771369755 771393716 771567225 771730840
2064 771730840 771798790 771878481 772049367 772212565 772242904 772219539 772302389 772504628 772660017 772680879 772722125
2086.5 772722125 772900581 773124516 773234248 773268461 773397148 773647845 773849487 773907661 773983121 774200618
$$ packed form
1937.6G68999279J54614o2048J08242M54723M74096K76506J61826K28703L35396K83420
1958G71414757J81079K09033K53737J69039J40369K53856L39329L08872J69277Q7917
1978.4G73527265J60992K33948J21415l3200q35J23382J83225J24216N8532J64926
1998.8G74663866K34603L8684j17183l3021N3048p2896k47181k42710r8347m2558k00272
2021.2G73936033k98857j69456o0380j74284l18646k73407j43766j74761l22998k84850
2041.6G71714628o4612K5392j07169j78397l8207Q5712J0848p8440K3961J73509J63615
2064G71730840O7950P9691J70886J63198L0339k3365Q2850K02239J55389K0862M1246
2086.5G72722125J78456K23935J09732L4213J28687K50697K01642N8174P5460K17497
$$ plain form
2106.9 774200618 774443567 774561822 774614990 774757981 774998665 775159657 775182784 775252461 775458336 775654495
2127.3 775654495 775708020 775719643 775864244 776085019 776207626 776248097 776342452 776529908 776689529 776743233
2147.7 776743233 776820898 777037501 777304888 777480185 777605772 777850986 778220594 778528154 778734207 779031813
2168 779031813 779502213 779970109 780297875 780617595 781077325 781576455 781943440 782221317 782591224 783064663
2188.4 783064663 783467114 783737779 784034193 784464180 784881055 785130858 785353720 785730600 786157072 786444664
2208.8 786444664 786646545 786943972 787329376 787658870 787887514 788112044 788411021 788705409 788886070 789012253
2229.2 789012253 789197028 789399564 789524913 789611816 789770603 790001333 790182531 790230036 790252984 790383339
2249.6 790383339 790541530 790600359 790583968 790617764 790735900 790859640 790938735 790998757 791062355 791125774 791160524
$$ packed form
2106.9G74200618K42949J18255N3168J42991K40684J60992K3127O9677K05875J96159
2127.3G75654495N3525J1623J44601K20775J22607M0471R4355J87456J59621N3704
2147.7G76743233P7665K16603K67387J75297J25587K45214L69608L07560K06053K97606
2168G79031813M70400M67896L27766L19720M59730M99130L66985K77877L69907M73439
2188.4G83064663M02451K70665K96414M29987M16875K49803K22862L76880M26472K87592
2208.8G86444664K01881K97427L85404L29494K28644K24530K98977K94388J80661J26183
2229.2G89012253J84775K02536J25349Q6903J58787K30730J81198M7505K2948J30355
2249.6G90383339J58191N8829j6391L3796J18136J23740P9095O0022O3598O3419L4750
$$ plain form
2272.1 791160524 791093946 790996969 791012883 791083515 791098714 791088998 791085184 791062534 790997088 790914059 790908277 790983081
2296.5 790983081 791001618 790897787 790803850 790800333 790825069 790827692 790788293 790723979 790658116 790633202 790648520 790647686
2321 790647686 790610492 790514767 790344715 790149093 789965391 789747655 789470911 789200664 788971722 788697541
2341.4 788697541 788239419 787501454 786890149 786787093 787014067 787159920 787104607 787078619 786969066 786549211
2361.8 786549211 785932243 785205245 784379721 783601165 782937646 782310128 781680644 781053126 780410588 779815614
2382.2 779815614 779367387 779018164 778616846 778083086 777524352 777084351 776710093 776252031 775692344 775135100
2402.6 775135100 774615705 774061799 773432076 772810996 772261381 771693885 771005273 770246923 769558787 768929780
2423 768929780 768209934 767383397 766604781 765914679 765190482 764385045 763577521 762835264 762127161 761359692
$$ packed form
2272.1G91160524o6578r6977J5914P0632J5199r716l814k2650o5446q3029n782P4804
2296.5G90983081J8537j03831r3937l517K4736K623l9399o4314o5863k4914J5318q34
2321G90647686l7194r5725j70052j95622j83702k17736k76744k70247k28942k74181
2341.4G88697541m58122p37965o11305j03056K26974J45853n5313k5988j09553m19855
2361.8G86549211o16968p26998q25524p78556o63519o27518o29484o27518o42538n94974
2382.2G79815614m48227l49223m01318n33760n58734m40001l74258m58062n59687n57244
2402.6G75135100n19395n53906o29723o21080n49615n67496o88612p58350o88136o29007
2423G68929780p19846q26537p78616o90102p24197q05437q07524p42257p08103p67469
$$ plain form
2443.4 761359692 760535657 759765625 759039879 758238435 757362366 756547391 755829632 755102634 754315197 753514349
2463.8 753514349 752767801 752048075 751264393 750438035 749684036 749006987 748277128 747461200 746675968 745972037
2484.2 745972037 745271683 744510353 743716955 742978454 742297649 741584837 740826309 740108848 739455104 738789141
2504.6 738789141 738086462 737382233 736710846 736056149 735353649 734619558 733920753 733251214 732546628 731776953
2525 731776953 731014132 730317235 729616761 728834152 728003502 727221072 726494670 725731552 724876225 723995149
2545.4 723995149 723204792 722497642 721779346 721029818 720286548 719557762 718801260 717997491 717232406 716561377
2565.8 716561377 715878069 715098381 714293122 713553131 712847114 712091744 711304367 710562050 709863067 709117651
2586.2 709117651 708297670 707502067 706783295 706055880 705255806 704435408 703658581 702898920 702081501 701169848
$$ packed form
2443.4G61359692q24035p70032p25746q01444q76069q14975p17759p26998p87437q00848
2463.8G53514349p46548p19726p83682q26358p53999o77049p29859q15928p85232p03931
2484.2G45972037p00354p61330p93398p38501o80805p12812p58528p17461o53744o65963
2504.6G38789141p02679p04229o71387o54697p02500p34091o98805o69539p04586p69675
2525G31776953p62821o96897p00474p82609q30650p82430p26402p63118q55327q81076
2545.4G23995149p90357p07150p18296p49528p43270p28786p56502q03769p65085o71029
2565.8G16561377o83308p79688q05259p39991p06017p55370p87377p42317o98983p45416
2586.2G09117651q19981p95603p18772p27415q00074q20398p76827p59661q17419r11653
$$ plain form
2606.6 701169848 700213969 699286699 698345423 697301447 696206212 695136249 694018245 692806065 691592634
2624.9 691592634 690436184 689263046 688000262 686687946 685413122 684200466 682971954 681651354
2641.2 681651354 680310130 679068923 677870333 676598489 675291002 674032569 672805130 671538949
2657.5 671538949 670224667 668944955 667752981 666567326 665336311 664113581 662942290 661801815
2673.9 661801815 660656631 659499824 658350468 657248616 656180084 655100882 654006064 652913749
2690.2 652913749 651828468 650705397 649523258 648326099 647120655 645865262 644565761 643274248
2706.5 643274248 641982853 640608132 639170110 637778223 636448026 635119259 633752644 632365823
2722.8 632365823 631017566 629746675 628515005 627276421 626052082 624890506 623766541 622608781
$$ packed form
2606.6G01169848r55879r27270r41276j043976j095235j069963j118004j212180j213431
2624.9F91592634j156450j173138j262784j312316j274824j212656j228512j320600
2641.2F81651354j341224j241207j198590j271844j307487j258433j227439j266181
2657.5F71538949j314282j279712j191974j185655j231015j222730j171291j140475
2673.9F61801815j145184j156807j149356j101852j068532j079202j094818j092315
2690.2F52913749j085281j123071j182139j197159j205444j255393j299501j291513
2706.5F43274248j291395j374721j438022j391887j330197j328767j366615j386821
2722.8F32365823j348257j270891j231670j238584j224339j161576j123965j157760
$$ plain form
2739.1 622608781 621432602 620290279 619179904 618079960 616992354 615910113 614831090 613778055
2755.4 613778055 612732112 611666620 610592663 609507322 608392954 607256114 606111348 604946375
2771.8 604946375 603747666 602534533 601283312 599953234 598570287 597140491 595639586 594089389
2788.1 594089389 592534065 590960503 589314640 587600708 585853338 584074378 582242191 580339193
2804.4 580339193 578372896 576363564 574328244 572223008 570028782 567811728 565545499 563150883
2820.7 563150883 560644448 558075428 555426121 552637815 549681008 546541631 543192267 539538860
2837 539538860 535412014 530645192 525104880 518731475 511677384 504420757 497677267 492169410 488260537
2855.4 488260537 485643238 483582944 481349945 478413731 474655241 470323056 465825260 461659580
$$ packed form
2739.1F22608781j176179j142323j110375j099944j087606j082241j079023j053035
2755.4F13778055j045943j065492j073957j085341j114368j136840j144766j164973
2771.8F04946375j198709j213133j251221j330078j382947j429796j500905j550197
2788.1E94089389j555324j573562j645863j713932j747370j778960j832187j902998
2804.4E80339193j966297k009332k035320k105236k194226k217054k266229k394616
2820.7E63150883k506435k569020k649307k788306k956807l139377l349364l653407
2837E39538860m126846m766822n540312o373405p054091p256627o743490n507857l908873
2855.4D88260537k617299k060294k232999k936214l758490m332185m497796m165680
$$ plain form
2871.7 461659580 458218634 455632657 453798503 452481776 451420158 450362474 449154377 447764397
2888 447764397 446184903 444385290 442322761 439990371 437460601 434763908 431805581 428507507 424829781
2906.4 424829781 420696855 416006923 410725147 404979944 398974031 392993361 387465179 382792950
2922.7 382792950 379270464 377056718 376154274 376526356 378135055 380883843 384630084 389132023 393970639
2941 393970639 398656875 402810693 406186908 408666968 410310239 411329597 412081629 413036734 414615989
2959.4 414615989 417058527 420408815 424602121 429522544 435023099 440961450 447150856 453355551
2975.7 453355551 459447652 465358049 470901608 475939572 480478227 484490693 487892002 490653545
2992 490653545 492802292 494345337 495250434 495503902 495178163 494426608 493405581 492211789 490951002
$$ packed form
2871.7D61659580l440946k585977j834154j316727j061618j057684j208097j389980
2888D47764397j579494j799613k062529k332390k529770k696693k958327l298074l677726
2906.4D24829781m132926m689932n281776n745203o005913n980670n528182m672229
2922.7C82792950l522486k213746r02444L72082J608699K748788L746241M501939M838616
2941C93970639M686236M153818L376215K480060J643271J019358P52032R55105J579255
2959.4D14615989K442538L350288M193306M920423N500555N938351O189406O204695
2975.7D53355551O092101N910397N543559N037964M538655M012466L401309K761543
2992D90653545K148747J543045R05097K53468l25739p51555j021027j193792j260787
$$ plain form
3010.4 490951002 489734739 488590509 487465024 486228257 484750062 482972682 480935305 478759229
3026.7 478759229 476537734 474342674 472200513 470014870 467723489 465355784 462924808 460427225
3043 460427225 457869411 455254465 452606648 449989110 447383016 444710881 442027837 439455003 437022001
3061.4 437022001 434724241 432575434 430589169 428754896 426997960 425286293 423652351 422083914
3077.7 422083914 420551986 419051409 417595863 416226834 414979607 413822263 412717164 411642760
3094 411642760 410549194 409422219 408239156 406974107 405664384 404323280 402928919 401469201 399964571
3112.4 399964571 398443997 396881133 395242989 393525839 391725987 389864802 387962818 386011392
3128.7 386011392 384016454 381996006 379936665 377810895 375637412 373434454 371212929 368979990
$$ packed form
3010.4D90951002j216263j144230j125485j236767j478195j777380k037377k176076
3026.7D78759229k221495k195060k142161k185643k291381k367705k430976k497583
3043D60427225k557814k614946k647817k617538k606094k672135k683044k572834k433002
3061.4D37022001k297760k148807j986265j834273j756936j711667j633942j568437
3077.7D22083914j531928j500577j455546j369029j247227j157344j105099j074404
3094D11642760j093566j126975j183063j265049j309723j341104j394361j459718j504630
3112.4C99964571j520574j562864j638144j717150j799852j861185j901984j951426
3128.7C86011392j994938k020448k059341k125770k173483k202958k221525k232939
$$ plain form
3145 368979990 366716832 364455253 362216324 359925508 357545286 355160892 352827311 350489646 348110825
3163.4 348110825 345734417 343374044 340998501 338620991 336235940 333815336 331426769 329140395
3179.7 329140395 326864868 324522793 322170705 319854349 317563742 315302044 313107580 310963839
3196 310963839 308819175 306701094 304652125 302640080 300643086 298673302 296724349 294790357 292878389
3214.3 292878389 290988386 289113015 287261426 285408109 283516616 281623840 279753745 277842999
3230.7 277842999 275861382 273824036 271747082 269662410 267539471 265340120 263085872 260789722
3247 260789722 258453846 256083846 253685564 251285464 248878747 246442392 244029388 241716355 239507958
3265.3 239507958 237358689 235273153 233307004 231482238 229786515 228227496 226822600 225552753
$$ packed form
3145C68979990k263158k261579k238929k290816k380222k384394k333581k337665k378821
3163.4C48110825k376408k360373k375543k377510k385051k420604k388567k286374
3179.7C29140395k275527k342075k352088k316356k290607k261698k194464k143741
3196C10963839k144664k118081k048969k012045j996994j969784j948953j933992j911968
3214.3B92878389j890003j875371j851589j853317j891493j892776j870095j910746
3230.7B77842999j981617k037346k076954k084672k122939k199351k254248k296150
3247B60789722k335876k370000k398282k400100k406717k436355k413004k313033k208397
3265.3B39507958k149269k085536j966149j824766j695723j559019j404896j269847
$$ plain form
3281.6 225552753 224382237 223325908 222411230 221622944 220938653 220329240 219776273 219308242 218921602
3300 218921602 218569174 218270883 218026072 217777506 217547014 217368886 217218608 217102244 217025831 216940999
3320.4 216940999 216807857 216609210 216376126 216173708 216016293 215848953 215648130 215432495 215159163 214804456
3340.8 214804456 214422733 214023009 213593945 213148385 212664485 212132111 211579785 211063236 210589811 210095331
3361.2 210095331 209557191 209025249 208514854 207950369 207308114 206685349 206162468 205714121 205279231 204840198
3381.6 204840198 204427376 204066336 203814507 203655332 203408971 203025237 202682421 202535525 202533245 202475786
3402 202475786 202283472 202092960 202006966 202031359 202136278 202272981 202429265 202624649 202876553 203200057
3422.4 203200057 203654468 204266742 204972342 205695495 206510410 207441553 208292112 208979756 209678575 210555136
$$ packed form
3281.6B25552753j170516j056329r14678p88286o84291o09413n52967m68031l86640
3300B18921602l52428k98291k44811k48566k30492j78128j50278j16364p6413q4832
3320.4B16940999j33142j98647k33084k02418j57415j67340k00823k15635k73332l54707
3340.8B14804456l81723l99724m29064m45560m83900n32374n52326n16549m73425m94480
3361.2B10095331n38140n31942n10395n64485o42255o22765n22881m48347m34890m39033
3381.6B04840198m12822l61040k51829j59175k46361l83734l42816j46896k280n7459
3402B02475786j92314j90512q5994K4393J04919J36703J56284J95384K51904L23504
3422.4B03200057M54411O12274P05600P23153Q14915R31143Q50559O87644O98819Q76561
$$ plain form
3442.8 210555136 211599678 212727606 213888109 215103418 216385841 217750043 219194397 220671475
3459.1 220671475 222136915 223641425 225324541 227131829 228820145 230311856 231802404 233471856
3475.4 233471856 235384926 237413958 239354983 241256550 243235350 245222792 247220501 249320760
3491.7 249320760 251470059 253644139 255824655 257983714 260152966 262321383 264479250 266712338
3508 266712338 269106597 271649271 274177909 276595265 279041529 281580150 284191221 286789209 289332181
3526.4 289332181 291959167 294786215 297735661 300735444 303784579 306782484 309773326 312888712
3542.7 312888712 316110075 319302887 322493702 325801671 329262137 332836002 336450696 340136409
3559 340136409 343862772 347438663 350898772 354857445 359481931 364085227 368425608 372771144 377285153
$$ packed form
3442.8B10555136J044542J127928J160503J215309J282423J364202J444354J477078
3459.1B20671475J465440J504510J683116J807288J688316J491711J490548J669452
3475.4B33471856J913070K029032J941025J901567J978800J987442J997709K100259
3491.7B49320760K149299K174080K180516K159059K169252K168417K157867K233088
3508B66712338K394259K542674K528638K417356K446264K538621K611071K597988K542972
3526.4B89332181K626986K827048K949446K999783L049135K997905K990842L115386
3542.7C12888712L221363L192812L190815L307969L460466L573865L614694L685713
3559C40136409L726363L575891L460109L958673M624486M603296M340381M345536M514009
$$ plain form
3577.4 377285153 381979644 386765987 391442984 395959377 400687277 405920535 411157757 416188478
3593.7 416188478 421321929 426654696 432048649 437441736 442709059 447664112 452606618 457838088
3610 457838088 463204831 468633920 473965943 479269981 485048324 490905285 496112913 500610113 505256951
3628.4 505256951 511017740 516932070 522385359 527570784 532532036 537359297 542034626 546195984
3644.7 546195984 549752295 553722024 559021890 564444602 569055855 573543191 578246236 582585990
3661 582585990 586433530 589942396 592924535 595605254 598793864 601901054 604614913 608161509 612193286
3679.4 612193286 615800321 618921340 621505320 623522937 625535488 628333569 631482601 634157538
3695.7 634157538 636203408 637860179 639532328 641520798 643399894 644625604 645343661 646515965
$$ packed form
3577.4C77285153M694491M786343M676997M516393M727900N233258N237222N030721
3593.7D16188478N133451N332767N393953N393087N267323M955053M942506N231470
3610D57838088N366743N429089N332023N304038N778343N856961N207628M497200M646838
3628.4E05256951N760789N914330N453289N185425M961252M827261M675329M161358
3644.7E46195984L556311L969729N299866N422712M611253M487336M703045M339754
3661E82585990L847540L508866K982139K680719L188610L107190K713859L546596M031777
3679.4F12193286L607035L121019K583980K017617K012551K798081L149032K674937
3695.7F34157538K045870J656771J672149J988470J879096J225710P18057J172304
$$ plain form
3712 646515965 648737669 651061594 652753174 653928399 654940188 656027377 657322586 658770680 659804344
3730.3 659804344 660182357 660543501 661738038 663639724 665150106 665443659 665268302 666204214 667258799
3748.7 667258799 667814851 669224262 671254992 672739089 673699200 674803078 675965786 676765621 677354991
3767.1 677354991 678000629 679004312 680304468 681345165 681940854 682405829 683153033 684017837 684798598
3785.4 684798598 685680211 686611474 687345445 687694430 687759280 687917054 687988281 688151181 689136326 690084577
3805.8 690084577 690808475 692002296 693025351 693132877 692777097 692887425 693086445 693643689 694945753
3824.2 694945753 696000040 696627796 696993709 697199702 697493792 697521687 697359383 697851539 698880196
3842.5 698880196 699961424 700902224 701352656 700794458 699373782 699361742 701193869 702696085 703162253
$$ packed form
3712F46515965K221704K323925J691580J175225J011789J087189J295209J448094J033664
3730.3F59804344L78013L61144J194537J901686J510382K93553j75357R35912J054585
3748.7F67258799N56052J409411K030730J484097R60111J103878J162708P99835N89370
3767.1F77354991O45638J003683J300156J040697N95689M64975P47204Q64804P80761
3785.4F84798598Q81613R31263P33971L48985O4850J57774P1227J62900R85145R48251
3805.8F90084577P23898J193821J023055J07526l55780J10328J99020N57244J302064
3824.2F94945753J054287O27756L65913K05993K94090K7895j62304M92156J028657
3842.5F98880196J081228R40800M50432n58198j420676j2040J832127J502216M66168
$$ plain form
3860.9 703162253 703078806 703237474 703560233 703482032 703583598 704310417 705249846 705973923 706034005 705990374
3881.3 705990374 706336021 706666291 707181215 707657397 707808495 708243847 708758295 708617389 708037972 707720399
3901.7 707720399 707971990 708829343 709896505 710613430 710906327 710932374 710720360 710545242 710768998 711141229
3922.1 711141229 711329341 711502314 711720169 711785138 711856961 712198257 712601244 712809622 712831736 712820768
3942.5 712820768 712982357 713243663 713453352 713691533 713931501 714080870 714216948 714387000 714545965 714736104
3962.9 714736104 714961827 715122819 715212166 715305924 715448141 715606272 715725839 715829194 715996623 716220498
3983.2 716220498 716407537 716512918 716557443 716630161 716770530 716939747 717127264
3997.5 717127264
$$ packed form
3860.9G03162253q3447J58668L22759p8201J01566P26819R39429P24077O0082m3631
3881.3G05990374L45647L30270N14924M76182J51098M35352N14448j40906n79417l17573
3901.7G07720399K51591Q57353J067162P16925K92897K6047k12014j75118K23756L72231
3922.1G11141229J88112J72973K17855O4969P1823L41296M02987K08378K2114j0968
3942.5G12820768J61589K61306K09689K38181K39968J49369J36078J70052J58965J90139
3962.9G14736104K25723J60992Q9347R3758J42217J58131J19567J03355J67429K23875
3983.2G16220498J87039J05381M4525P2718J40369J69217J87517
3997.5G17127264
##END=$$ End of the data block
