##TITLE=G15-51-SE $$ Begin of the data block
##JCAMP-DX=5.00 $$ ACD/SpecManager v 10.08
##SPECTROMETER/DATA SYSTEM=Alpha
##DATE=22 Oct 2013 11:25:32
##DATA TYPE=INFRARED SPECTRUM
##DATA CLASS=XYDATA
##ORIGIN=
##OWNER=
##NPOINTS=1765
##FIRSTX=399.75695801
##LASTX=3997.56933594
##MAXX=3997.56933594
##MINX=399.75695801
##MAXY=0.82821238
##MINY=0.31526509
##XFACTOR=1.0000000000
##YFACTOR=1.000000000000000e-9
##FIRSTY=0.56808835
##DELTAX=2.03957629
##XUNITS=1/CM
##YUNITS=ARBITRARY UNITS
##XYDATA=(X++(Y..Y))
399.8E68088353k634049k966344j992405q6486J060486Q01206o5864r25958j591980
418.1E59686959j105786j80661m67778j396894k138317k433419j807093p47741k10523
436.5E49198747Q7738M66168J059770J676619J597643P77781k28762p52569q10444
454.8E53072691r63628j238525j645744k325237k895236k890229k234757j699805j828134
473.2E35351396j977861j715064j191438o77049l35216k37644n58972j094759j447618
491.5E26115775j556516j607298j810372k108515k414405k622545k620816k579808
507.9E08795500k515912k494693k670348k874225k731115k102941j366973q47369n51224
526.2D90640700l13610J16885Q06123J606196K339274K671122K359033J736820J195907
$$ y = [568088353, 565454304, 562487960, 560495555, 560409069, 561469555, 562270761, 562204897, 561278939, 559686959, 558581173, 558400512, 557932734, 556535840, 554397523, 551964104, 550157011, 549409270, 549198747, 549286485, 549752653, 550812423, 552489042, 554086685, 554864466, 554635704, 553883135, 553072691, 552109063, 550870538, 549224794, 546899557, 544004321, 541114092, 538879335, 537179530, 535351396, 533373535, 531658471, 530467033, 529789984, 529454768, 529217124, 528658152, 527563393, 526115775, 524559259, 522951961, 521141589, 519033074, 516618669, 513996124, 511375308, 508795500, 506279588, 503784895, 501114547, 498240322, 495509207, 493406266, 492039293, 491191924, 490640700, 490327090, 490443975, 491250098, 492856294, 495195568, 497866690, 500225723, 501962543, 503158450]
544.6E03158450O55651o9260p48337j129865j329959j424700j532554j804352k161801
562.9D93613273k512723k707750k372503j444727m08233M03226J071572J680970K414853
581.3D89737958L201723L408313K929955K069772J139402O07967N32687L98338J17123
599.6E04143238K9385j3113j08242L6836M40001O91176O18756M69982N99623J262069
620E08169711K208411K893389K985239K595901K168357K134204K362669K367139J879096
638.4E29764116J129985P05421R01758J389981J561999J027942J38342k61784J04368
656.7E36462128O92129R24111O99222L11255R8586M61877J228690J612723J602769
675.1E44093490J233756J005829J222372J594722J618504J094640L07500l22521n66601
$$ y = [503158450, 503814101, 503744841, 502996504, 501866639, 500536680, 499111980, 497579426, 495775074, 493613273, 491100550, 488392800, 486020297, 484575570, 484167337, 484570563, 485642135, 487323105, 489737958, 492939681, 496347994, 499277949, 501347721, 502487123, 503095090, 503627777, 504026115, 504143238, 504172623, 504159510, 504051268, 504088104, 504528105, 505219281, 505838037, 506308019, 506907642, 508169711, 510378122, 513271511, 516256750, 518852651, 521021008, 523155212, 525517881, 527885020, 529764116, 530894101, 531599522, 532501280, 533891261, 535453260, 536481202, 536619544, 536357760, 536462128, 537154257, 538078368, 538777590, 539088845, 539187431, 539649308, 540877998, 542490721, 544093490, 545327246, 546333075, 547555447, 549150169, 550768673, 551863313, 552170813, 551848292, 551281691]
693.5E51281691m85659m77850n68212l90112J65820R51290J834512K527893K766490
711.8E57605863K789795K951801L355086M044652M671514M646480M132867L589868
728.1E87787926L260553L152371K938330K339840J524031Q20696L11494R1553L0100
746.5F02256894j72973n81264j067519j427770j491010j255810q83401m84824N6684
764.8E94949007R69648K236784L529131M440546M909277M993916M661858M119754L665209
783.2F28475130L303766K849042K292991J777947J569152J855433K485811L014565
799.5F47623837L196597L018677K610803K306700K065062J688063J206637O39379m530
817.9F64351225n08964q01206j089275j559853k158225k612054k773106k712250k651811
$$ y = [551281691, 550796032, 550318182, 549749970, 549359858, 549525678, 550476968, 552311480, 554839373, 557605863, 560395658, 563347459, 566702545, 570747197, 575418711, 580065191, 584198058, 587787926, 591048479, 594200850, 597139180, 599479020, 601003051, 601823747, 602135241, 602226794, 602256894, 602083921, 601502657, 600435138, 599007368, 597516358, 596260548, 595377147, 594892323, 594949007, 595918655, 598155439, 601684570, 606125116, 611034393, 616028309, 620690167, 624809921, 628475130, 631778896, 634627938, 636920929, 638698876, 640268028, 642123461, 644609272, 647623837, 650820434, 653839111, 656449914, 658756614, 660821676, 662509739, 663716376, 664355755, 664351225, 663842261, 663041055, 661951780, 660391927, 658233702, 655621648, 652848542, 650136292, 647484481]
836.2F47484481k661466k652109k559423k335310j913846j323700q62419p73550q96811
854.6F31505847r50038n91934P30991K859116M709542N629599N756199N423725M791855
872.9F59864902L624023J786708l05175k140344l446221m207015m575551m770279m884839
891.3F40946209m839122m615545m337251m242480m529178n165518n922556o514251
907.6F00780308o756544o693184o440640o034255n362272m263818k886653j621008
923.9E60721934q39949o48022o76929n91219m06563j80543k5808j56761q25464k316356
944.3E54054320m529715o801247q525730r592771j0177970j0495245j0648132j0568529
960.6D82714981j0337204j0166883j0022551r712249r069085q011580o675482n278378
$$ y = [647484481, 644823015, 642170906, 639611483, 637276173, 635362327, 634038627, 633176208, 632402658, 631505847, 630555809, 629963875, 630694866, 633553982, 638263524, 643893123, 649649322, 655073047, 659864902, 663488925, 665275633, 664970458, 662830114, 659383893, 655176878, 650601327, 645831048, 640946209, 636107087, 631491542, 627154291, 622911811, 618382633, 613217115, 607294559, 600780308, 594023764, 587330580, 580889940, 574855685, 569493413, 565229595, 562342942, 560721934, 559881985, 559233963, 558557034, 557965815, 557559252, 557378709, 557352901, 557196140, 556370676, 554054320, 549524605, 542723358, 534197628, 524604857, 514426887, 503931642, 493283510, 482714981, 472377777, 462210894, 452188343, 442476094, 433407009, 425395429, 418719947, 413441569]
977D13441569l933102k731890j795828j144052p20828n50479o17385p84248q46118
995.3D00317639o66678l07828K0742J10895j06841n62788j065373j397461j510292
1013.7C94832015j528740j546144j583577j635074j694590j746446j777053j848727
1030C81471664j967579k054304k076149k043844j944065j843482j779795j624852j256436
1048.3C64881158o61075M8548O75946J084954J383006J739323K182186K542257K382577
1066.7C76258880J278549m82499j773030j722246n56052Q99822K108812K979666L633052
1085C82624954M136026M433006M487544M269928L792554L145188K487034J944095J567393
1103.4D12887722J421899J528859J855016K331048K753615K897501K730281K364575
$$ y = [413441569, 409508467, 406776577, 404980749, 403836697, 403115869, 402565390, 401948005, 401163757, 400317639, 399650961, 399343133, 399363875, 399474770, 399367929, 398805141, 397739768, 396342307, 394832015, 393303275, 391757131, 390173554, 388538480, 386843890, 385097444, 383320391, 381471664, 379504085, 377449781, 375373632, 373329788, 371385723, 369542241, 367762446, 366137594, 364881158, 364220083, 364268631, 364944577, 366029531, 367412537, 369151860, 371334046, 373876303, 376258880, 377537429, 377054930, 375281900, 373559654, 373003602, 373903424, 376012236, 378991902, 382624954, 386760980, 391193986, 395681530, 399951458, 403744012, 406889200, 409376234, 411320329, 412887722, 414309621, 415838480, 417693496, 420024544, 422778159, 425675660, 428405941, 430770516]
1119.7D30770516J950980J725971J847238K212912K668947K974420K858311K343595
1136D49352890J610816P48276j14947p44820j024306j009196p95453m34846K2680N71966
1156.4D48183060J259058K058268K854675L521413L969669M257321M664183N321771
1172.7D76089418O022692O523221O762714O819844O756186O530762O082058N371630
1189.1E26958525M365981L168881J995742R92894K08080l36051o38068o91831m98652
1207.4E35525501j71900J16467K68758K43485R7155p7843l15547o71089j079440j429320
1227.8E32506227j643061j680076j553655j278877r31800n71251j25646M30643J029849
1246.2E26182353J547695J897275K088070K180636K219021K239406K213300K109825
$$ y = [430770516, 432721496, 434447467, 436294705, 438507617, 441176564, 444150984, 447009295, 449352890, 450963706, 451711982, 451597035, 450852215, 449827909, 448818713, 448023260, 447588414, 447611094, 448183060, 449442118, 451500386, 454355061, 457876474, 461846143, 466103464, 470767647, 476089418, 482112110, 488635331, 495398045, 502217889, 508974075, 515504837, 521586895, 526958525, 531324506, 534493387, 536489129, 537482023, 537690103, 537354052, 536715984, 536024153, 535525501, 535353601, 535470068, 535738826, 535982311, 536079466, 536001623, 535686076, 535014987, 533935547, 532506227, 530863166, 529183090, 527629435, 526350558, 525418758, 524847507, 524721861, 525152504, 526182353, 527730048, 529627323, 531715393, 533896029, 536115050, 538354456, 540567756, 542677581]
1262.5E42677581K053976K088368K112508K101958K003431J686037J241267R01758
1278.8E56866884Q15034R45151J081645J080037R20891O36697K59936j75059o50704
1297.2E61780512j108706j466095j676798j748621j711905j574398j343786j021981
1313.5E50128222o42896k31922J45257L09944P1347n42462j298011j941085k303838
1331.8E43694556k350509k161503j847089j358866q15094n23507n15044o74188r50098
1350.2E32498658j254142j497388j684784j897514k299726k859056l244818l428936
1366.5E14332294l445029l039360k755284k885103l006488l223062l583372l683746
1382.8D88710850l257423k358854j132846k91854k00897k98918j34021J72317N92262
$$ y = [542677581, 544731557, 546819925, 548932433, 551034391, 553037822, 554723859, 555965126, 556866884, 557681918, 558627069, 559708714, 560788751, 561709642, 562346339, 562606275, 562431216, 561780512, 560671806, 559205711, 557528913, 555780292, 554068387, 552493989, 551150203, 550128222, 549485326, 549253404, 549398661, 549708605, 549779952, 549237490, 547939479, 545998394, 543694556, 541344047, 539182544, 537335455, 535976589, 535161495, 534637988, 534122944, 533448756, 532498658, 531244516, 529747128, 528062344, 526164830, 523865104, 521006048, 517761230, 514332294, 510887265, 507847905, 505092621, 502207518, 499201030, 495977968, 492394596, 488710850, 485453427, 483094573, 481961727, 481669873, 481468976, 481170058, 481036037, 481208354, 481800616]
1401.2D81800616R62257J271457J531511J591653J582622J617879J650184J752854
1417.5D93761033K192825K427906K315730K207875J873016J337528P78795J46508m63545
1435.9E06577671l24846L56734O31988O14286N11825M34398M32730L30448L21448R27568
1456.2E10814250K315223K950966K758563K862572L441632M100978N182684P170081
1472.6E41596949Q109391P156849N753457M239023K744257J185358m13358j998842
1488.9E68373084l080547l429055m378080n777479n771458n057990n052984p006943
1505.2E28818548j0002971q648396p096648p174313o533772m893839l125280k563715
1521.5D78779614k447188k423435k618760k370835k346634k421529j713186j367182
$$ y = [481800616, 482762873, 484034330, 485565841, 487157494, 488740116, 490357995, 492008179, 493761033, 495953858, 498381764, 500697494, 502905369, 504778385, 506115913, 506894708, 507041216, 506577671, 506252825, 506609559, 507241547, 507855833, 508367658, 508802056, 509234786, 509565234, 509886682, 510814250, 513129473, 516080439, 518839002, 521701574, 525143206, 529244184, 534426868, 541596949, 549706340, 556863189, 562616646, 566855669, 569599926, 570785284, 570371926, 568373084, 565292537, 561863482, 557485402, 551707923, 545936465, 540878475, 535825491, 528818548, 518815577, 510167181, 503070533, 495896220, 489362448, 484468609, 481343329, 478779614, 476332426, 473908991, 471290231, 468919396, 466572762, 464151233, 462438047, 461070865]
1537.8D61070865j693308q44955N59061J332015J859248K455294L071755L447741L418833
1556.2D74676549L944248N102039M228174L308624K987505K691507K604186K191544
1572.5E01734376J547277J289010J244426R06765M30823J13487j72496n25355j034260
1590.9E05534053j577377k138556k702116l375531m216939n007595n679816o424069
1607.2D74412054p384956q017242q228809r393185j1056095r861619r477526j1252850
1623.5C99739772j1293203j0518997j0119409q931398q446038q872777o261617k896488
1639.8C32399845j308322m23312L19839J345008J826823K040744L262996L977180M072279
1658.2C47513080M743933N882293O837279O786078P351458Q548856Q279145Q423745
$$ y = [461070865, 459377557, 458532602, 459091663, 460423678, 462282926, 464738220, 467809975, 471257716, 474676549, 478620797, 483722836, 487951010, 491259634, 494247139, 496938646, 499542832, 501734376, 503281653, 504570663, 505815089, 506721854, 507152677, 507266164, 507093668, 506568313, 505534053, 503956676, 501818120, 499116004, 495740473, 491523534, 486515939, 480836123, 474412054, 467027098, 459009856, 450781047, 441387862, 430331767, 420470148, 410992622, 399739772, 388446569, 377927572, 367808163, 358876765, 350430727, 341557950, 335296333, 332399845, 331091523, 330668211, 330988050, 332333058, 334159881, 336200625, 339463621, 343440801, 347513080, 352257013, 358139306, 364976585, 371762663, 379114121, 387662977, 395942122, 404365867]
1674.5D04365867R205521Q860707Q425444R283006J1887223J1820376J0642588J1566818
1690.8D86057550J2067824J4071822J6137422J6013682J7217814J4560938J1862338
1705.1E87989390J1470854R839416Q088886O759406N873859N876123N694151M697442
1721.4F46289527L889561L419697K897144K546251K221107K365708K948821K780616
1737.7F69358432K693236L135204L605903L960132M285872M856229N477071N270719
1754G02642798N003810M974485M656613M564941M342794L841162L547668L332675L375709
1772.4G40282655L451466K982915K515018K355277K286792K153874J981675J649022
1788.7G59658694J310528J544177J893103J738668J425445J363635J462042J438320
$$ y = [404365867, 413571388, 422432095, 430857539, 440140545, 452027768, 463848144, 474490732, 486057550, 498125374, 512197196, 528334618, 544348300, 561566114, 576127052, 587989390, 599460244, 609299660, 617388546, 624147952, 630021811, 635897934, 641592085, 646289527, 650179088, 653598785, 656495929, 659042180, 661263287, 663628995, 666577816, 669358432, 672051668, 675186872, 678792775, 682752907, 687038779, 691895008, 697372079, 702642798, 707646608, 712621093, 717277706, 721842647, 726185441, 730026603, 733574271, 736906946, 740282655, 743734121, 746717036, 749232054, 751587331, 753874123, 756027997, 758009672, 759658694, 760969222, 762513399, 764406502, 766145170, 767570615, 768934250, 770396292, 771834612]
1805G71834612J341283J264036J248836J210869J132369J099348J157522J115203R29654
1823.4G82333732Q41200Q05080Q14080J088619J195312R24468P12335O25372M70281
1841.7G89810479M67062Q68082J013875P59780N51522M92692N46753O14465O22212
1860.1G95746922N15581L41832J57655K25365O45041Q28326O16908L95775L68178M70102
1880.5H00311685N90860O06776M32372K38120L17216M91321N42283N52178M57466L10361
1900.9H04850638K49267K85267L43323L59774L36766K52843J07705R2149L06189M06385
1921.3H07590306L44991L00885K24292J74701K26796K95401K56478J39475J9014o854
1941.7H09565485J73628L53992L19242J82927R3758J20282K41161L10242K73049J92821
$$ y = [771834612, 773175895, 774439931, 775688767, 776899636, 778032005, 779131353, 780288875, 781404078, 782333732, 783174932, 783980012, 784794092, 785882711, 787078023, 788002491, 788714826, 789340198, 789810479, 790277541, 791145623, 792159498, 792919278, 793470800, 793963492, 794510245, 795124710, 795746922, 796262503, 796604335, 796761990, 796987355, 797632396, 798460722, 799077630, 799473405, 799841583, 800311685, 800902545, 801509321, 801941693, 802179813, 802497029, 802988350, 803530633, 804082811, 804540277, 804850638, 805099905, 805385172, 805728495, 806088269, 806425035, 806677878, 806785583, 806877732, 807183921, 807590306, 807935297, 808236182, 808460474, 808635175, 808861971, 809157372, 809413850, 809553325, 809572339, 809565485, 809739113, 810093105, 810412347, 810595274, 810689032, 810809314, 811050475, 811360717, 811633766, 811826587]
1962.1H11826587R1612L4511J42098K87234K77996J73152P9572N1677J02401K04086
1982.5H13270926K21432J05858k5213o7890L2485J95384K50697J56224O437q7917o6757
2004.9H13991666M589N2810J6511j26005k66373k57969j26779n7280r9540k06053k86698
2027.3H12638879k53201j53422j21951j59860k06411k55644k34902j24872l4451l3558
2047.7H11060607o4015q5413p5758k9623N0604J29700R1314j7524j7106Q3327J48416
2070.2H11274529J38759Q0049M1545M9054O7950P0571Q0586J12712J23620J02461O6995
2092.6H12208831Q0645J37866J80244J62483R0599O1094J06276J59204J72674J63019
2113H13522935J18971L5107j1146M9829J30475J26958P2777M5955N8890P9751J16109
$$ y = [811826587, 811918199, 811952710, 812094808, 812382042, 812660038, 812833190, 812912762, 812964439, 813066840, 813270926, 813492358, 813598216, 813573003, 813505113, 813537598, 813732982, 813983679, 814139903, 814146340, 814058423, 813991666, 813996255, 814049065, 814065576, 813939571, 813673198, 813415229, 813288450, 813231170, 813131630, 812925577, 812638879, 812385678, 812232256, 812110305, 811950445, 811744034, 811488390, 811253488, 811128616, 811094165, 811060607, 810996592, 810911179, 810835421, 810805798, 810856402, 810986102, 811077416, 811059892, 811042786, 811126113, 811274529, 811413288, 811493337, 811534882, 811583936, 811651886, 811722457, 811803043, 811915755, 812039375, 812141836, 812208831, 812289476, 812427342, 812607586, 812770069, 812860668, 812921762, 813028038, 813187242, 813359916, 813522935, 813641906, 813677013, 813665867, 813715696, 813846171, 813973129, 814045906, 814091861, 814150751, 814230502, 814346611]
2135.4H14346611J36674J05917M5300K0981P2121J33396J50442J40905J12891Q9467
2155.8H15354705J19328J90676K54750K81989K60652K24471K67505L56555L82424L63648
2176.2H18056703L49462L20136K72632K85745L52621L93807L61085K84434K47001K57016
2196.6H21180642K88963L26931L45350L04997K29835K13564K74300L35872L40522K79069
2217H24120045J83344J47700K13861L10123L21985K18451R3877P2181J51336K13743
2237.4H26046646K21967J65403N5075m530N5253J66178K12848J60277N9724J6928O1512
2259.8H27217281J30474J56284R5188J2935M4465J20043J10925M3571k1518M054Q7201
2282.3H28000903R9003O4612M7862k026o3539o1929k4319O557o497k0862j5616m1783
$$ y = [814346611, 814483285, 814589202, 814634502, 814655483, 814727604, 814861000, 815011442, 815152347, 815265238, 815354705, 815474033, 815664709, 815919459, 816201448, 816462100, 816686571, 816954076, 817310631, 817693055, 818056703, 818406165, 818726301, 818998933, 819284678, 819637299, 820031106, 820392191, 820676625, 820923626, 821180642, 821469605, 821796536, 822141886, 822446883, 822676718, 822890282, 823164582, 823500454, 823840976, 824120045, 824303389, 824451089, 824664950, 824975073, 825297058, 825515509, 825609386, 825681567, 825832903, 826046646, 826268613, 826434016, 826489091, 826484561, 826539814, 826705992, 826918840, 827079117, 827138841, 827155769, 827217281, 827347755, 827504039, 827599227, 827612162, 827656627, 827776670, 827887595, 827931166, 827909648, 827913702, 828000903, 828099906, 828164518, 828212380, 828210354, 828146815, 828084886, 828060567, 828067124, 828060627, 828039765, 828024149, 827982366]
2306.7H27982366q7380r7573n9307l3617l3438o8068j49251k00748j43826l6299P450
2329.2H27080309o9856k13921l01540k90215k40088j96099j69098k16663k22743j62661
2349.6H24997425j14679q6129p7844j40249l19720l88622k49267j75654k85745l84987
2370H22774529l83496l35514k25842j19090j17541j91331k75016k92778k25663j79589
2390.4H20428669k10821k99215l69430l70562l17991k63035k99633m13596n10753n24044
2410.8H16849589m50372l58463l53098m54723n58019n77092n15104m71592m99904n53906
2431.2H12057316n99622o05882n73039n38826n31435n80370o39498o32167n74112n30243
2451.5H06252122n35965n65052n95570n92351n43534n15640n35250n73754n90921n73873
$$ y = [827982366, 827894986, 827797413, 827738106, 827704489, 827671051, 827602983, 827453732, 827252984, 827109158, 827072859, 827080309, 827010453, 826796532, 826494992, 826204777, 825964689, 825768590, 825599492, 825382829, 825160086, 824997425, 824882746, 824796617, 824718773, 824578524, 824258804, 823870182, 823620915, 823445261, 823159516, 822774529, 822391033, 822055519, 821829677, 821710587, 821593046, 821401715, 821126699, 820833921, 820608258, 820428669, 820217848, 819918633, 819549203, 819178641, 818860650, 818597615, 818297982, 817884386, 817373633, 816849589, 816399217, 816040754, 815687656, 815232933, 814674914, 814097822, 813582718, 813111126, 812611222, 812057316, 811457694, 810851812, 810278773, 809739947, 809208512, 808628142, 807988644, 807356477, 806782365, 806252122, 805716157, 805151105, 804555535, 803963184, 803419650, 802904010, 802368760, 801795006, 801204085, 800630212]
2471.9H00630212n49615n36203n41687n61118n57959n25654n06877n31912n57185n38051
2492.3G95223951n07712m77672m52399m68612m98294n06282m90964m60028m44889m48764
2512.7G90468335m62711m83989n02646n22197n40852n48482n39541n42760n66960n62608
2533.1G85195589n40852n65827o24597o46055o08266n76078o03974o42300o30140n80252
2553.5G79177248n47766n38945n24998n48065o05345n98371n40673n29170n63145o04332
2573.9G73576438o24716n86450n41389n39958n47350n68151n93543n76973n40436n35607
2594.3G67921865n55694n70059n91934o05762n93245o32524p17640p61449p74444p77304
2614.7G61341810p79688q16047q73506r23217r48727Tr65118j004637j040578j055836
$$ y = [800630212, 800080597, 799544394, 799002707, 798441589, 797883630, 797357976, 796851099, 796319187, 795762002, 795223951, 794716239, 794238567, 793786168, 793317556, 792819262, 792312980, 791822016, 791361988, 790917099, 790468335, 790005624, 789521635, 789018989, 788496792, 787955940, 787407458, 786867917, 786325157, 785758197, 785195589, 784654737, 784088910, 783464313, 782818258, 782209992, 781633914, 781029940, 780387640, 779757500, 779177248, 778629482, 778090537, 777565539, 777017474, 776412129, 775813758, 775273085, 774743915, 774180770, 773576438, 772951722, 772365272, 771823883, 771283925, 770736575, 770168424, 769574881, 768997908, 768457472, 767921865, 767366171, 766796112, 766204178, 765598416, 765005171, 764372647, 763655007, 762893558, 762119114, 761341810, 760562122, 759746075, 758872569, 757949352, 757000625, 756051898, 755086780, 754082143, 753041565, 751985729]
2635.1G51985729j042962j021684j022100j047075j049697j041770j050055j047611
2651.4G43662775j024843r90033r89973j031518j027465r91166j024961j060367j004815
2669.8G34517634r45568r27985r03487q92162r06289q91864q78632q95560q89480q66056
2690.2G25520551q86857r34005r55224r80616j026571j056432j058460j038849j031101
2708.5G16552436j052439j075268j102566j120210j099348j068115j054764j049876
2724.8G07929850j022220r81450r42767r14752r06647r15646r34184r13560q66652
2743.2F99531972q64446r08255r27806q86321q43466q24570q16405q40247q87632q94964
2763.6F90837860q50141q24273q63850r67323j056076j050174j006841j003027j056791
$$ y = [751985729, 750942767, 749921083, 748898983, 747851908, 746802211, 745760441, 744710386, 743662775, 742637932, 741647899, 740657926, 739626408, 738598943, 737607777, 736582816, 735522449, 734517634, 733572066, 732644081, 731740594, 730848432, 729942143, 729050279, 728171647, 727276087, 726386607, 725520551, 724633694, 723699689, 722744465, 721763849, 720737278, 719680846, 718622386, 717583537, 716552436, 715499997, 714424729, 713322163, 712201953, 711102605, 710034490, 708979726, 707929850, 706907630, 705926180, 704983413, 704068661, 703162014, 702246368, 701312184, 700398624, 699531972, 698667526, 697759271, 696831465, 695945144, 695101678, 694277108, 693460703, 692620456, 691732824, 690837860, 689987719, 689163446, 688299596, 687332273, 686276197, 685226023, 684219182, 683216155, 682159364]
2782F82159364j160741j262486j304030j280725j272738j342773j424611j474083j506924
2800.3F70130253j507282j518667j603842j720428j813353j833677j782238j790464
2816.6F56560302j899958k028406k104878k127647k163828k233565k358555k557457
2832.9F39086008k770662k991379l295183l732979m326880n010486n574643n747319
2849.3F05636477n292058m274666l128469k314031k051592k276182k801120l453434
2865.6E80044925l993928m166544l898084l305554k584636j933873j475156j227080
2881.9E57460070j148880j161814j210928j307189j453221j616180j769841j942694
2898.2E45849323k149462k359808k602041k938509l371060l856420m366458m845321
$$ y = [682159364, 680998623, 679736137, 678432107, 677151382, 675878644, 674535871, 673111260, 671637177, 670130253, 668622971, 667104304, 665500462, 663780034, 661966681, 660133004, 658350766, 656560302, 654660344, 652631938, 650527060, 648399413, 646235585, 644002020, 641643465, 639086008, 636315346, 633323967, 630028784, 626295805, 621968925, 616958439, 611383796, 605636477, 600344419, 596069753, 592941284, 590627253, 588575661, 586299479, 583498359, 580044925, 576050997, 571884453, 567986369, 564680815, 562096179, 560162306, 558687150, 557460070, 556311190, 555149376, 553938448, 552631259, 551178038, 549561858, 547792017, 545849323, 543699861, 541340053, 538738012, 535799503, 532428443, 528572023, 524205565, 519360244]
2914.5E19360244n124211n067885m682064l954172k959579j890868q11190K58237J296401
2932.9D96424913K318889L230304L873646M193544M167378L775835L132940K418637
2949.2E23536086J761615J216650R48012J148999J694739K336621K932906L494442
2965.5E39070070M084646M601658M963577N172252N200446N120873M991353M739523
2981.8E77944398M344881L845334L318727K840161K381623J875400J319170P24077
2998.1E98593771J31071l36587o49870q69274j009405j092970j156628j192570j196384
3016.5E91221154j232922j376272j604318j857817k048374k060175j966118j940191
3032.8E77134967k017260k131164k189219k192020k240360k334774k397477k420187
$$ y = [519360244, 514236033, 509168148, 504486084, 500531912, 497572333, 495681465, 494870275, 495128512, 496424913, 498743802, 501974106, 505847752, 510041296, 514208674, 517984509, 521117449, 523536086, 525297701, 526514351, 527462363, 528611362, 530306101, 532642722, 535575628, 539070070, 543154716, 547756374, 552719951, 557892203, 563092649, 568213522, 573204875, 577944398, 582289279, 586134613, 589453340, 592293501, 594675124, 596550524, 597869694, 598593771, 598724842, 598388255, 597738385, 596869111, 595859706, 594766736, 593610108, 592417538, 591221154, 589988232, 588611960, 587007642, 585149825, 583101451, 581041276, 579075158, 577134967, 575117707, 572986543, 570797324, 568605304, 566364944, 564030170, 561632693, 559212506]
3049.1E59212506k431452k442122k419591k374470k352417k296447k160788k008915
3065.5E40726304j872420j764715j720011j686096j608134j518070j489699j513362
3081.8E27553797j475990j382828j308381j243294j198709j194775j196921j186311
3098.1E17366588j205385j273095j325965j347423j385927j429319j453758j488030
3114.4E06457686j548826j621366j706898j791388j805842j772880j796782j872421
3130.7D92541283j940101j982689j987338j963496k006144k091646k109050k083302
3147D76377517k051204k045840k094031k172559k227337k227574k197057k188593k214432
3165.4D56958890k214462k208143k227157k211452k174377k165944k159416k179027
$$ y = [559212506, 556781054, 554338932, 551919341, 549544871, 547192454, 544896007, 542735219, 540726304, 538853884, 537089169, 535369158, 533683062, 532074928, 530556858, 529067159, 527553797, 526077807, 524694979, 523386598, 522143304, 520944595, 519749820, 518552899, 517366588, 516161203, 514888108, 513562143, 512214720, 510828793, 509399474, 507945716, 506457686, 504908860, 503287494, 501580596, 499789208, 497983366, 496210486, 494413704, 492541283, 490601182, 488618493, 486631155, 484667659, 482661515, 480569869, 478460819, 476377517, 474326313, 472280473, 470186442, 468013883, 465786546, 463558972, 461361915, 459173322, 456958890, 454744428, 452536285, 450309128, 448097676, 445923299, 443757355, 441597939, 439418912]
3181.7D39418912k222329k208591k153605k130330k138436k136945k115369k049834
3198D22263473j955420j909047j903832j898676j880169j809537j760155j789153j809746
3216.4D05547738j815081j795232j764893j788110j808464j828045j849234j836300
3232.7C91062379j891285j996637k028703k033919k087236k123535k124756k191663
3249C74584645k285928k320826k329826k337813k294272k223909k214581k234996k202749
3267.4C54139745k076626j930743j837373j722544j575113j465410j352965j205683
3283.7C40973288j071513r45657q10415o92546o20216n73755n10812m24146l50952
3302C34973276k92689k56211k79009l11255k93374k39432j73450j44005j69396j61827
$$ y = [439418912, 437196583, 434987992, 432834387, 430704057, 428565621, 426428676, 424313307, 422263473, 420308053, 418399006, 416495174, 414596498, 412716329, 410906792, 409146637, 407357484, 405547738, 403732657, 401937425, 400172532, 398384422, 396575958, 394747913, 392898679, 391062379, 389171094, 387174457, 385145754, 383111835, 381024599, 378901064, 376776308, 374584645, 372298717, 369977891, 367648065, 365310252, 363015980, 360792071, 358577490, 356342494, 354139745, 352063119, 350132376, 348295003, 346572459, 344997346, 343531936, 342178971, 340973288, 339901775, 338956118, 338145703, 337453157, 336832941, 336259186, 335748374, 335324228, 334973276, 334680587, 334424376, 334145367, 333834112, 333540738, 333301306, 333127856, 332983851, 332814455, 332652628]
3322.4C32652628j30653j77383k45214k64346k62768k38150k53469l50892m50909m97222
3342.8C29781622m92275m79966m85838n23984n77093o17176o31004o03229n81831n80072
3363.2C24209154n69255n84810o45221p35819p50125o23881n17846n24312n60343n18173
3383.6C18179369l98934k55346j60694k50757m37409m31388j80245K3395j02043l52800
3404C15633148l07739o0320O5804N2511L6002O2525J39385K11925K81244M59016O18428
3426.5C17191929O73294O79075P31171Q52704Q25822O81519P05600Q87275J026273
3444.8C24254662J063287J071274J143277J237839J330287J431107J488745J441032
3461.1C34461510J435757J643985J820594J662314J348943J361430J661628J893640
$$ y = [332652628, 332521975, 332344592, 332099378, 331835032, 331572264, 331334114, 331080645, 330729753, 330278844, 329781622, 329289347, 328809381, 328323543, 327799559, 327222466, 326605290, 325974286, 325371057, 324789226, 324209154, 323639899, 323055089, 322409868, 321674049, 320923924, 320300043, 319782197, 319257885, 318697542, 318179369, 317780435, 317525089, 317364395, 317113638, 316676229, 316244841, 316064596, 316087991, 315985948, 315633148, 315325409, 315265089, 315330893, 315383404, 315419406, 315481931, 315621316, 315833241, 316114485, 316573501, 317191929, 317865223, 318544298, 319275469, 320128173, 320953995, 321635514, 322341114, 323228389, 324254662, 325317949, 326389223, 327532500, 328770339, 330100626, 331531733, 333020478, 334461510, 335897267, 337541252, 339361846, 341024160, 342373103, 343734533, 345396161, 347289801]
3477.4C47289801J901716J747757J730293J891494J931399J880705J938284J985043
3493.8C62296492J992822K011895K045631K081394K009213J906991J961142K142102
3510.1C78447682K323508K329320K176612K124042K228647K393127K406269K286821
3526.4C96716028K302945K450496K564341K648890K684832K675175K771527K848625
3542.7D17662859K776891K655029K697170K839655K910346K971589L057718L140658
3559D40711915L158808L065884K975285L279865L767044L778308L593654L621339L734708
3577.4D71686810L864378M004002L957092L709406L713965M127384M230559M094749
3593.7E03388345M164100M319191M343271M317522M248977M004955L948271M200101
$$ y = [347289801, 349191517, 350939274, 352669567, 354561061, 356492460, 358373165, 360311449, 362296492, 364289314, 366301209, 368346840, 370428234, 372437447, 374344438, 376305580, 378447682, 380771190, 383100510, 385277122, 387401164, 389629811, 392022938, 394429207, 396716028, 399018973, 401469469, 404033810, 406682700, 409367532, 412042707, 414814234, 417662859, 420439750, 423094779, 425791949, 428631604, 431541950, 434513539, 437571257, 440711915, 443870723, 446936607, 449911892, 453191757, 456958801, 460737109, 464330763, 467952102, 471686810, 475551188, 479555190, 483512282, 487221688, 490935653, 495063037, 499293596, 503388345, 507552445, 511871636, 516214907, 520532429, 524781406, 528786361, 532734632, 536934733]
3610E36934733M366160M393875M206717M094542M502892M689097M279018L657937L610670
3628.4E74735641M490316M669428M282117M119933M043221L987491L905774L570497
3644.7F07804418L079295L210366M057467M141569L597080L604710L789068L475249
3661F36759222L141224L004610K666295K378285K668977K562880K223730K682448K966344
3679.4F61054015K821863K673089K331257J850963J684844K004803K202034K064883
3695.7F78687751J810849J542509J487493J741707J751781J355767R90570J193166
3712F90561593J761317J771271J413703J148164J049877J018166J064658J191020R58681
3730.3G01938450N61655O22332J141727J480579J106918K59280J78218J077712R05037
$$ y = [536934733, 541300893, 545694768, 549901485, 553996027, 558498919, 563188016, 567467034, 571124971, 574735641, 579225957, 583895385, 588177502, 592297435, 596340656, 600328147, 604233921, 607804418, 610883713, 614094079, 618151546, 622293115, 625890195, 629494905, 633283973, 636759222, 639900446, 642905056, 645571351, 647949636, 650618613, 653181493, 655405223, 658087671, 661054015, 663875878, 666548967, 668880224, 670731187, 672416031, 674420834, 676622868, 678687751, 680498600, 682041109, 683528602, 685270309, 687022090, 688377857, 689368427, 690561593, 692322910, 694094181, 695507884, 696656048, 697705925, 698724091, 699788749, 700979769, 701938450, 702500105, 703122437, 704264164, 705744743, 706851661, 707110941, 707289159, 708366871, 709271908]
3748.7G09271908M04477J046836J525343J168668Q20220R12785R38654O94871N48720
3767.1G17332482N89013Q36790J021504Q71599N92590M76777O25253O87122O54400
3785.4G23687530P05421P16686O61492M70400L37362M11868J73808J78694Q04842P51555
3805.8G28899658N97775Q95559Q03590K49446o974K61426J91390M36664R74536Q19922
3826.2G34122992M94301K59101K48492M07040J63853j8656M48406P97033P90656P26282
3846.6G38439500N04196j87278r26673j431J269222J041114M24266J08778K32518K54035
3867G41158247m6790J80543O23166O74248M63307Q5771J72377M08411L01301L66926
3887.4G44387507K66314P5161L43860M57942R7573k09570j47939J53184N62251P29441
$$ y = [709271908, 709676385, 710723221, 712248564, 713417232, 714237452, 715150237, 716088891, 716783762, 717332482, 717921495, 718758285, 719779789, 720651388, 721243978, 721720755, 722346008, 723033130, 723687530, 724392951, 725109637, 725771129, 726241529, 726578891, 726990759, 727164567, 727343261, 728148103, 728899658, 729497433, 730392992, 731196582, 731446028, 731439054, 731700480, 731891870, 732328534, 733303070, 734122992, 734617293, 734876394, 735124886, 735531926, 735695779, 735677123, 736125529, 736922562, 737713218, 738439500, 738943696, 738756418, 737829745, 737828314, 739097536, 740138650, 740562916, 740671694, 740904212, 741158247, 741111457, 741292000, 741915166, 742589414, 743052721, 743138492, 743310869, 743719280, 744020581, 744387507, 744653821, 744728982, 745072842, 745530784, 745628357, 745418787, 745270848, 745424032, 745986283, 746715724]
3907.8G46715724N07474K58387N7160j38580k0206L25083L47793J19150Q4341J31607
3928.2G48387933M4584Q5592L31164M03940J91868l4392L7551L07381K80559O4671
3948.6G50100851O2943J59740J88231J57416R0242Q7499J86742K40862K03252J73151
3969G51650929J31369O3479N3465Q9705J21475J67429J77920R9242L7551J05679K27511
3991.4G52925754K51114J67608R3043
3997.5G53437519
$$ y = [746715724, 747223198, 747481585, 747538745, 747400165, 747379959, 747705042, 748052835, 748171985, 748256326, 748387933, 748432517, 748518109, 748849273, 749253213, 749445081, 749410689, 749448240, 749755621, 750036180, 750100851, 750163794, 750323534, 750511765, 750669181, 750759423, 750846922, 751033664, 751274526, 751477778, 751650929, 751782298, 751845777, 751899242, 751988947, 752110422, 752277851, 752455771, 752555013, 752592564, 752698243, 752925754, 753176868, 753344476, 753437519]
##END=$$ End of the data block
