##TITLE=G15-51-SE $$ Begin of the data block
##JCAMP-DX=5.00 $$ ACD/SpecManager v 10.08
##SPECTROMETER/DATA SYSTEM=Alpha
##DATE=22 Oct 2013 11:25:32
##DATA TYPE=INFRARED SPECTRUM
##DATA CLASS=XYDATA
##ORIGIN=
##OWNER=
##NPOINTS=1765
##FIRSTX=399.75695801
##LASTX=3997.56933594
##MAXX=3997.56933594
##MINX=399.75695801
##MAXY=0.82921124
##MINY=0.31456932
##XFACTOR=1.0000000000
##YFACTOR=1.000000000000000e-9
##FIRSTY=0.56722689
##DELTAX=2.03957629
##XUNITS=1/CM
##YUNITS=ARBITRARY UNITS
##XYDATA=(X++(Y..Y))
399.8E67226887j715243k340675k237916j011133L35396Q76903K44558j067579j718879
$$ 567226887 565511644 563170969 560933053 559921920 560257316 561134219 561378777 560311198 558592319
418.1E58592319p55488J54197m81308j548767j916468j940310j731992j029253l59296
$$ 558592319 557836831 557991028 557509720 555960953 554044485 552104175 550372183 549342930 548983634
436.5E48983634M0948M09067J001060J571476J519561R55880J01387q01206j160562
$$ 548983634 549024582 549433649 550434709 552006185 553525746 554481626 554583013 553781807 552621245
454.8E52621245j106381j248837j600861k145052k803505k930104k389074j983642
$$ 552621245 551514864 550266027 548665166 546520114 543716609 540786505 538397431 536413789
471.1E36413789j886547j762569j600563j237214o26743j33872j66654n37336j057863
$$ 536413789 534527242 532764673 531164110 529926896 529300153 529166281 528999627 528462291 527404428
489.5E27404428j561940j608193j568675j810014k039850k278567k538800k553463
$$ 527404428 525842488 524234295 522665620 520855606 518815756 516537189 513998389 511444926
505.8E11444926k374172k379537k700209k937138k857119k502471j949400j343310
$$ 511444926 509070754 506691217 503991008 501053870 498196751 495694280 493744880 492401570
522.1D92401570p86930n28723m59045q8543P09444J689017K414882K591133K284885
$$ 492401570 491614640 491085917 490626872 490538329 491247773 492936790 495351672 497942805 500227690
540.5E00227690J787424J250386O53088J5617n52595j053155j399636j458883j547217
$$ 500227690 502015114 503265500 503918588 503934205 503381610 502328455 500928819 499469936 497922719
558.8D97922719j819730k192855k631277k794981k314270j366019m42683K79963R99838
$$ 497922719 496102989 493910134 491278857 488483876 486169606 484803587 484360904 484640867 485640705
577.2D85640705J774758K520501L255308L503799K881676J841307J052022O81698M86374
$$ 485640705 487415463 489935964 493191272 496695071 499576747 501418054 502470076 503151774 503638148
595.6E03638148L30508K33471J18673o6995r6560J21713M50253O52135N89370M79997
$$ 503638148 503968656 504202127 504320800 504253805 504157245 504278958 504729211 505381346 505970716 506450713
616E06450713O27517J293004K286851K958000L010929K652466K216876K081036K231538
$$ 506450713 507078230 508371234 510658085 513616085 516627014 519279480 521496356 523577392 525808930
634.3E25808930K276183J931965J322567Q76785R41157J355350J466096Q95321J12593
$$ 525808930 528085113 530017078 531339645 532216430 533157587 534512937 535979033 536874354 536986947
652.7E36986947k39313O5148P23720J012683O95646K85446J94550O80744J342059J623690
$$ 536986947 536747634 536812782 537536502 538549185 539244831 539530277 539724827 540405571 541747630 543371320
673.1E43371320J573980J167535R27627J180888J610934J695276J167774K87950l66151
$$ 543371320 544945300 546112835 547040462 548221350 549832284 551527560 552695334 552983284 552617133
691.4E52617133n69463n01096m70102m91083l51727J11640Q80479J775802K533257
$$ 552617133 552047670 551546574 551076472 550585389 550233662 550345302 551225781 553001583 555534840
709.8E55534840K858817K823949K885342L344953M118502M678368M593373M126906
$$ 555534840 558393657 561217606 564102948 567447901 571566403 576244771 580838144 584965050
726.1E84965050L618241L295958L183126K944768K324163J481474P93874L46899R6083
$$ 584965050 588583291 591879249 595062375 598007143 600331306 601812780 602606654 602953553 603049636
744.4F03049636l4511k44677o18220j030028j369178j468181j321376j034081n56051
$$ 603049636 603015125 602770448 602152228 601122200 599753022 598284841 596963465 595929384 595373333
762.8E95373333J19507J066625K264082L502369M477084M961848M961133M623115M149676
$$ 595373333 595492840 596559465 598823547 602325916 606803000 611764848 616725981 621349096 625498772
781.2F25498772L734052L330648K808094K255976J728356J543760J898647K479791
$$ 625498772 629232824 632563472 635371566 637627542 639355898 640899658 642798305 645278096
797.5F45278096K992869L251195L113865K684296K262055J933992J581014J124143
$$ 645278096 648270965 651522160 654636025 657320321 659582376 661516368 663097382 664221525
813.8F64221525O41704R6202m63605q31425j108528j573205k196788k673865k829194
$$ 664221525 664863229 664959431 664495826 663664401 662555873 660982668 658785880 656112015 653282821
832.1F53282821k753436k706945k689243k654075k655864k460480j925349j304269
$$ 653282821 650529385 647822440 645133197 642479122 639823258 637362778 635437429 634133160
848.5F34133160q65579p41124q89897j013577n98609Q29219K923906M704535N645514
$$ 634133160 633267581 632526457 631636560 630622983 630024374 630853593 633777499 638482034 644127548
866.8F44127548N805254N443573M713893L496647J739919l00050k202094l545582m250467
$$ 644127548 649932802 655376375 660090268 663586915 665326834 665026784 662824690 659279108 655028641
885.2F55028641m569649m756570m888714m887521m710197m433692m268765m478455
$$ 655028641 650458992 645702422 640813708 635926187 631215990 626782298 622513533 618035078
901.5F18035078n140364n955339o521880o728471o662905o404876n990923n343497
$$ 618035078 612894714 606939375 600417495 593689024 587026119 580621243 574630320 569286823
917.8E69286823m302144k934813j643777q85368o85930o39319n21600l72470j90914
$$ 569286823 564984679 562049866 560406089 559520721 558834791 558195472 557673872 557301402 557110488
936.2E57110488l7312j54257q25882k302348m504204o799221q544624r601712j0194838
$$ 557110488 557073176 556918919 556093037 553790689 549286485 542487264 533942640 524340928 514146090
954.5E14146090j0524869j0641456j0547489j0345101j0154516r985715r707063r076298
$$ 514146090 503621221 492979765 482432276 472087175 461932659 451946944 442239881 433163583
970.8D33163583q007616o657511n239605l911466k736926j765281j084924p03036n57125
$$ 433163583 425155967 418498456 413258851 409347385 406610459 404845178 403760254 403057218 402500093
989.2D02500093n84275p02470p79033o78241m07547q9347J00285p2331n92231j109153
$$ 402500093 401915818 401213348 400434315 399756074 399348527 399259180 399359465 399287134 398694903 397585750
1009.6C97585750j403332j503825j495898j468778j536429j692295j755982j714796
$$ 397585750 396182418 394678593 393182695 391713917 390177488 388485193 386729211 385014415
1025.9C85014415j733691j841813j955628k043665k098203k061158j914799j805544
$$ 385014415 383280724 381438911 379483283 377439618 375341415 373280257 371365458 369559914
1042.2C69559914j781821j653403j269579o52880N0694O78003J127213J428694J726985
$$ 369559914 367778093 366124690 364855111 364202231 364252925 364930928 366058141 367486835 369213820
1060.6C69213820K136975K510607K351225J211375n32002j726001j644671n44250Q73804
$$ 369213820 371350795 373861402 376212627 377424002 376892000 375165999 373521328 372977078 373850882
1078.9C73850882K093256K996563L662050M153461M465609M516900M258752L753751
$$ 373850882 375944138 378940701 382602751 386756212 391221821 395738721 399997473 403751224
1095.2D03751224L134251K532393J994043J566768J399070J564980J916617K302140
$$ 403751224 406885475 409417868 411411911 412978679 414377749 415942729 417859346 420161486
1111.6D20161486K652824K862483K774477K367407J930326J770258J905680K238065
$$ 420161486 422814310 425676793 428451270 430818677 432749003 434519261 436424941 438663006
1127.9D38663006K667188K925128K796948K326101J603395P25299j16795p24286j020998
$$ 438663006 441330194 444255322 447052270 449378371 450981766 451707065 451590270 450865984 449844986
1146.2D49844986r96351p31587l89040M500N48989J249879K038658K850652L537833
$$ 449844986 448848635 448117048 447728008 447732508 448281497 449531376 451570034 454420686 457958519
1164.6D57958519L970564M259050M666477N293548N965382O462991O739825O827563
$$ 457958519 461929083 466188133 470854610 476148158 482113540 488576531 495316356 502143919
1180.9E02143919O752968O521702O086350N362093M327893L138304J986027R85205
$$ 502143919 508896887 515418589 521504939 526867032 531194925 534333229 536319256 537304461
1197.2E37304461K01881l37958o48559p10368n01692j46270J42575K69472K29955Q2552
$$ 537304461 537506342 537168384 536519825 535809457 535307765 535161495 535304070 535573542 535803497 535886049
1217.6E35886049q3387l01003o47247j069367j425743j650274j683354j509190j229882
$$ 535886049 535802662 535501659 534854412 533785045 532359302 530709028 529025674 527516484 526286602
1236E26286602r11653n54681j32322M17888J043797J558363J901507K095700K194583
$$ 526286602 525374949 524820268 524687946 525105834 526149631 527707994 529609501 531705201 533899784
1254.3E33899784K238751K214789K159059K104938K071977K093553K150834K133310
$$ 533899784 536138535 538353324 540512383 542617321 544689298 546782851 548933685 551066995
1270.6E51066995J964271J646697J257956R30727Q28147R54747J089275J082420R28939
$$ 551066995 553031266 554677963 555935919 556866646 557694793 558649540 559738815 560821235 561750174
1289E61750174O48498K55644j85370o48975j103223j453697j649142j715481j701951
$$ 561750174 562398672 562654316 562468946 561819971 560716748 559263051 557613909 555898428 554196477
1307.4E54196477j595914j372993j031459o19530k04266J46091K89321N7340n19991
$$ 554196477 552600563 551227570 550196111 549576581 549372315 549518406 549807727 549865067 549345076
1325.7E49345076j277387j961470k324164k362072k172649j833975j331091q13067
$$ 549345076 548067689 546106219 543782055 541419983 539247334 537413359 536082268 535269201
1342E35269201n68629n62369o65725q98599j208544j501143j723826j921236k324939
$$ 535269201 534700572 534138203 533472478 532573879 531365335 529864192 528140366 526219130 523894191
1360.4E23894191k892018l242671l414452l454685l075719k785444k870024k993911
$$ 523894191 521002173 517759502 514345050 510890365 507814646 505029202 502159178 499165267
1376.7D99165267l252298l597170l654599l234506k362847j151741l19242k11597k85297
$$ 499165267 495912969 492315799 488661200 485426694 483063847 481912106 481592864 481381267 481095970
1395.1D81095970j26452J95682O46085R97126J291901J549065J594067J597881J643330
$$ 481095970 480969518 481165200 481811285 482808411 484100312 485649377 487243444 488841325 490484655
1413.4D90484655J635641J692235K168805K469539K351582K224803J869619J294434
$$ 490484655 492120296 493812531 495981336 498450875 500802457 503027260 504896879 506191313
1429.7E06191313P29442J11639m87804l03805M13656P10309O80983N12481L97205M00305
$$ 506191313 506920755 507032394 506544590 506240785 506654441 507364750 508045733 508558214 508955419 509355724
1450.1E09355724L10004K74002Q32915K312541L035486K783895K837717L427387M087507
$$ 509355724 509665728 509939730 510772645 513085186 516120672 518904567 521742284 525169671 529257178
1468.5E29257178N138159P116079Q088112P160366N761206M228175K715707J121282
$$ 529257178 534395337 541511416 549599528 556759894 562521100 566749275 569464982 570586264
1484.8E70586264n38349k094030l055871l369927m392445n866111n826831n039513
$$ 570586264 570047915 567953885 564898014 561528087 557135642 551269531 545442700 540403187
1501.1E40403187n059659p133842j0119974q551479o933689p067799o499023m882335
$$ 540403187 535343528 528209686 518089712 509538233 502604544 495536745 489037722 484155387
1517.4D84155387l098488k522260k397776k367854k554595k310664k298862k383887
$$ 484155387 481056899 478534639 476136863 473769009 471214414 468903750 466604888 464221001
1533.7D64221001j702607j427263j761764p52122P14899J452654J941860K481460L046155
$$ 464221001 462518394 461091131 459329367 458577245 459292144 460744798 462686658 465168118 468214273
1552.1D68214273L405720L364683L875970N139232M323274L356308K992183K659827
$$ 468214273 471619993 474984676 478860646 483999878 488323152 491679460 494671643 497331470
1568.4D97331470K597511K197534J502693J254558J256108R14157M18425Q9108k09391
$$ 497331470 499928981 502126515 503629208 504883766 506139874 507054031 507472456 507561564 507352173
1586.8E07352173n78224j079738j600087k142310k690941l364802m212647m991949
$$ 507352173 506773949 505694211 504094124 501951814 499260873 495896071 491683424 486691475
1603.1D86691475n672246o444454p386566q011520q283048r480745j1067778r811372
$$ 486691475 481019229 474574775 467188209 459176689 450893641 441412896 430345118 420533746
1619.4D20533746r467065j1272728j1295438j0494590j0085493q933604q500040q901506
$$ 420533746 411066681 399793953 388498515 378003925 367918432 358984828 350484788 341583282
1635.7C41583282o217689k846419j264424m10288K97397J363278J831025J987725L322870
$$ 341583282 335365593 332519174 331254750 330844462 331141859 332505137 334336162 336323887 339646757
1654.1C39646757M121869M145891M763246N885094O838381O778896P339537Q551359
$$ 339646757 343768626 347914517 352677763 358562857 365401238 372180134 379519671 388071030
1670.4C88071030Q263439Q386970R230703Q911014Q391410R164452J1829585J1900097
$$ 388071030 396334469 404721439 413952142 422863156 431254566 440419018 452248603 464148700
1686.7D64148700J0721892J1590302J2015671J3934970J5970528J5900135J7245650
$$ 464148700 474870592 486460894 498476565 512411535 528382063 544282198 561527848
1701E61527848J4671207J1945784J1564076R938776Q137644O724476N772174N857289
$$ 561527848 576199055 588144839 599708915 609647691 617785335 624509811 630281985 636139274
1717.3F36139274N837261M817963L916144L421009K895713K512455K147972K296925
$$ 636139274 641976535 646794498 650710642 654131651 657027364 659539819 661687791 663984716
1733.6F63984716K970517K837240K734483L185749L628313L934324M242480M825353
$$ 663984716 666955233 669792473 672526956 675712705 679341018 683275342 687517822 692343175
1749.9F92343175N492866N308032N019427M982114M654050M575431M393875L855050
$$ 692343175 697836041 703144073 708163500 713145614 717799664 722375095 726768970 730624020
1766.3G30624020L489375L252685L348351L494739L017903K517581K359390K307832
$$ 730624020 734113395 737366080 740714431 744209170 747227073 749744654 752104044 754411876
1782.6G54411876K172232J992285J644671J276136J533329J941264J764178J388133
$$ 754411876 756584108 758576393 760221064 761497200 763030529 764971793 766735971 768124104
1798.9G68124104J339018J505971J489878J339733J236558J251102J241982J147925
$$ 768124104 769463122 770969093 772458971 773798704 775035262 776286364 777528346 778676271
1815.2G78676271J092434J157880J106858Q93951Q08418P77065P94709J116395J234532
$$ 778676271 779768705 780926585 782033443 782927394 783735812 784512877 785307586 786423981 787658513
1833.6G87658513R37879P16328O18875M43399M35472Q54194J010656P74205N78225
$$ 787658513 788596392 789312720 789931595 790374994 790810466 791664660 792675316 793449521 794027746
1851.9G94027746N11229N72800O48022O36816N09143L02911P2062J58846O74308Q95082
$$ 794027746 794538975 795111775 795759797 796396613 796905756 797208667 797280729 797439575 798113883 799008965
1872.3G99008965O54042M16160L71396M64440N88059N90682M29690K59638L34382N01156
$$ 799008965 799663007 800079167 800450563 800915003 801503062 802093744 802523434 802783072 803117454 803618610
1892.7H03618610N41806N38111M51505L17693K48909K83062L43263L49582L28540K57493
$$ 803618610 804160416 804698527 805150032 805467725 805716634 805999696 806342959 806692541 807021081 807278574
1913.1H07278574J03294Q1838L28600M26948L24070K75672K24769K02954K68936L16978
$$ 807278574 807381868 807463706 807792306 808219254 808543324 808818996 809043765 809246719 809515655 809832633
1933.5H09832633K43306J05917k1398l7253J77741L91960L58522J93894P8440J03235
$$ 809832633 810075939 810181856 810160458 810123205 810300946 810692906 811051428 811245322 811323762 811426997
1953.9H11426997K39134L22878K90633J93476O6042J0014J56462L24845L00706J76608
$$ 811426997 811666131 811989009 812279642 812473118 812539160 812549174 812705636 813030481 813331187 813507795
1974.3H13507795N6625L9875J32859K09987J98066R8050m1246r2745M1604K38299K91050
$$ 813507795 813564420 813604295 813737154 813947141 814145207 814243257 814202011 814109266 814150870 814389169 814680219
1996.7H14680219J70707q344j06037o0916J6093N2274J3947j15394k47241k47240j15811
$$ 814680219 814850926 814842582 814736545 814675629 814691722 814743996 814757943 814642549 814395308 814148068 814032257
2019.2H14032257n4896j26303k28285k72692k42114j64210j11938j36614k12252k89857
$$ 814032257 813977361 813851058 813622773 813350081 813107967 812943757 812831819 812695205 812482953 812193096
2039.6H12193096k68221j20521L100j8597p7963q5831o0260j6928N0426J15931R7990
$$ 812193096 811924875 811804354 811807454 811788857 811710894 811625063 811564803 811547875 811598301 811714232 811812222
2062H11812222L0041J8298P5221J38939J55032R3340K7180J8180L5643O7771J09136
$$ 811812222 811842263 811860561 811935782 812074721 812229753 812323093 812350273 812368453 812404096 812471867 812581003
2084.4H12581003J15394Q1063O8605Q6784J27077J71661J86086J42038Q0764P8202
$$ 812581003 812696397 812777460 812846065 812932849 813059926 813231587 813417673 813559711 813640475 813718677
2104.8H13718677J19268J65821J78217J36734Q2671N8651N2452O2525J02997J31607
$$ 813718677 813837945 814003766 814181983 814318717 814401388 814460039 814512491 814575016 814678013 814809620
2125.2H14809620R2507M1365L8743O3122J07825J40607J20938N3405J9193O0439J23740
$$ 814809620 814902127 814943492 814982235 815045357 815153182 815293789 815414727 815468132 815487325 815547764 815671504
2147.7H15671504J69396J69933J28686J00672J27137J98782K79247K96414K38180J93894
$$ 815671504 815840900 816010833 816139519 816240191 816367328 816566110 816845357 817141771 817379951 817573845
2168H17573845K48671L44992L72350L62277L55244L33547L14176L28064L52979L67820
$$ 817573845 817822516 818167508 818539858 818902135 819257379 819590926 819905102 820233166 820586145 820953965
2188.4H20953965L50893K89917K50637K61724K81215K97666L17633K87473K28226K49863
$$ 820953965 821304858 821594775 821845412 822107136 822388351 822686017 823003650 823291123 823519349 823769212
2208.8H23769212L13759L40581L38494K73884J65105J46508K40862L34740L12507J74522
$$ 823769212 824082971 824423552 824762046 825035930 825201035 825347543 825588405 825923145 826235652 826410174
2229.2H26410174O0022O5923J63198K51948K54035J56522M2260J8596Q2553J74761
$$ 826410174 826470196 826536119 826699317 826951265 827205300 827361822 827404082 827422678 827505231 827679992
2249.6H27679992K05040J26600L3438J8954P5341J51634J60038P3076O258N3287J17957
$$ 827679992 827885032 828011632 828045070 828064024 828139365 828290999 828451037 828524113 828530371 828583658 828701615
2272.1H28701615J15455Q0585K3246p928K7538Q5890J11282P3552%o2466p6711l8326
$$ 828701615 828817070 828897655 828920901 828912973 828940511 829026401 829137683 829211235 829211235 829148769 829072058 829033732
2296.5H29033732j3172k7597o259K4796J4305k6226r3341j05798l8684J5200K980p3672
$$ 829033732 829020560 828992963 828986704 829011500 829025805 828999579 828906238 828800440 828761756 828776956 828779936 828706264
2321H28706264j74582j79588q7321o3419j39535j87218k66910l44217k24530j23799
$$ 828706264 828531682 828352094 828264773 828201354 828061819 827874601 827607691 827263474 827038944 826915145
2341.4H26915145j97232k67625k03788q8811k7180m2557p4506j31548l45766m92513
$$ 826915145 826717913 826450288 826246500 826157689 826130509 826087952 826013446 825881898 825536132 825043619
2361.8H25043619l41237j55151k24530l57748l86059l75450k83479j58489j38462j96397
$$ 825043619 824702382 824547231 824322701 823964953 823578894 823203444 822919965 822761476 822623014 822426617
2382.2H22426617k56419k78533k33590j92166k23338k98798l58463l70979l28004k72811
$$ 822426617 822170198 821891665 821658075 821465909 821242571 820943773 820585310 820214331 819886327 819613516
2402.6H19613516l06844m15266n11646n26905m38333l46064l80040n04791n72503n48243
$$ 819613516 819306672 818891406 818379760 817852855 817414522 817068458 816688418 816183627 815611124 815062881
2423H15062881n00322m89414n27024n71310n83589n62847n35190n32568n53012n97655
$$ 815062881 814562559 814073145 813546121 812974811 812391222 811828375 811293185 810760617 810207605 809609950
2443.4H09609950o42121o19054n41866m93288n26845n96345o36339o03259n22792n01037
$$ 809609950 808967829 808348775 807806909 807313621 806786776 806190431 805554092 804950833 804428041 803927004
2463.8H03927004n34117n77032o05822n85377n35667n18799n45621n56946n42581n46336
$$ 803927004 803392887 802815855 802210033 801624656 801088989 800570190 800024569 799467623 798925042 798378706
2484.2G98378706n53608n32389n10752n15282n10991m73797m55081m79103n06699n12063
$$ 798378706 797825098 797292709 796781957 796266675 795755684 795281887 794826806 794347703 793841004 793328941
2504.6G93328941m83751m56453m44591m32610m55499m96149n09560n05209n02944n29111
$$ 793328941 792845190 792388737 791944146 791511536 791056037 790559888 790050328 789545119 789042175 788513064
2525G88513064n50627n40614n44131n49972n62907o07132o34969o13034n73098n77629
$$ 788513064 787962437 787421823 786877692 786327720 785764813 785157681 784522712 783909678 783336580 782758951
2545.4G82758951o17266o35743o18815n60343n30303n66959n78761n70119n66423n36561
$$ 782758951 782141685 781505942 780887127 780326784 779796481 779229522 778650761 778080642 777514219 776977658
2565.8G76977658n28395n62549n96106o01112n85616n54741n22077n34355n75483o00994
$$ 776977658 776449263 775886714 775290608 774689496 774103880 773549139 773027062 772492707 771917224 771316230
2586.2G71316230o07550n74827n23984n16534n45264n79655n90324n89073o08623o44624
$$ 771316230 770708680 770133853 769609869 769093335 768548071 767968416 767378092 766789019 766180396 765535772
2606.6G65535772p01547p54535p79033p92503p97153q16106q69632r27389r47058r43065
$$ 765535772 764834225 764079690 763300657 762508154 761711001 760894895 760025263 759097874 758150816 757207751
2626.9G57207751r73046j013100j028537j047492j064361j036524r89020j008034j054704
$$ 757207751 756234705 755221605 754193068 753145576 752081215 751044691 750055671 749047637 747992933
2645.3G47992933j059950j027405r93609j013041j036942j035869j062572j066506
$$ 747992933 746932983 745905578 744911969 743898928 742861986 741826117 740763545 739697039
2661.6G39697039j010775r79543r83358r60528r28283r29713r27926r11891r22501
$$ 739697039 738686264 737706721 736723363 735762835 734834552 733904839 732976913 732065022 731142521
2680G31142521r24051q97348q63433q31067q64506r52542r66430r29892r51528j005471
$$ 731142521 730218470 729321122 728457689 727626622 726762116 725809574 724843144 723913252 722961724 721956253
2700.4G21956253j034439j045882j044572j025915j040280j075506j084626j095891
$$ 721956253 720921814 719875932 718831360 717805445 716765165 715689659 714605033 713509142
2716.7G13509142j111984j109540j075805j030564j012504j005232r69112r36628r10520
$$ 713509142 712397158 711287618 710211813 709181249 708168745 707163513 706194401 705257773 704347253
2735G04347253q85010r12607r34481q72791q22544q75175r26197r02116q68142q42094
$$ 704347253 703462243 702549636 701615155 700742364 699919820 699044645 698118448 697216332 696348190 695506096
2755.4F95506096q37863q55803q51154q38936q49843q76128r00984r37403j002728
$$ 695506096 694668233 693812430 692961276 692122340 691272497 690396369 689495385 688557982 687555254
2773.8F87555254j029134j016200j054704j103163j138210j216769j274407j253128
$$ 687555254 686526120 685509920 684455216 683352053 682213843 680997074 679722667 678469539
2790.1F78469539j244128j333594j436353j471222j509547j545429j548529j595199
$$ 678469539 677225411 675891817 674455464 672984242 671474695 669929266 668380737 666785538
2806.4F66785538j701891j811147j842022j789629j789570j904071k035677k092600
$$ 666785538 665083647 663272500 661430478 659640849 657851279 655947208 653911531 651818931
2822.7F51818931k114594k163768k249598k399683k593458k781749k973795l263712
$$ 651818931 649704337 647540569 645290971 642891288 640297830 637516081 634542286 631278574
2839.1F31278574l756105m406929n049527n525530n684196n297542m325628l169060
$$ 631278574 627522469 623115540 618066013 612540483 606856287 601558745 597233117 594064057
2855.4E94064057k330959k050817k286732k836585l477276l995537m173816l913879
$$ 594064057 591733098 589682281 587395549 584558964 581081688 577086151 572912335 568998456
2871.7E68998456l318131k596498j945376j503169j268506j143337j126885j215935
$$ 568998456 565680325 563083827 561138451 559635282 558366776 557223439 556096554 554880619
2888E54880619j345396j485825j624345j777292j962065k142430k347290k652765l013670
$$ 554880619 553535223 552049398 550425053 548647761 546685696 544543266 542195976 539543211 536529541
2906.4E36529541l366411l774523m304171m848957n158663n077064m659772l953814
$$ 536529541 533163130 529388607 525084436 520235479 515076816 509999752 505339980 501386166
2922.7E01386166k990723j911700q15689K55823J290411K309978L231376L880203M195034
$$ 501386166 498395443 496483743 495668054 495923877 497214288 499524266 502755642 506635845 510830879
2941E10830879M170954L793419L157139K421140J753033J221716R65536J189053J746177
$$ 510830879 515001833 518795252 521952391 524373531 526126564 527348280 528313816 529502869 531249046
2959.4E31249046K354980K934635L533780M139841M652381N017221N195677N204201
$$ 531249046 533604026 536538661 540072441 544212282 548864663 553881884 559077561 564281762
2975.7E64281762N161583N063057M777372M327595L838539L349722K859711K389729
$$ 564281762 569443345 574506402 579283774 583611369 587449908 590799630 593659341 596049070
2992E96049070J911044J365066P62105J87993k65121o00160q53657j018346j104593
$$ 596049070 597960114 599325180 600087285 600275278 600010157 599409997 598556340 597537994 596433401
3010.4E96433401j132369j130700j155198j232624j382649j615584j873731k044141
$$ 596433401 595301032 594170332 593015134 591782510 590399861 588784277 586910546 584866405
3026.7E84866405k051890j965344j922191j991093k122581k206683k204239k216637
$$ 584866405 582814515 580849171 578926980 576935887 574813306 572606623 570402384 568185747
3043E68185747k332628k461672k470374k402723k402305k433241k405882k343237k254605
$$ 568185747 565853119 563391447 560921073 558518350 556116045 553682804 551276922 548933685 546679080
3061.4E46679080k155543k048671j893342j761853j722634j702249j645982j550019
$$ 546679080 544523537 542474866 540581524 538819671 537097037 535394788 533748806 532198787
3077.7E32198787j485050j487315j451432j368285j312315j273990j222968j177788
$$ 532198787 530713737 529226422 527774990 526406705 525094390 523820400 522597432 521419644
3094E21419644j176595j206696j254440j320779j361251j367390j376927j428187j486897
$$ 521419644 520243049 519036353 517781913 516461134 515099883 513732493 512355566 510927379 509440482
3112.4E09440482j504243j532852j598835j704514j805425j811236j799464j851261
$$ 509440482 507936239 506403387 504804552 503100038 501294613 499483377 497683913 495832652
3128.7D95832652j917303j957983j959025j945347j966745k048880k111285k094627
$$ 495832652 493915349 491957366 489998341 488052994 486086249 484037369 481926084 479831457
3145D79831457k085298k092809k079457k103895k181172k242178k257824k221316k175212
$$ 479831457 477746159 475653350 473573893 471469998 469288826 467046648 464788824 462567508 460392296
3163.4D60392296k198428k240061k255738k258867k207577k157748k193660k222716
$$ 460392296 458193868 455953807 453698069 451439202 449231625 447073877 444880217 442657501
3179.7D42657501k206654k196878k183139k156943k131314k121895k136618k143532
$$ 442657501 440450847 438253969 436070830 433913887 431782573 429660678 427524060 425380528
3196D25380528k070874j969427j951665j957118j924396j889169j835674j795113j794040
$$ 425380528 423309654 421340227 419388562 417431444 415507048 413617879 411782205 409987092 408193052
3214.3D08193052j790971j800745j801104j784175j780957j790613j830608j844347
$$ 408193052 406402081 404601336 402800232 401016057 399235100 397444487 395613879 393769532
3230.7C93769532j846909j959771k055854k025276k026200k110213k168656k177596
$$ 393769532 391922623 389962852 387906998 385881722 383855522 381745309 379576653 377399057
3247C77399057k214253k258479k267242k296060k340675k352535k342552k308011k234578
$$ 377399057 375184804 372926325 370659083 368363023 366022348 363669813 361327261 359019250 356784672
3265.3C56784672k134145k013921j933337j866340j726300j587301j478970j349837
$$ 356784672 354650527 352636606 350703269 348836929 347110629 345523328 344044358 342694521
3281.6C42694521j221299j094163r52631q37088p70747o86318n64873m77791m29004
$$ 342694521 341473222 340379059 339426428 338589340 337818593 337132275 336567402 336089611 335660607
3300C35660607l65913k93702k91258l45916l50267k86221k20865j70469j51188j91062
$$ 335660607 335294694 335000992 334709734 334363818 334013551 333727330 333506465 333335996 333184808 332993746
3320.4C32993746k02835j81287k42412l15041k93314k61873k50280k51979l37630m71652
$$ 332993746 332790911 332609624 332367212 332052171 331758857 331496984 331246704 330994725 330657095 330185443
3340.8C30185443n27203n01513m87358n07772n63234o30915o82116o67661n91695n69731
$$ 330185443 329658240 329156727 328669369 328161597 327598363 326967448 326285332 325617671 325025976 324456245
3361.2C24456245n93335n86301n81771o40959p47293p64101o70225o06000n84185n52685
$$ 324456245 323862910 323276609 322694838 322053879 321306586 320542485 319872260 319266260 318682075 318129390
3381.6C18129390m81247l82692k72363j99408k90036m44174m14163j86264m620j22845
$$ 318129390 317648143 317265451 316993088 316793680 316503644 316059470 315645307 315459043 315454423 315331578
3402C15331578l71277l25531o5446R9540J17421M7028J5080R3609J91838L08931M87297
$$ 315331578 314960301 314634770 314569324 314668864 314786285 314833313 314848393 314942002 315133840 315442771 315930068
3424.4C15930068N91130O40660P01815P90924Q92252Q22722O54251O69390Q40127R93371
$$ 315930068 316521198 317161858 317863673 318654597 319546849 320369571 321023822 321693212 322533339 323526710
3444.8C23526710J099617J137465J155525J223684J329273J437008J493007J451820
$$ 323526710 324626327 325763792 326919317 328143001 329472274 330909282 332402289 333854109
3461.1C33854109J482785J690239J806288J632274J359075J363188J614541J848548
$$ 333854109 335336894 337027133 338833421 340465695 341824770 343187958 344802499 346651047
3477.4C46651047J915157J798064J763463J916140J963049J898378J927436J993507
$$ 346651047 348566204 350364268 352127731 354043871 356006920 357905298 359832734 361826241
3493.8C61826241K061039K066553K055079K086281J982928J841157J930297K175569
$$ 361826241 363887280 365953833 368008912 370095193 372078121 373919278 375849575 378025144
3510.1C78025144K382100K380967K196163K150595K320141K475470K415270K287298
$$ 378025144 380407244 382788211 384984374 387134969 389455110 391930580 394345850 396633148
3526.4C96633148K338320K505392K612919K668529K691418K679676K766699K871513
$$ 396633148 398971468 401476860 404089779 406758308 409449726 412129402 414896101 417767614
3542.7D17767614K835781K707451K719164K841711K938330L032029L094673L144175
$$ 417767614 420603395 423310846 426030010 428871721 431810051 434842080 437936753 441080928
3559D41080928L191829L146499L049165L327638L834635L855556L610939L605604L770679
$$ 441080928 444272757 447419256 450468421 453796059 457630694 461486250 465097189 468702793 472473472
3577.4D72473472L932387M030526L949493L737479L798157M205376M271388M125357
$$ 472473472 476405859 480436385 484385878 488123357 491921514 496126890 500398278 504523635
3593.7E04523635M197836M365980M424334M423142M319190M003943L938257M253209
$$ 504523635 508721471 513087451 517511785 521934927 526254117 530258060 534196317 538449526
3610E38449526M426002M419029M233301M157901M615128M752874M232466L549934L598511
$$ 538449526 542875528 547294557 551527858 555685759 560300887 565053761 569286227 572836161 576434672
3628.4E76434672M671752M850209M376650M143774M007638L973961L931701L532231
$$ 576434672 581106424 585956633 590333283 594477057 598484695 602458656 606390357 609922588
3644.7F09922588K963424L163278M135251M205227L574729L587901L836751L501594
$$ 609922588 612886012 616049290 620184541 624389768 627964497 631552398 635389149 638890743
3661F38890743L142596L023684K656102K313614K635777K558112K195298K721727L045678
$$ 638890743 642033339 645057023 647713125 650026739 652662516 655220628 657415926 660137653 663183331
3679.4F63183331K836705K589941K178490J733839J674295K098501K359926K189875
$$ 663183331 666020036 668609977 670788467 672522306 674196601 676295102 678655028 680844903
3695.7F80844903J825273J479864J407802J672387J726032J350283R45211J158535
$$ 680844903 682670176 684150040 685557842 687230229 688956261 690306544 691251755 692410290
3712F92410290J821578J836777J425206J155555J006723R16183J048505J259327R98438
$$ 692410290 694231868 696068645 697493851 698649406 699656129 700572312 701620817 702880144 703878582
3730.3G03878582N27322N08845J068532J565695J216650K43545R2923J059890Q96156
$$ 703878582 704405904 704914749 705983281 707548976 708765626 709009171 709102094 710161984 711058140
3748.7G11058140L48627J045525J591802J215935Q42810R56714R82225P03156N48362
$$ 711058140 711406767 712452292 714044094 715260029 716102839 717059553 718041778 718744934 719293296
3767.1G19293296N82874Q36492J048743Q82268N61953M66228O81281P18295O24955
$$ 719293296 719876170 720712662 721761405 722643673 723205626 723671854 724353135 725071430 725696385
3785.4G25696385O90341P17461O53267M60386K76625K85745P2300J49966Q38637Q23021
$$ 725696385 726386726 727104187 727757454 728217840 728494465 728780210 728852510 729002476 729841113 730664134
3805.8G30664134P04467R66370P56205J39415k9624L49403K26259L71456R04799Q18610
$$ 730664134 731368601 732334971 733091176 733230591 733200967 733550370 733776629 734148085 735052884 735871494
3826.2G35871494N64813L09229K14875L35097J05024k9922M65095Q15749Q61168P95126
$$ 735871494 736436307 736745536 736960411 737295508 737400532 737370610 737835705 738651454 739512622 740307748
3846.6G40307748M85659k91765j092374k4915J433909J140773M03941O3598J87397
$$ 740307748 740793407 740501642 739409268 739384353 740818262 741959035 742362976 742426574 742613971
3865G42613971K10285q7738J64032O97375P82013N09083L4392O8366L29912L09229
$$ 742613971 742824256 742736518 742900550 743597925 744379938 744889021 744923413 744991779 745321691 745630920
3885.4G45630920M92871L60250P7605L97087N31315N5969l44693k37167J78098O34373
$$ 745630920 746123791 746484041 746561646 746958733 747490048 747546017 747201324 746964157 747142255 747776628
3905.7G47776628P59065M90069K26796N3286p0214N7936L27468L02970R8169J10030
$$ 747776628 748535693 749025762 749252558 749305844 749235630 749293566 749621034 749924004 750022173 750132203
3926.1G50132203J56880L5762O4791L10301L49701J84059O2525P4208K14100K04086
$$ 750132203 750289083 750324845 750389636 750699937 751049638 751233697 751296222 751370430 751584530 751788616
3946.5G51788616O8665J16706K37047K46823K03550J14441L1650J07884J96219J75655
$$ 751788616 751857281 751973987 752211034 752457857 752661407 752775848 752807498 752915382 753111601 753287256
3966.9G53287256J62422J26064P6175J00732J51157J58131J48714J37806R9242P8260
$$ 753287256 753449678 753575742 753651917 753752649 753903806 754061937 754210651 754348457 754447699 754525959
3987.3G54525959J05918J54376K01821J83225J10269
$$ 754525959 754631877 754786253 754988074 755171299 755281568
3997.5G55281568
$$ 755281568
##END=$$ End of the data block
