##TITLE=G15-51-SE $$ Begin of the data block
##JCAMP-DX=5.00 $$ ACD/SpecManager v 10.08
##SPECTROMETER/DATA SYSTEM=Alpha
##DATE=22 Oct 2013 11:25:32
##DATA TYPE=INFRARED SPECTRUM
##DATA CLASS=XYDATA
##ORIGIN=
##OWNER=
##NPOINTS=1765
##FIRSTX=399.75695801
##LASTX=3997.56933594
##MAXX=3997.56933594
##MINX=399.75695801
##MAXY=0.82998306
##MINY=0.31478301
##XFACTOR=1.0000000000
##YFACTOR=1.000000000000000e-9
##FIRSTY=0.56902587
##DELTAX=2.03957629
##XUNITS=1/CM
##YUNITS=ARBITRARY UNITS
##XYDATA=(X++(Y..Y))
399.8E69025874k280831k667010k163470l26335J185000J110732r1135j426041j819730
$$ 569025874 566745043 564078033 561914563 561588228 562773228 563883960 563792825 562366784 560547054
418.1E60547054p81954r9778o26504j535297k189636k150237j443684p04945m35888
$$ 560547054 559765100 559665322 559038818 557503521 555313885 553163648 551719964 551015019 550579131
436.5E50579131l50058K14219J182079J864612J785755R74059p4267q11577j026869
$$ 550579131 550229073 550443292 551625371 553489983 555275738 556249797 556175530 555363953 554337084
454.8E54337084j007616j264632j913965k547025k821386k759934k314031j826525
$$ 554337084 553329468 552064836 550150871 547603846 544782460 542022526 539708495 537881970
471.1E37881970j753926j873374j785815j282751o55592k30848j08839n15401j251399
$$ 537881970 536128044 534254670 532468855 531186104 530530512 530299664 530190825 529675424 528424025
489.5E28424025j630664j505077j551390j847267j996696k230048k573788k698422
$$ 528424025 526793361 525288284 523736894 521889627 519892931 517662883 515089095 512390673
505.8E12390673k563894k392172k480984k763689k959490k733439k002537j281261
$$ 512390673 509826779 507434607 504953623 502189934 499230444 496497005 494494468 493213207
522.1D93213207r68010q84086n45263K03401J046002J739174K215505K462774K454817
$$ 493213207 492245197 491361111 490815848 491019249 492065251 493804425 496019930 498482704 500937521
540.5E00937521K072752J351535N85795J8716n36681j240193j662314j604289j473904
$$ 500937521 503010273 504361808 504947603 504966319 504429638 503189445 501527131 499922842 498448938
558.8D98448938j633435k140046k608805k677471k295434j450628m51625L23534R94027
$$ 498448938 496815503 494675457 492066652 489389181 487093747 485643119 485191494 485515028 486509055
577.2D86509055J759231K578080L208577L318519K901435K110898J272559P51555N17965
$$ 486509055 488268286 490846366 494054943 497373462 500274897 502385795 503658354 504409909 504927874
595.6E04927874K96712J01745J9729q6606j01685R2029M34459P22527O68347M57942
$$ 504927874 505224586 505326331 505346060 505259454 505157769 505249798 505684257 506406784 507075131 507533073
616E07533073O21140J357317K280355K832472K852321K590477K326072K271294K321840
$$ 507533073 508154213 509511530 511791885 514624357 517476678 520067155 522393227 524664521 526986361
634.3E26986361K254664J871706J241147Q75354J070380J483679J508415R19878J60337
$$ 526986361 529241025 531112731 532353878 533229232 534299612 535783291 537291706 538211584 538371921
652.7E38371921j57118J08719N93900Q22723O45161L49581K00808N00381J249373J714289
$$ 538371921 538214803 538323522 538917422 539740145 540385306 540734887 540935695 541436076 542685449 544399738
673.1E44399738J674891J221299J070499J393140J687765J563430R49204J39534l84688
$$ 544399738 546074629 547295928 548366427 549759567 551447332 553010762 553959966 554099500 553714812
691.4E53714812n37098n29050n37515m82321k67386J54733Q77261J771212K453685
$$ 553714812 553177714 552648664 552111149 551628828 551361442 551516175 552393436 554164648 556618333
709.8E56618333K705395K769649K966881L427684M153013M724026M700780M240096
$$ 556618333 559323728 562093377 565060258 568487942 572640955 577364981 582065761 586305857
726.1E86305857L656327L271461L141344K919912K329886J483559P44522L05235J09375
$$ 586305857 589962184 593233645 596374989 599294901 601624787 603108346 603852868 604158103 604267478
744.4F04267478q6188l02911n75006j057387j514375j586795j301407r53734o26684
$$ 604267478 604181290 603878379 603303373 602245986 600731611 599144816 597843409 596889675 596262991
762.8E96262991r179J071692K337217L548324M492104M967332M982531M657328M178882
$$ 596262991 596253812 597325504 599662721 603211045 607703149 612670481 617653012 622310340 626489222
781.2F26489222L730655L302753K789438K269089J800120J556336J798094K424478
$$ 626489222 630219877 633522630 636312068 638581157 640381277 641937613 643735707 646160185
797.5F46160185K987445L196597L054559K696097K340972K020955J631558J117945
$$ 646160185 649147630 652344227 655398786 658094883 660435855 662456810 664088368 665206313
813.8F65206313N35667k7180m48465p16865j065612j693010k332449k675057k830326
$$ 665206313 665741980 665714800 665266335 664549470 663483858 661790848 659458399 656783342 653953016
832.1F53953016k818525k687037k631545k667844k636016k424896j974403j362384
$$ 653953016 651134491 648447454 645815909 643148065 640512049 638087153 636112750 634750366
848.5F34750366q94010p73191q79765r25958n21660P86543K837718M711568N654097
$$ 634750366 633856356 633083165 632203400 631277442 630755782 631542325 634380043 639091611 644745708
866.8F44745708N755543N461216M756987L437043J610696l51250k152860l563107m348337
$$ 644745708 650501251 655962467 660719454 664156497 665767193 665415943 663263083 659699976 655351639
885.2F55351639m629791m773736m909456m917323m711330m382432m242837m544974
$$ 655351639 650721848 645948112 641038656 636121333 631410003 627027571 622784734 618239760
901.5F18239760n188942n919277o475091o699026o648540o426037o037593n355060
$$ 618239760 613050818 607131541 600656450 593957424 587308884 580882847 574845254 569490194
917.8E69490194m258215k893090j629532q59618o80089o98447n59628l48628j87456
$$ 569490194 565231979 562338889 560709357 559849739 559169650 558471203 557911575 557562947 557375491
936.2E57375491r4056k05696q04186k271831m526556o815731q524180r584426j0214448
$$ 557375491 557281435 557075739 556271553 553999722 549473166 542657435 534133255 524548829 514334381
954.5E14334381j0540545j0613293j0531813j0356396j0170877j0026187r728014r046227
$$ 514334381 503793836 493180543 482648730 472292334 462121457 452095270 442367256 433321029
970.8D33321029p981956o654352n235881l902346k738386j790494j090735o70492n33671
$$ 433321029 425339073 418684721 413448840 409546494 406808108 405017614 403926879 403256387 402722716
989.2D02722716n92082p25449p80254o22958l16352n3584L0070j65403o32226j122654
$$ 402722716 402130634 401405185 400624931 400001973 399685621 399632037 399662107 399496704 398864478 397741824
1009.6C97741824j403153j480490j472383j477033j562476j673043j720399j735568
$$ 397741824 396338671 394858181 393385798 391908765 390346289 388673246 386952847 385217279
1025.9C85217279j784563j862824j928389j996756k065986k070546j962245j826524
$$ 385217279 383432716 381569892 379641503 377644747 375578761 373508215 371545970 369719446
1042.2C69719446j716286j545191j229584o84738L1352O85900J121283J409411J724243
$$ 369719446 368003160 366457969 365228385 364543647 364574999 365260899 366382182 367791593 369515836
1060.6C69515836K144873K517432K349437J200109n32716j735300j655102n41061Q48591
$$ 369515836 371660709 374178141 376527578 377727687 377194971 375459671 373804569 373263508 374112099
1078.9C74112099K060175K989978L690124M199653M465998M479587M225760L728211
$$ 374112099 376172274 379162252 382852376 387052029 391518027 395997614 400223374 403951585
1095.2D03951585L135115K543539J980096J564860J432687J586766J917839K331256
$$ 403951585 407086700 409630239 411610335 413175195 414607882 416194648 418112487 420443743
1111.6D20443743K710820K878695K729655K346545J976967J813412J870841K139806
$$ 420443743 423154563 426033258 428762913 431109458 433086425 434899837 436770678 438910484
1127.9D38910484K616138K980142K860487K323031J573205P24435q7976p16359j028478
$$ 438910484 441526622 444506764 447367251 449690282 451263487 451987922 451899946 451183587 450155109
1146.2D50155109j000881p59333m05550L2574N78939J260788K053737K856911L505021
$$ 450155109 449154228 448394895 447989345 448021919 448600858 449861646 451915383 454772294 458277315
1164.6D58277315L926277M241884M652411N256295N948484O480932O741434O794364
$$ 458277315 462203592 466445476 471097887 476354182 482302666 488783598 495525032 502319396
1180.9E02319396O724059O523550O095290N353808M294277L093600J978278J011908
$$ 502319396 509043455 515567005 521662295 527016103 531310380 534403980 536382258 537394166
1197.2E37394166K10047l45409o40690o97732n19455j89185J25885K73108K27035R4950
$$ 537394166 537604213 537258804 536618114 535920382 535400927 535211742 535337627 535610735 535837770 535932720
1217.6E35932720p3493l20256o59763j052440j400590j616358j656175j524270j253783
$$ 535932720 535859227 535538971 534879208 533826768 532426178 530809820 529153645 527629375 526375592
1236E26375592q99017n19157r8049M43578J074016J602709J920640K072573K137780
$$ 526375592 525476575 524957418 524859369 525302947 526376963 527979672 529900312 531972885 534110665
1254.3E34110665K177894K246023K260923K148688K042591K040744K099395K117574
$$ 534110665 536288559 538534582 540795505 542944193 544986784 547027528 549126923 551244497
1270.6E51244497J991034J675606J262128R18865Q27730R63628J081228J061559R16958
$$ 551244497 553235531 554911137 556173265 557092130 557919860 558883488 559964716 561026275 561943233
1289E61943233O57380K73943j66059o15179j063049j441539j664638j733482j707256
$$ 561943233 562600613 562874556 562708497 562093318 561030269 559588730 557924092 556190610 554483354
1307.4E54483354j571655j327634j008809o34431k30730J22428K79903N8532n32031
$$ 554483354 552911699 551584065 550575256 549940825 549710095 549832523 550112426 550170958 549638927
1325.7E49638927j285970j957536k327263k363623k171933j843572j344859q08061
$$ 549638927 548352957 546395421 544068158 541704535 539532602 537689030 536344171 535536110
1342E35536110n47826n75125p06732r10402j192808j486361j722455j927495k309680
$$ 535536110 534988284 534413159 533706427 532796025 531603217 530116856 528394401 526466906 524157226
1360.4E24157226k866566l244937l424108l441989l048956k802968k941966l022850
$$ 524157226 521290660 518045723 514621615 511179626 508130670 505327702 502385736 499362886
1376.7D99362886l226131l578931l642768l213555k364158j178473l13640j73837k55227
$$ 499362886 496136755 492557824 488915056 485701501 483337343 482158870 481845230 481671393 481416166
1395.1D81416166j06067J91450O34224J021802J319617J561672J611411J603693J632631
$$ 481416166 481310099 481501549 482135773 483157575 484477192 486038864 487650275 489253968 490886599
1413.4D90886599J634449J703769K163320K448738K338469K229273J879454J286268
$$ 490886599 492521048 494224817 496388137 498836875 501175344 503404617 505284071 506570339
1429.7E06570339P25031J29461n01096l54290L89695O88732O42657M78983M02451M64022
$$ 506570339 507295370 507424831 506923735 506569445 506959140 507647872 508290529 508769512 509171963 509635985
1450.1E09635985L65615K81632Q25703K285302K992928K767026K830327L414452M083097
$$ 509635985 510001600 510283232 511108935 513394237 516387165 519154191 521984518 525398970 529482067
1468.5E29482067N119025P074595Q063376P127285N700052M185378K697647J099765
$$ 529482067 534601092 541675687 549739063 556866348 562566400 566751778 569449425 570549190
1484.8E70549190n76854k155840l121793l417611m429758n873561n792916n010605
$$ 570549190 569972336 567816496 564694703 561277092 556847334 550973773 545180857 540170252
1501.1E40170252n035817p085622j0059654q525074o923079p035077o443262m843950
$$ 540170252 535134435 528048813 517989159 509464085 502541006 495505929 489062667 484218717
1517.4D84218717l100813k515197k341091k318204k538323k292663k269000k333969
$$ 484218717 481117904 478602707 476261616 473943412 471405089 469112426 466843426 464509457
1533.7D64509457j633823j363247j686931o98954P18653J462877J958609K491921L078669
$$ 464509457 462875634 461512387 459825456 459126502 459845155 461308032 463266641 465758562 468837231
1552.1D68837231L434033L352433L862530N158573M339517L357917K996385K648741
$$ 468837231 472271264 475623697 479486227 484644800 488984317 492342234 495338619 497987360
1568.4D97987360K554089K178967J492381J193106J200199R00865M21702R5606k13921
$$ 497987360 500541449 502720416 504212797 505405903 506606102 507506967 507928669 508024275 507810354
1586.8E07810354o00397j097679j609445k170503k729863l372759m194855m991264
$$ 507810354 507209957 506112278 504502833 502332330 499602467 496229708 492034853 487043589
1603.1D87043589n681753o448597p400423p999003q208185r404630j1070966r850115
$$ 487043589 481361836 474913239 467512816 459513813 451305628 441900998 430830032 420979917
1619.4D20979917r492159j1292726j1307269j0515362j0105073q916557q465797q901715
$$ 420979917 411487758 400195032 388887763 378372401 368267328 359350771 350884974 341983259
1635.7C41983259o232798k835453j251995l86179L48598J381933J820624K003134L345698
$$ 341983259 335750461 332915008 331663013 331276834 331625432 333007365 334827989 336831123 340176821
1654.1C40176821M118025M140347M760415N877733O841928O788700P330388Q544475
$$ 340176821 344294846 348435193 353195608 359073341 365915269 372703969 380034357 388578832
1670.4C88578832Q290678Q415342R217202Q875996Q380950R174645J1822462J1884510
$$ 388578832 396869510 405284852 414502054 423378050 431759000 440933645 452756107 464640617
1686.7D64640617J0699243J1561453J2009800J3927847J5951812J5911758J7271519
$$ 464640617 475339860 486901313 498911113 512838960 528790772 544702530 561974049
1701E61974049J4687597J1956513J1570156R939015Q128345O734788N814195N889296
$$ 561974049 576661646 588618159 600188315 610127330 618255675 624990463 630804658 636693954
1717.3F36693954N849243M827976L926694L427744K909899K546728K179265K290129
$$ 636693954 642543197 647371173 651297867 654725611 657635510 660182238 662361503 664651632
1733.6F64651632K936781K839088K763689L189027L615022L936827M256964M844308
$$ 664651632 667588413 670427501 673191190 676380217 679995239 683932066 688189030 693033338
1749.9F93033338N508780N286753M954875M931748M662990M607737M398167L840507
$$ 693033338 698542118 703828871 708783746 713715494 718378484 722986221 727384388 731224895
1766.3G31224895L477633L247082L354251L509820L014743K491534K360940K351582
$$ 731224895 734702528 737949610 741303861 744813681 747828424 750319958 752680898 755032480
1782.6G55032480K192855J973390J643241J289665J514078J917004J778603J416325
$$ 755032480 757225335 759198725 760841966 762131631 763645709 765562713 767341316 768757641
1798.9G68757641J335025J487553J503170J370072J235485J208663J196444J120210
$$ 768757641 770092666 771580219 773083389 774453461 775688946 776897609 778094053 779214263
1815.2G79214263J090348J183212J130878R01998Q21709P93040P77304J085222J233935
$$ 779214263 780304611 781487823 782618701 783520699 784342408 785135448 785912752 786997974 788231909
1833.6G88231909R60529P47979O35683M24624M00841Q40962J027405Q01325N88775
$$ 788231909 789192438 789940417 790576100 791000724 791401565 792242527 793269932 794071257 794660032
1851.9G94660032N01811N54562O20663O24538N13672L15309J14381J92046O55413Q67844
$$ 794660032 795161843 795716405 796337068 796961606 797475278 797790587 797904968 798097014 798752427 799620271
1872.3G99620271O34730L98457L60131M58181N91278N91755M18007K43545L33667N16057
$$ 799620271 800255001 800653458 801013589 801471770 802063048 802654803 803072810 803316355 803650022 804166079
1892.7H04166079N41806N38766M75526L28302K37167K68936L32773L59833L42787K50280
$$ 804166079 804707885 805246651 805722177 806050479 806287646 806556582 806889355 807249188 807591975 807842255
1913.1H07842255J01506R7156L32832M18723L26514K81215K13682J98186K90513L31759
$$ 807842255 807943761 808040917 808373749 808792472 809118986 809400201 809613883 809812069 810102582 810434341
1933.5H10434341K31028Q8155k3544k9385J77980L83854L40640J85013R9540J28567
$$ 810434341 810665369 810753524 810729980 810700595 810878575 811262429 811603069 811788082 811887622 812016189
1953.9H12016189K43425L02196K50697J73628R2388M5120J55509L11792L16024J98722
$$ 812016189 812259614 812561810 812812507 812986135 813078523 813123643 813279152 813590944 813906968 814105690
1974.3H14105690P3015M1783J10328J93298J79708P6473k5213m6611P2956K20061K34246
$$ 814105690 814178705 814220488 814330816 814524114 814703822 814780295 814755082 814708471 814781427 815001488 815235734
1996.7H15235734J47760K0504q9824o2883L3974P7904J7643j43469k77936k45273j01865
$$ 815235734 815383494 815403998 815314174 815251291 815285265 815363169 815380812 815237343 814959407 814714134 814612269
2019.2H14612269m5836j16050k16424k62797k34366j50025j07288j46925k12968k78651
$$ 814612269 814566433 814450383 814233959 813971162 813736796 813586771 813479483 813332558 813119590 812840939
2039.6H12840939k59102j30772l7671o2763r5308o9439j7822J4603M8280J02818R0539
$$ 812840939 812581837 812451065 812413394 812350631 812255323 812185884 812168062 812182665 812230945 812333763 812424302
2062H12424302J2875P748J02878J62721J34885P3969L5823K8371M9472Q1897J17362
$$ 812424302 812437177 812444925 812547803 812710524 812845409 812919378 812955201 812983572 813033044 813114941 813232303
2084.4H13232303J34885R0301M9114P0274J28329J66118J78933J57178J09732R5129
$$ 813232303 813367188 813457489 813506603 813576877 813705206 813871324 814050257 814207435 814317167 814412296
2104.8H14412296J08659J46389J79708J66774J06513L4452K2173P7128J20282J25707
$$ 814412296 814520955 814667344 814847052 815013826 815120339 815154791 815176964 815254092 815374374 815500081
2125.2H15500081J04725O8128L5882M3094J14858J58668J12593M3690L1948P5996J31846
$$ 815500081 815604806 815672934 815708816 815751910 815866768 816025436 816138029 816181719 816213667 816289663 816421509
2147.7H16421509J65701J67846J49072J15871J17481J89662K68578K78592K41816K23041
$$ 816421509 816587210 816755056 816904128 817019999 817137480 817327142 817595720 817874312 818116128 818339169
2168H18339169K71738L55661L93629L85999L49045K93255K72810L24607L90888L89218
$$ 818339169 818610907 818966568 819360197 819746196 820095241 820388496 820661306 820985913 821376801 821766019
2188.4H21766019L24488K68876K45690K56300L11375L39270L17394K78831K26676K33114
$$ 821766019 822090507 822359383 822605073 822861373 823172748 823512018 823829412 824108243 824334919 824568033
2208.8H24568033L12805L68834L37005K37524J60873J66714K45571L31104L05474J83046
$$ 824568033 824880838 825249672 825586677 825824201 825985074 826151788 826397359 826728463 827033937 827216983
2229.2H27216983Q0645N5611J30653K36989K52306J47760L2365K2590J24932K21669
$$ 827216983 827297628 827353239 827483892 827720881 827973187 828120947 828153312 828175902 828300834 828522503
2249.6H28522503J88291Q4877L5465M7028Q0765J32620J43468Q4520L3378L8505Q0347
$$ 828522503 828710794 828795671 828831136 828878164 828958929 829091549 829235017 829319537 829352915 829391420 829471767
2272.1H29471767J18554R1016O556r417M4465Q9109J07646O3360l1293p7903m6790
$$ 829471767 829590321 829681337 829687893 829678476 829722941 829812050 829919696 829983056 829951763 829873860 829827070
2294.5H29827070o974J4723J8775J7464K0802J0670l6955q8930o2287M232L2723K7954
$$ 829827070 829820096 829834819 829853594 829871058 829891860 829902530 829865575 829776645 829714358 829718590 829751313 829779267
2319H29779267l5464j67609j81019j3351O1154r8348k48730k73526l13639l10123k18034
$$ 829779267 829743803 829576194 829395175 829381824 829442978 829344630 829095900 828822374 828508735 828198612 827980578
2341.4H27980578k10524k94745k40087r7633n543N1975O6042r7870m13478n83231m17352
$$ 827980578 827770054 827475309 827235222 827137589 827132046 827184021 827250063 827152193 826738715 826155484 825738132
2363.8H25738132j79946k36452l87251l98994l43740k64823j96338k10285k66373k86699
$$ 825738132 825558186 825321734 824934483 824535489 824191749 823926926 823730588 823520303 823253930 822967231
2384.2H22967231k85566k69115k29954k22087k81930l45290l72708l51906k90215k94148
$$ 822967231 822681665 822412550 822182596 821960509 821678579 821333289 820960581 820608675 820318460 820024312
2404.6H20024312l95895m97162n04076m28260l56376l71098m78506n66602n61774m97162
$$ 820024312 819628417 819131255 818627179 818198919 817842543 817471445 816992939 816426337 815864563 815367401
2425H15367401m50373n02110o02066o29306n97179n60045n22196n17369n86509o39439
$$ 815367401 814917028 814414918 813812852 813183546 812586367 812026322 811504126 810986757 810400248 809760809
2445.4H09760809n90324n26846n17905n47588n89072o18637n97834n34118n13136n42283
$$ 809760809 809170485 808643639 808125734 807578146 806989074 806370437 805772603 805238485 804725349 804183066
2465.8H04183066n58436n64933n77390n75841n49912n23448n30243n48005n43475n26130
$$ 804183066 803624630 803059697 802482307 801906466 801356554 800833106 800302863 799754858 799211383 798685253
2486.2G98685253n21481n23091n08368n07116n08010m84646m83095m99189m92573m65453
$$ 798685253 798163772 797640681 797132313 796625197 796117187 795632541 795149446 794650257 794157684 793692231
2506.6G93692231m47392m40002m27782m46737n01812n28216n13911n12839n47349n75066
$$ 793692231 793244839 792804837 792377055 791930318 791428506 790900290 790386379 789873540 789326191 788751125
2527G88751125n58734n28514n09918n29110o11842o50883o10768n84841n81741n92232
$$ 788751125 788192391 787663877 787153959 786624849 786013007 785362124 784751356 784166515 783584774 782992542
2547.4G82992542o18220o37412o06179n45859n24760n37931n66900n92470n70774n20707
$$ 782992542 782374322 781736910 781130731 780584872 780060112 779522181 778955281 778362811 777792037 777271330
2567.8G77271330n05387n37456n94854o31869n95867n34475n30780n73813o14167o05941
$$ 777271330 776765943 776228487 775633633 775001764 774405897 773871422 773340642 772766829 772152662 771546721
2588.2G71546721n37395m83990n01036n69582o20366o06894n93722o09338o22213o58155
$$ 771546721 771009326 770525336 770024300 769454718 768834352 768227458 767633736 767024398 766402185 765744030
2608.6G65744030p39455q07166q02159p66695p91728q67665r27627r49681r36747r53972
$$ 765744030 765004575 764197409 763395250 762628555 761836827 760969162 760041535 759091854 758155107 757201135
2629G57201135j021862j052916j027524j020551j033604j032114j027823j008570j025259
$$ 757201135 756179273 755126357 754098833 753078282 752044678 751012564 749984741 748976171 747950912
2647.3G47950912j073421j053988j007855r93193r99868j042902j065731j017571r95814
$$ 747950912 746877491 745823503 744815648 743822455 742822587 741779685 740713954 739696383 738700569
2665.7G38700569j013160r82702r27567r04501r04321r12786r06229q66473q57651
$$ 738700569 737687409 736704707 735777140 734872639 733968318 733055532 732149303 731282830 730425179
2684.1G30425179r00090r25719r06051q78393q91269r36567r69947r88424j020312
$$ 730425179 729525089 728599370 727693319 726814926 725923657 724987090 724017143 723028719 722008407
2702.4G22008407j057386j058340j034141j049221j082897j101851j117170j105070
$$ 722008407 720951021 719892681 718858540 717809319 716726422 715624571 714507401 713402331
2718.7G13402331j066804j037359j033366j026928r93312r49681r18388r07362r03427
$$ 713402331 712335527 711298168 710264802 709237874 708244562 707294881 706376493 705469131 704565704
2737.1G04565704r20355r35913q95023q63671q93533r02176q61466q32260q27730q42571
$$ 704565704 703645349 702709436 701814413 700950742 700057209 699155033 698293567 697461307 696633577 695791006
2757.5F95791006q58068q52883q51214q61287q78215q84771r05335r86278j050234
$$ 695791006 694932938 694080055 693228841 692367554 691489339 690604568 689699233 688712955 687662721
2775.8F87662721j047433j054883j090765j129925j197755j251579j258194j277030
$$ 687662721 686615288 685560405 684469640 683339715 682141960 680890381 679632187 678355157
2792.2F78355157j341998j431525j489460j517237j531064j549184j618803j705945
$$ 678355157 677013159 675581634 674092174 672574937 671043873 669494689 667875886 666169941
2808.5F66169941j760780j782716j778781j814187j931190k040684k096355k129257
$$ 666169941 664409161 662626445 660847664 659033477 657102287 655061603 652965248 650835991
2824.8F50835991k139151k201438k381206k591014k794802l021359l300727l750264
$$ 650835991 648696840 646495402 644114196 641523182 638728380 635707021 632406294 628656030
2841.1F28656030m384578n054771n570293n695045n254686m324794l246843k424002
$$ 628656030 624271452 619216681 613646388 607951343 602696657 598371863 595125020 592701018
2857.4E92701018k080023k243758k815842l518641m036367m182160l891170l307462
$$ 592701018 590620995 588377237 585561395 582042754 578006387 573824227 569933057 566625595
2873.7E66625595k633810j987100j496493j218558j120627j160621j257480j356065
$$ 566625595 563991785 562004685 560508192 559289634 558169007 557008386 555750906 554394841
2890.1E54394841j464069j598119j776219j987994k184271k370119k608240k936244
$$ 554394841 552930772 551332653 549556434 547568440 545384169 543014050 540405810 537469566
2906.4E37469566l362417l853083m364610m857063n148053n080462m675984l953219
$$ 537469566 534107149 530254066 525889456 521032393 515884340 510803878 506127894 502174675
2922.7E02174675k984285j897901q03203K30700J267463K312780L224611L864825M185080
$$ 502174675 499190390 497292489 496489286 496719986 497987449 500300229 503524840 507389665 511574745
2941E11574745M181504L831506L204227K463102J766980J231909J003682J202881J722277
$$ 511574745 515756249 519587755 522791982 525255084 527022064 528253973 529257655 530460536 532182813
2959.4E32182813K349138K958775L551304M145264M662991N027890N213321N228579
$$ 532182813 534531951 537490726 541042030 545187294 549850285 554878175 560091496 565320075
2975.7E65320075N176663N082607M808009M355848L867507L389597K921402K456069
$$ 565320075 570496738 575579345 580387354 584743202 588610709 592000306 594921708 597377777
2992E97377777J928091J336038P51436K17557k20001n62727q27551r89616j084447
$$ 597377777 599305868 600641906 601393342 601610899 601390898 600828171 600000620 599011004 597926557
3010.4E97926557j141131j135349j131714j228511j406371j609862j820505j987517
$$ 597926557 596785426 595650077 594518363 593289852 591883481 590273619 588453114 586465597
3026.7E86465597k037644k003610j984656k015412k074003k139628k200425k244174
$$ 586465597 584427953 582424343 580439687 578424275 576350272 574210644 572010219 569766045
3043E69766045k292931k385557k474666k471387k419830k420127k444923k393663k257883
$$ 569766045 567473114 565087557 562612891 560141504 557721674 555301547 552856624 550462961 548205078
3061.4E48205078k133131k030194j895070j776159j721084j680434j607478j519322
$$ 548205078 546071947 544041753 542146683 540370524 538649440 536969006 535361528 533842206
3077.7E33842206j485825j506567j473248j385748j303017j230776j198113j200259
$$ 533842206 532356381 530849814 529376566 527990818 526687801 525457025 524258912 523058653
3094E23058653j200616j203239j249254j310706j341224j367569j409888j462043j490891
$$ 523058653 521858037 520654798 519405544 518094838 516753614 515386045 513976157 512514114 511023223
3112.4E11023223j495301j508236j585782j736343j829445j813769j812280j861721
$$ 511023223 509527922 508019686 506433904 504697561 502868116 501054347 499242067 497380346
3128.7D97380346j906991j951724j963884j941144j967520k079368k153992k111823
$$ 497380346 495473355 493521631 491557747 489616603 487649083 485569715 483415723 481303900
3145D81303900k066582k074510k105206k141923k189576k231569k256214k237290k183467
$$ 481303900 479237318 477162808 475057602 472915679 470726103 468494534 466238320 464001030 461817563
3163.4D61817563k182275k212883k227723k245039k249122k230435k232462k249599
$$ 461817563 459635288 457422405 455194682 452949643 450700521 448470086 446237624 443988025
3179.7D43988025k261579k244234k177924k128363k129346k158552k167881k108365
$$ 443988025 441726446 439482212 437304288 435175925 433046579 430888027 428720146 426611781
3196D26611781k016902j980513j992226j989841j959622j906544j842767j813919j829534
$$ 426611781 424594879 422614366 420622140 418632299 416672677 414766133 412923366 411109447 409279913
3214.3D09279913j844555j852632j839340j800209j787335j802861j834125j879841
$$ 409279913 407435358 405582726 403743386 401943177 400155842 398352981 396518856 394639015
3230.7C94639015j899421j927942j998395k054423k092600k134084k178699k208114
$$ 394639015 392739594 390811652 388813257 386758834 384666234 382532150 380353451 378145337
3247C78145337k217591k255410k341181k392232k361119k303719k259642k239287k208323
$$ 378145337 375927746 373672336 371331155 368938923 366577804 364274085 362014443 359775156 357566833
3265.3C57566833k140432k051830j964778j874387j743913j595199j459807j345426
$$ 357566833 355426401 353374571 351409793 349535406 347791493 346196294 344736487 343391061
3281.6C43391061j245499j114815r53853p95842o97434o74337o21855n20110m45932
$$ 343391061 342145562 341030747 340076894 339281052 338583618 337909281 337287426 336767316 336321384
3300C36321384m01467l44366l10004l31104l24577k51889j96755j95831j99854j97918
$$ 336321384 335919917 335575551 335265547 334934443 334609866 334357977 334161222 333965391 333765537 333567619
3320.4C33567619k14785k29388k55049l02046l09021l04907l21269l26395l62963m36335
$$ 333567619 333352834 333123446 332868397 332566351 332257330 331952423 331631154 331304759 330941796 330505461
3340.8C30505461m64380m74185m99874n07206n62102o61224p12246p00831o45459n99891
$$ 330505461 330041081 329566896 329067022 328559816 327997714 327336490 326624244 325923413 325277954 324678063
3361.2C24678063o03556n95272n80966o50257p72566p80672o52849n66304n60641n70238
$$ 324678063 324074507 323479235 322898269 322248012 321475446 320694774 320041925 319475621 318914980 318344742
3381.6C18344742n13822m00513k69711j58966k63750m93139m69089j73509K2918j30475
$$ 318344742 317830920 317430407 317160696 317001730 316737980 316244841 315775752 315602243 315625161 315494686
3402C15494686l59028k79874p2777L1382O9022K6435r478R0272K21610L14384M52161
$$ 315494686 315135658 314855784 314783007 314814389 314883411 314909846 314900368 314990640 315212250 315526634 315978795
3424.4C15978795N83470O72579P10487P79420Q92103Q08597O35713P04229R10819J023888
$$ 315978795 316562265 317234844 317945331 318724751 319616854 320425451 321061164 321765393 322676212 323700100
3444.8C23700100J080781J120419J171648J251281J334607J423359J473576J433134
$$ 323700100 324780881 325901300 327072948 328324229 329658836 331082195 332555771 333988905
3461.1C33988905J473576J691758J806796J623154J346379J356632J626879J882523
$$ 333988905 335462481 337154239 338961035 340584189 341930568 343287200 344914079 346796602
3477.4C46796602J925379J780599J775116J945257J987636J903475J902103J973421
$$ 346796602 348721981 350502580 352277696 354222953 356210589 358114064 360016167 361989588
3493.8C61989588K047091K067089K071977K075672K005190J938373K000868K177715
$$ 361989588 364036679 366103768 368175745 370251417 372256607 374194980 376195848 378373563
3510.1C78373563K365351K392650K254992K193064K300858K481193K464354K279907
$$ 378373563 380738914 383131564 385386556 387579620 389880478 392361671 394826025 397105932
3526.4C97105932K303243K529502K650678K685338K728939K718211K783626K882719
$$ 397105932 399409175 401938677 404589355 407274693 410003632 412721843 415505469 418388188
3542.7D18388188K838671K729863K787054K912312K973885L047287L114522L183722
$$ 418388188 421226859 423956722 426743776 429656088 432629973 435677260 438791782 441975504
3559D41975504L215283L118486L012895L353536L919214L912539L631055L630459L798723
$$ 441975504 445190787 448309273 451322168 454675704 458594918 462507457 466138512 469768971 473567694
3577.4D73567694L954679M057199L984064L762275L817618M245907M320621M168213
$$ 473567694 477522373 481579572 485563636 489325911 493143529 497389436 501710057 505878270
3593.7E05878270M262328M436612M432559M392505M341960M102885M040540M274129
$$ 505878270 510140598 514577210 519009769 523402274 527744234 531847119 535887659 540161788
3610E40161788M399479M427016M275262M167974M580915M745126M290998L672659L678382
$$ 540161788 544561267 548988283 553263545 557431519 562012434 566757560 571048558 574721217 578399599
3628.4E78399599M607498M778385M355967M124403M008532L992379L924429L551901
$$ 578399599 583007097 587785482 592141449 596265852 600274384 604266763 608191192 611743093
3644.7F11743093L036081L159345M063546M216552L621101L586233L813565L523946
$$ 611743093 614779174 617938519 622002065 626218617 629839718 633425951 637239516 640763462
3661F40763462L159105K957702K585828K285600K626896K589703K224087K716899L045321
$$ 640763462 643922567 646880269 649466097 651751697 654378593 656968296 659192383 661909282 664954603
3679.4F64954603K821862K584517K252222J801311J641751K062261K326250K124786
$$ 664954603 667776465 670360982 672613204 674414515 676056266 678118527 680444777 682569563
3695.7F82569563J774073J455545J422465J731396J762927J328170Q97765J150489
$$ 682569563 684343636 685799181 687221646 688953042 690715969 692044139 692941904 694092393
3712F94092393J878381J888930J429618J109302R46760R15170J059651J257241J025379
$$ 694092393 695970774 697859704 699289322 700398624 701345384 702260554 703320205 704577446 705602825
3730.3G05602825N14626M55141J060963J601636J250029J97649k0862J033903R55998
$$ 705602825 706117451 706572592 707633555 709235191 710485220 710682869 710662007 711695910 712651908
3748.7G12651908M13657J115918J640498J188815P59900R04858R72986O91652N49078
$$ 712651908 713065565 714181483 715821981 717010796 717770696 718675554 719648540 720340192 720889270
3767.1G20889270O15001Q75175J070976Q95500N74410M36128O07013O75321O05106
$$ 720889270 721504271 722379446 723450422 724345922 724920332 725356460 725963473 726638794 727243900
3785.4G27243900O82712P66396P24256M69804K04027K36392J27077K31505Q38756P29203
$$ 727243900 727926612 728693008 729417264 729887068 730091095 730327487 730454564 730686069 731524825 732254028
3805.8G32254028O08266R74118Q22247J81436l2604L13759K10345M27782R73166Q02814
$$ 732254028 732862294 733836412 734658659 734840095 734807491 735121250 735331595 735759377 736732543 737535357
3826.2G37535357N21005L36826K72333L50654N6446q5771M87983Q37505Q06272P36654
$$ 737535357 738056362 738393188 738665521 739016175 739072621 738986850 739474833 740312338 741118610 741855264
3846.6G41855264M95195k26498j046061q6188J374423J193106M83632O4552J42098
$$ 741855264 742350459 742123961 741077900 740991712 742366135 743559241 744042873 744107425 744249523
3865G44249523J74462q5055K03132O71864P10785M84944N4836J40786M32909L34978
$$ 744249523 744423985 744338930 744542062 745213926 745924711 746409655 746464491 746605277 747038186 747373164
3885.4G47373164M17351K94328O3062L77715M78684K2889k99931j85370J92880O84381
$$ 747373164 747790515 748084843 748147905 748525620 749004304 749027193 748727262 748541892 748734772 749419153
3905.7G49419153Q22603M94779J92225N7458p4565l3677K40386L16143J73867J48356
$$ 749419153 750241756 750736535 750928760 750986218 750911653 750877976 751118362 751434505 751608372 751756728
3926.1G51756728J28805M4585J39117L50714L53753J39773m0233K9445K39968K30193
$$ 751756728 751885533 751930118 752069235 752419949 752773702 752913475 752873242 752902687 753142655 753372848
3946.5G53372848R8646J22070J94967J98066J85192J47342O7115J04666K21789K04027
$$ 753372848 753471494 753593564 753788531 753986597 754171789 754319131 754386246 754490912 754712701 754916728
3966.9G54916728J02043O5624J33038J96397J62721J12414J37568J72913J43647J04010
$$ 754916728 755018771 755084395 755217433 755413830 755576551 755688965 755826533 755999446 756143093 756247103
3987.3G56247103R0718J12415J61409J60396J01984
$$ 756247103 756337821 756450236 756611645 756772041 756874025
3997.5G56874025
$$ 756874025
##END=$$ End of the data block
