##TITLE=G15-51-CE $$ Begin of the data block
##JCAMP-DX=5.00 $$ ACD/SpecManager v 10.08
##SPECTROMETER/DATA SYSTEM=Alpha
##DATE=22 Oct 2013 11:25:32
##DATA TYPE=INFRARED SPECTRUM
##DATA CLASS=XYDATA
##ORIGIN=
##OWNER=
##NPOINTS=1765
##FIRSTX=399.75695801
##LASTX=3997.56933594
##MAXX=3997.56933594
##MINX=399.75695801
##MAXY=0.79691190
##MINY=0.22729550
##XFACTOR=1.0000000000
##YFACTOR=1.000000000000000e-9
##FIRSTY=0.46681067
##DELTAX=2.03957629
##XUNITS=1/CM
##YUNITS=ARBITRARY UNITS
##XYDATA=(X++(Y..Y))
399.8D66810673k472668k226800j606494l59446N54412Q25942P39396K82019m45873
$$ 466810673 464338005 462111205 460504711 460145265 460699677 461525619 462265015 462547034 462101161
418.1D62101161j435309j943767j784057j580298j423359j378715j506179j300365
$$ 462101161 460665852 458722085 456938028 455357730 453934371 452555656 451049477 449749112
434.4D49749112p17789O5267J233757K187103K153426J289338K23100l31312m37915
$$ 449749112 449031323 449096590 450330347 452517450 454670876 455960214 456183314 455852002 455414087
452.8D55414087o85066j347870k135903k354562k186239j969665k015352k481908k794504
$$ 455414087 454729021 453381151 451245248 448890686 446704447 444734782 442719430 440237522 437443018
471.1D37443018k408445j645684j333624j386345j064747m40866k87563p75277j414448
$$ 437443018 435034573 433388889 432055265 430668920 429604173 429163307 428875744 428100467 426686019
489.5D26686019j676560j568764j604766k005279k472550k569675k312928k235920
$$ 426686019 425009459 423440695 421835929 419830650 417358100 414788425 412475497 410239577
505.8D10239577k592772l000885k941758k413451k056390k253473k447516j943380
$$ 410239577 407646805 404645920 401704162 399290711 397234321 394980848 392533332 390589952
522.1C90589952q82595K0325L47584M00842P94708J656473K508223K826393K424657
$$ 390589952 389707357 389727682 390075266 390476108 391270816 392927289 395435512 398261905 400686562
540.5D00686562J754195J236200N89579l47495j088559j305074j260161j374513j731903
$$ 400686562 402440757 403676957 404266536 403919041 402830482 401525408 400265247 398890734 397158831
558.8C97158831k084762k359837k444476k338975k233088j834810q62062M07249J586198
$$ 397158831 395074069 392714232 390269756 387930781 385697693 383862883 383000821 383408070 384994268
577.2C84994268K329737K661765K948493L149479L030330K357513J356691O28859L14444
$$ 384994268 387324005 389985770 392934263 396083742 399114072 401471585 402828276 403457135 403771579
595.6D03771579K80649K42769Q345j15156J38313M81396N60105L78669K84731O37203
$$ 403771579 404052228 404294997 404303342 404188186 404326499 404807895 405368000 405746669 406031400 406668603
616D06668603J310766J820088K045631K209961K491713K860636K873539K368361J826525
$$ 406668603 407979369 409799457 411845088 414055049 416546762 419407398 422280937 424649298 426475823
634.3D26475823J704186J813114J747489J365661R33707Q55357J003861R47028N59479
$$ 426475823 428180009 429993123 431740612 433106273 434039980 434895337 435899198 436846226 437405705
652.7D37405705J72109J55061M85033P27594N18441K22713M76539J340062J454353
$$ 437405705 437577814 437732875 438217908 438945502 439463943 439686656 440163195 441503257 442957610
671D42957610J153916J060396J248867J696437J885474J472920P95126N43952P10011
$$ 442957610 444111526 445171922 446420789 448117226 450002700 451475620 452270746 452814698 453524709
689.4D53524709N46038k74778j196205j435340q16851J09821P73847J088411J525819
$$ 453524709 454070747 453795969 452599764 451164424 450347573 450457394 451231241 452319652 453845471
707.7D53845471K364725L170878L504872L509253L724426M463941N180896N108058
$$ 453845471 456210196 459381074 462885946 466395199 470119625 474583566 479764462 484872520
724D84872520M541486M233480M316837M135429L256560K154052J477897J328945J124800
$$ 484872520 489414006 493647486 497964323 502099752 505356312 507510364 508988261 510317206 511442006
742.4E11442006M47750l65496p64191p70152q39948j278341j835168j966118j436472
$$ 511442006 511889756 511524260 510760069 509989917 509149969 507871628 506036460 504070342 502633870
760.8E02633870m88758M49359J336932K469897L903449N162656N848348N937338N635679
$$ 502633870 502145112 502594471 503931403 506401300 510304749 515467405 521315753 527253091 532888770
779.1E32888770N258203M810214M120826L223598K424002K085865K276063K570390
$$ 532888770 538146973 542957187 547078013 550301611 552725613 554811478 557087541 559657931
795.4E59657931K707005K867758L231228L512382L362298K877116K155900J498401
$$ 559657931 562364936 565232694 568463922 571976304 575338602 578215718 580371618 581870019
811.7E81870019J145482Q48771K86877n03183j301109j919628k313375k753615l246189
$$ 581870019 583015501 583864272 584151149 583647966 582346857 580427229 578113854 575360239 572114050
830.1E72114050l409922l221154l027856k953708k994538l036797k715945k057612
$$ 572114050 568704128 565482974 562455118 559501410 556506872 553470075 550754130 548696518
846.4E48696518j648963j666307j606286j236915q18074l06368Q05915K756118M983843
$$ 548696518 547047555 545381248 543774962 542538047 541719973 541413605 542219520 544975638 549959481
864.8E49959481O594062P159829O677866N358875L664910J867116j90914k484500m431665
$$ 549959481 556553543 563713372 570391238 575750113 579415023 581282139 581091225 578606725 574175060
883.1E74175060n513311n792856n757928n815506n853474n563676n074859m934907
$$ 574175060 568661749 562868893 557110965 551295459 545441985 539878309 534803450 529868543
899.4E29868543n428374o200313o771982p067203p287950p530391p568955p019431
$$ 529868543 524440169 518239856 511467874 504400671 497112721 489582330 482013375 474993944
915.8D74993944n811989m316628k992332k033979j335144q42988n60671m08620l95060
$$ 474993944 469181955 464865327 461872995 459839016 458503872 457660884 457100213 456691593 456296533
934.1D56296533m67568m66615n11110j119077k769977n256623p700682r357810j0208100
$$ 456296533 455828965 455362350 454851240 453732163 450962186 445705563 438004881 428647071 418438971
952.5D18438971j0601670j0656505j0404021j0016709r673924r407371r060591q434147
$$ 418438971 407837301 397180796 386776775 376760066 367086142 357678771 348618180 340184033
968.8C40184033p472783o335557n222529m180551l199607k321929j673042j417995
$$ 340184033 332711250 326375693 321153164 316972613 313773006 311451077 309778035 308360040
985.1C08360040j453221j508832j470834j335263j165926r55075o11365k14994L5703
$$ 308360040 306906819 305397987 303927153 302591890 301425964 300470889 299859524 299644530 299680233
1003.5B99680233m7892n27561j101345j412749j481265j510888j576811j635015j666338
$$ 299680233 299632341 299104780 298003435 296590686 295109421 293598533 292021722 290386707 288720369
1021.8B88720369j729607j878619k022267k039552j962184j895190j924067k038509
$$ 288720369 286990762 285112143 283089876 281050324 279088140 277192950 275268883 273230374
1038.1B73230374k074510j953214j751751j508594j213133q21441k90633L08574Q33898
$$ 273230374 271155864 269202650 267450899 265942305 264729172 263907731 263617098 263925672 264759570
1056.5B64759570J202792J473993J801283K089232J980096J142502k45095j257985
$$ 264759570 265962362 267436355 269237638 271326870 273306966 274449468 274204373 272946388
1072.8B72946388j180053k15203J033664K199709L148765L820091M245162M453093
$$ 272946388 271766335 271551132 272584796 274784505 277933270 281753361 285998523 290451616
1089.1B90451616M402965M110992L676802L167749K577185J933694J461119J383543
$$ 290451616 294854581 298965573 302642375 305810124 308387309 310321003 311782122 313165665
1105.4C13165665J650124K036602K363026K551883K602101K509087K279908J978278
$$ 313165665 314815789 316852391 319215417 321767300 324369401 326878488 329158396 331136674
1121.8C31136674J682311J552075J793027K355009K754331K642155K180725J546413
$$ 331136674 332818985 334371060 336164087 338519096 341273427 343915582 346096307 347642720
1138.1C47642720P94857Q3060m26323p00116p56144n97507k79009R9092N76914J287311
$$ 347642720 348437577 348520637 348094314 347394198 346638054 346040547 345761538 345860630 346437544 347724855
1158.5C47724855K149343K943606L541022L920764M236519M701495N309910N874425
$$ 347724855 349874198 352817804 356358826 360279590 364516109 369217604 374527514 380401939
1174.8C80401939O273002O568759O796390O850571O637811O141842N407512M481494
$$ 380401939 386674941 393243700 400040090 406890661 413528472 419670314 425077826 429559320
1191.1D29559320L387451K185345J004070O0797m99159p74592q63135p94471o02394
$$ 429559320 432946771 435132116 436136186 436196983 435697824 434923232 434060097 433265626 432663232
1209.5D32663232l13133m2200L8952j23769l83348o10143q69900j219689j563877j790703
$$ 432663232 432350099 432307899 432346851 432223082 431839734 431229591 430359691 429140002 427576125 425785422
1229.9D25785422j811504j605958j286626r62078n79834m6730O03258J241535J750619
$$ 425785422 423973918 422367960 421081334 420119256 419539422 419492692 420095950 421337485 423088104
1248.2D23088104K124547K378792K537072K611696K559722K395540K216638K164244
$$ 423088104 425212651 427591443 430128515 432740211 435299933 437695473 439912111 442076355
1264.5D42076355K277583K368540K270698K033174J735926J456112J229614J073449
$$ 442076355 444353938 446722478 448993176 451026350 452762276 454218388 455448002 456521451
1280.8D56521451J042009J143187J247645J130014P69407K84046k72393q26777j287639
$$ 456521451 457563460 458706647 459954292 461084306 461853713 462137759 461865366 461038589 459750950
1299.2D59750950j670509j965791k109140k065659j861066j580625j225353p59959
$$ 459750950 458080441 456114650 454005510 451939851 450078785 448498160 447272807 446512848
1315.5D46512848k03192K89023M65721J73419m76747j235038j878918k258509k359778
$$ 446512848 446309656 446598679 447064400 447237819 446761072 445526034 443647116 441388607 439028829
1333.9D39028829k197265j835853j331180q36641n88715o13868p71761r80646j232296
$$ 439028829 436831564 434995711 433664531 432827890 432239175 431625307 430853546 429872900 428640604
1352.2D28640604j528829j828671k059489k349228k879411l444642l749728l717691
$$ 428640604 427111775 425283104 423223615 420874387 417994976 414550334 410800606 407082915
1368.5D07082915l163099k683490k803445l118635l415763l672361l600240l058314
$$ 407082915 403919816 401236326 398432881 395314246 391898483 388226122 384625882 381567568
1384.9C81567568k244920j264363m55976j40697j28597o8486J14471N02974J045048
$$ 381567568 379322648 378058285 377602309 377461612 377333015 377264529 377379000 377881974 378927022
1403.2C78927022J502305J653761J623839J664281J751483J858949K032489K283901
$$ 378927022 380429327 382083088 383706927 385371208 387122691 388981640 391014129 393298030
1419.5C93298030K283454K229482K136975J690895J024425L71098r2000n09798o51479
$$ 393298030 395581484 397810966 399947941 401638836 402663261 403034359 402942359 402432561 401781082
1437.9D01781082k34365K21461N15103O76006O31243L89666J96695M60714J473159
$$ 401781082 401546717 401768178 402283281 402959287 403590530 403980196 404176891 404637605 406110764
1456.2D06110764K679854K809882K703429L069371L673076M454553O020636Q344203
$$ 406110764 408790618 411600500 414303929 417373300 421046376 425500929 431521565 439865768
1472.6D39865768Q914500P508785N951285M352808K803326J296520k14517j991510
$$ 439865768 448780268 456289053 462240338 466593146 469396472 470692992 470478475 468486965
1488.9D68486965l670097m278868m934937o176740o361693n702764n414665o971925
$$ 468486965 464816868 460538000 455603063 449426323 443064630 437361866 431947201 424975276
1505.2D24975276j0152072r324699p685006p465839o515563m652023k726555k136469
$$ 424975276 414823204 405498505 397813499 390347660 383832097 379180074 376453519 374317050
1521.5C74317050k362639k529829k675146k304107k068013k196521j660049r94593
$$ 374317050 371954411 369424582 366749436 364445329 362377316 360180795 358520746 357526153
1537.8C57526153r24557m62264M93378J261562K036631K926916L679424M159242M327446
$$ 357526153 356601596 356139332 356632710 357894272 359930903 362857819 366537243 370696485 375023931
1556.2C75023931N163521N860537M334808L619015L550946L328920L141701K554059
$$ 375023931 380187452 386047989 390382797 394001812 397552758 400881678 404023379 406577438
1572.5D06577438K027959J709282J198083P58469M01736R8467k68311o86079j168549
$$ 406577438 408605397 410314679 411512762 412271231 412672967 412771434 412503123 411817044 410648495
1590.9D10648495j662433k295584l013700l732383m484087n215466n973101o866932
$$ 410648495 408986062 406690478 403676778 399944395 395460308 390244842 384271741 377404809
1607.2C77404809p913142q478284q475393r450674j1323423j0425359r910971j1535644
$$ 377404809 369491667 361013383 352537990 343087316 331763893 321338534 311427563 299891919
1623.5B99891919j1581779j0762810j0273159q915812q101940q381247o225393l218993
$$ 299891919 288310140 277547330 267274171 258358359 250256419 241875172 235649779 232430786
1639.8B32430786j601890n41925L44529J178205J537368K034396L090233L281757L451094
$$ 232430786 230828896 230286971 230631500 231809705 233347073 235381469 238471702 241753459 245204553
1658.2B45204553M339695N510166O344915O360918P142633Q288980P891595Q196056
$$ 245204553 249544248 255054414 261399329 267760247 274902880 283191860 291083455 299279511
1674.5B99279511R091347Q760989Q474678R557515J2134165J1822164J0772139J1936992
$$ 299279511 308370858 317131847 325606525 335164040 347298205 359120369 369892508 381829500
1690.8C81829500J2639076J5059143J7424583J7484606J8800735J5679658J2922167
$$ 381829500 394468576 409527719 426952302 444436908 463237643 478917301 491839468
1705.1D91839468J2643219J0899841R194494P967412P132292O996691O240487M832924
$$ 491839468 504482687 515382528 524577022 532544434 539676726 546673417 552913904 557746828
1721.4E57746828M023790L614783L205955K939821K565920K382219K380669K384305
$$ 557746828 561770618 565385401 568591356 571531177 574097097 576479316 578859985 581244290
1737.7E81244290K835095L409922L879070M584611N568564O781280P513940P044017
$$ 581244290 584079385 587489307 591368377 595952988 601521552 608302832 615816772 622860789
1754F22860789O820083O957591O746232O688714O083489N388796N261302N127132N002379
$$ 622860789 629680872 636638463 643384695 650073409 656156898 661545694 666806996 671934128 676936507
1772.4F76936507M489660L694296L429115L431022L199757K809286K520978K392948
$$ 676936507 681426167 685120463 688549578 691980600 695180357 697989643 700510621 702903569
1788.7G02903569K385854K466798K251149J946151J880646J999080K030790J837849
$$ 702903569 705289423 707756221 710007370 711953521 713834167 715833247 717864037 719701886
1805G19701886J626551J599133J739443J739144J563549J391888J405835J499176J484275
$$ 719701886 721328437 722927570 724667013 726406157 727969706 729361594 730767429 732266605 733750880
1823.4G33750880J363039J210749J185715J307130J339376J147866R66013R72032J038015
$$ 733750880 735113919 736324668 737510383 738817513 740156889 741304755 742270768 743242800 744280815
1841.7G44280815J006723R08255P93517P81595Q92103R19700Q10683O87420O80745
$$ 744280815 745287538 746195793 746989310 747770905 748663008 749582708 750393391 751080811 751761556
1860.1G51761556P20918P25031O43432N45978N96762P10845P27296O58810O10113O21975
$$ 751761556 752482474 753207505 753850937 754396915 754993677 755704522 756431818 757090628 757700741 758322716
1880.5G58322716O96182P40111O88493O09994O02782O23286N83887N39303N25236N40435
$$ 758322716 759018898 759759009 760447502 761057496 761660278 762283564 762867451 763406754 763931990 764472425
1900.9G64472425N39482M99785M30226L80874L93033M10735L75688L20256L63410M17172
$$ 764472425 765011907 765511692 765941918 766322792 766715825 767126560 767502248 767822504 768185914 768603086
1921.3G68603086L93928L50177K97248K69711L05534L21149K53082K16484K32935K50876
$$ 768603086 768997014 769347191 769644439 769914150 770219684 770540833 770793915 771010399 771243334 771494210
1941.7G71494210K70426K53439K07603K34544L20554L50475K98858K38001K59161L25084
$$ 771494210 771764636 772018075 772225678 772460222 772780776 773131251 773430109 773668110 773927271 774252355
1962.1G74252355L46422K62857J72853J92464K63273K86579K20538J40905J36972K10583
$$ 774252355 774598777 774861634 775034487 775226951 775490224 775776803 775997341 776138246 776275218 776485801
1982.5G76485801K34186J51694N6625O5446J66237K10106J29402K8610L0697Q1062
$$ 776485801 776719987 776871681 776928306 776993752 777159989 777370095 777499497 777528107 777558804 777639866
2002.8G77639866O4731m8697j45793j37270p1347o8545j71721l00288l23653k09988
$$ 777639866 777704597 777655900 777510107 777372837 777301490 777232945 777061224 776760936 776437283 776227295
2023.2G76227295j65104k68639l63946l20732k27392k12610k62558l08275k76506j66834
$$ 776227295 776062191 775793552 775429606 775108874 774881482 774668872 774406314 774098039 773821533 773654699
2043.6G73654699p2956r8884j51634j19150j4722P3492P2420K3305M18L9398J23263
$$ 773654699 773581743 773482859 773331225 773212075 773197353 773270845 773343265 773366570 773366988 773406386 773529649
2066.1G73529649J70111J18316O9081P7725J30772J72377J12772J5915J6808R5964
$$ 773529649 773699760 773818076 773887157 773964882 774095654 774268031 774380803 774396718 774413526 774509490
2086.5G74509490J51693J74582J58012J40429J57535J83880J70708J26839J23977J73748
$$ 774509490 774661183 774835765 774993777 775134206 775291741 775475621 775646329 775773168 775897145 776070893
2106.9G76070893K31981K08616J05441M8995J11639J85550J56820O2763K3008R0122
$$ 776070893 776302874 776511490 776616931 776665926 776777565 776963115 777119935 777182698 777205706 777295828
2127.3G77295828J77979J83344R4116K1100N8949J71959K16008J23620J2874M2379
$$ 777295828 777473807 777657151 777751267 777772367 777831316 778003275 778219283 778342903 778355777 778398156
2147.7G78398156J97709K83777J96875P4625J18553L05593M25041L58760K43962K88069
$$ 778398156 778595865 778879642 779076517 779151142 779269695 779575288 780000329 780359089 780603051 780891120
2168G80891120M81666O11722N34773L60727L23057M73500N87403N32508L88742L21567
$$ 780891120 781372786 781984508 782519281 782880008 783203065 783676565 784263968 784796476 785185218 785506785
2188.4G85506785M48882N83947M88103K95102K77758M15742N19812M76122L11911K43783
$$ 785506785 785955667 786539614 787027717 787322819 787600577 788016319 788536131 789012253 789324164 789567947
2208.8G89567947L82543N23269M84646L24487K23994K97845M29988M23252K65420J20103
$$ 789567947 789950490 790473759 790958405 791282892 791506886 791804731 792234719 792657971 792923391 793043494
2229.2G93043494J39475K87175L53575K42233R2626Q1539K07186K75254J78337L6597
$$ 793043494 793182969 793470144 793823719 794065952 794158578 794240117 794447303 794722557 794900894 794937491
2249.6G94937491K3783J54614K51770J86443L5584J014J46210K76029K00152K1220
$$ 794937491 794961274 795115888 795367658 795554101 795589685 795590699 795736909 796012938 796213090 796234310
2270G96234310j6988J27554K48611J52171l6299p0095O5148J53422N4061j31428j82509
$$ 796234310 796217322 796344876 796593487 796745658 796709359 796639264 796704412 796857834 796911895 796780467 796597958
2292.5G96597958j6570J30653M1306j74046k49385j14322J7762n5552k39789l01421
$$ 796597958 796581388 796712041 796753347 796579301 796329916 796215594 796233356 796177804 795938015 795636594
2312.9G95636594j90675m2379n9545k65598m17531l42965j33276j3888j53839l59357
$$ 795636594 795445919 795403540 795343995 795078397 794660866 794317901 794184625 794170737 794016898 793657541
2333.3G93657541l66270k80500k84910l63111l78311k66612j10745j22964l14177m93824
$$ 793657541 793291271 793010771 792725861 792362750 791984439 791717827 791607082 791484118 791169941 790676117
2353.6G90676117m93705m18842l21806k72214l52800l36289k13683j80960k23398k35140
$$ 790676117 790182412 789763570 789441764 789169550 788816750 788480461 788266778 788085818 787862420 787627280
2374G87627280k23339j45495l8206q0407k39074l34382l21985k94864l35872m59731
$$ 787627280 787403941 787258446 787220240 787139833 786900759 786566377 786244392 785949528 785613656 785153925
2394.4G85153925n50031m98176l89278l95834n56112o68227o01590m97460n31793o73056
$$ 785153925 784603894 784105718 783716440 783320606 782764494 782096267 781494677 780997217 780465424 779792368
2414.8G79792368p52806o96659o23525o61432p65443q32796p95424p07388o99759p71939
$$ 779792368 779039562 778342903 777719378 777057946 776292503 775459707 774664283 773956895 773257136 772485197
2435.2G72485197q36730q47698p93814p34091p78437q76605q67427p70211p24494p52211
$$ 772485197 771648467 770800769 770006955 769272864 768494427 767617822 766750395 765980184 765255690 764503479
2455.6G64503479q13246q42094p72536o94871p15375p77662q00788p72595p25389p28250
$$ 764503479 763690233 762848139 762075603 761380732 760665357 759887695 759086907 758314312 757588923 756860673
2476G56860673p65919p71761p39396o99520o97017p15971p20739o82294o28710o45518
$$ 756860673 756094754 755322993 754583597 753884077 753187060 752471089 751750350 751068056 750439346 749793828
2496.4G49793828o91295o97673o82532o64890o46830o39617o59585o66261o39617o33240
$$ 749793828 749102533 748404860 747722328 747057438 746410608 745770991 745111406 744445145 743805528 743172288
2516.8G43172288o54936o86467p29680p50780p23719p05839p50899q12054q34763q35895
$$ 743172288 742517352 741830885 741101205 740350425 739626706 738920867 738169968 737357914 736523151 735687256
2537.2G35687256q24809q06332q27908q54195p98225p13885p01487p64668q15213p77006
$$ 735687256 734862447 734056115 733228207 732374012 731575787 730861902 730160415 729395747 728580534 727803528
2557.6G27803528p07924p11620p86304q16644p60972o98626o74725p27534q17299p96199
$$ 727803528 727095604 726383984 725597680 724781036 724020064 723321438 722646713 721919179 721101880 720305681
2578G20305681o78539o33657p29322q51155q40366p15017o22153o63817p85530q15987
$$ 720305681 719627142 718993485 718264163 717413008 716572642 715857625 715235472 714571655 713786125 712970138
2598.4G12970138p47145p23064q15033r44138r62377q98957r03428j021087j144886
$$ 712970138 712222993 711499929 710684896 709740758 708778381 707879424 706975996 705954909 704810023
2616.8G04810023j151859j108885j138270j232863j343369j391530j312435j233518
$$ 704810023 703658164 702549279 701411009 700178146 698834777 697443247 696130812 694897294
2633.1F94897294j300216j424968j436591j328766j246095j280427j385272j436770
$$ 694897294 693597078 692172110 690735519 689406753 688160658 686880231 685494959 684058189
2649.4F84058189j384377j300037j290917j372755j415133j316548j178205j188040
$$ 684058189 682673812 681373775 680082858 678710103 677294970 675978422 674800217 673612177
2665.7F73612177j301825j319647j235425j161993j134157j187384j287699j252651
$$ 673612177 672310352 670990705 669755280 668593287 667459130 666271746 664984047 663731396
2682F63731396j084268j008212j099349j198947j198530j141727j123250j187980j281142
$$ 663731396 662647128 661638916 660539567 659340620 658142090 657000363 655877113 654689133 653407991
2700.4F53407991j327455j311600j300991j353383j430452j431942j359105j328945
$$ 653407991 652080536 650768936 649467945 648114562 646684110 645252168 643893063 642564118
2716.7F42564118j375973j408577j359999j290203j246154j219273j212060j202583
$$ 642564118 641188145 639779568 638419569 637129366 635883212 634663939 633451879 632249296
2733F32249296j154125j085162j081884j137614j159847j119077j038432j004339j071989
$$ 632249296 631095171 630010009 628928125 627790511 626630664 625511587 624473155 623468816 622396827
2751.4F22396827j141489j104295r95636r54390j022577j104236j122474j078546j058758
$$ 622396827 621255338 620151043 619155407 618201017 617178440 616074204 614951730 613873184 612814426
2769.7F12814426j118004j188576j210332j204312j238167j347721j466572j529753
$$ 612814426 611696422 610507846 609297514 608093202 606855035 605507314 604040742 602510989
2786F02510989j551390j545846j580179j688898j761973j748562j746594j832247j960933
$$ 602510989 600959599 599413753 597833574 596144676 594382703 592634141 590887547 589055300 587094367
2804.4E87094367k057732k089262k064108k081573k212525k321958k327621k361477
$$ 587094367 585036635 582947373 580883265 578801692 576589167 574267209 571939588 569578111
2820.7E69578111k478480k626598k756596k824127k894760l087043l368557l677308
$$ 569578111 567099631 564473033 561716437 558892310 555997550 552910507 549541950 545864642
2837E45864642m083932m660427n421818o264269o924987p098496o545543n294860l776848
$$ 545864642 541780710 537120283 531698465 525434196 518509209 511410713 504865170 499570310 495793462
2855.4D95793462k547264j967192k123833k781331l586829m233748m427910m115611
$$ 495793462 493246198 491279006 489155173 486373842 482787013 478553265 474125355 470009744
2871.7D70009744l487050k735049k014667j460075j166105j135439j261532j429022
$$ 470009744 466522694 463787645 461772978 460312903 459146798 458011359 456749827 455320805
2888D55320805j572698j691192j832068k058000k348870k582729k750277k989501l407508
$$ 455320805 453748107 452056915 450224847 448166847 445817977 443235248 440484971 437495470 434087962
2906.4D34087962l932297m442811m964739n454600n747140n739122n330921m483163
$$ 434087962 430155665 425712854 420748115 415293515 409546375 403807253 398476332 393993169
2922.7C93993169l329903k043724p57456M69476J679838K847522L835351M527032M863054
$$ 393993169 390663266 388619542 387862086 388331562 390011400 392858922 396694273 401221305 406084359
2941D06084359M814505M374355L601790K694666J911134J373827J145601J331956J860827
$$ 406084359 410898864 415273219 418875009 421569675 423480809 424854636 426000237 427332193 429193020
2959.4D29193020K533465L297747M119754M840105N377889N793542O077587O157190
$$ 429193020 431726485 435024232 439143986 443984091 449361980 455155522 461233109 467390299
2975.7D67390299O053209N814850N434812M946470M430979L928423L392011K769590
$$ 467390299 473443508 479258358 484693170 489639640 494070619 497999042 501391053 504160643
2992E04160643K112984J468480Q22604J93834l92139r00984j252711j380801j309275
$$ 504160643 506273627 507742107 508564711 508758545 508366406 507465422 506212711 504831910 503522635
3010.4E03522635j190842j107216j034140j066536j260221j544177j853586k065628
$$ 503522635 502331793 501224577 500190437 499123901 497863680 496319503 494465917 492400289
3026.7D92400289k100975k082914k127737k204656k287895k380490k440453k479404
$$ 492400289 490299314 488216400 486088663 483884007 481596112 479215622 476775169 474295765
3043D74295765k544224k598316k608090k593070k602399k657980k661466k543956k391160
$$ 474295765 471751541 469153225 466545135 463952065 461349666 458691686 456030220 453486264 451095104
3061.4D51095104k271145k164871k036542j889467j785964j747906j726061j671135
$$ 451095104 448823959 446659088 444622546 442733079 440947115 439199209 437473148 435802013
3077.7D35802013j587987j509577j456589j416951j345009j250923j216620j240045
$$ 435802013 434214026 432704449 431247860 429830909 428485900 427234977 426018357 424778312
3094D24778312j230806j196354j220823j284986j340241j395255j443714j474857j487732
$$ 424778312 423547506 422351152 421130329 419845343 418505102 417109847 415666133 414191276 412703544
3112.4D12703544j509100j563818j645237j747310j819342j821250j829505j894653
$$ 412703544 411194444 409630626 407985389 406238079 404418737 402597487 400767982 398873329
3128.7C98873329j946658j970350j987339k000689k035558k072811k091766k139777
$$ 398873329 396926671 394956321 392968982 390968293 388932735 386859924 384768158 382628381
3145C82628381k203494k198249k154499k148062k176732k210915k235502k248288k235829
$$ 382628381 380424887 378226638 376072139 373924077 371747345 369536430 367300928 365052640 362816811
3163.4C62816811k203137k195507k217412k237678k245665k239525k230197k210766
$$ 362816811 360613674 358418167 356200755 353963077 351717412 349477887 347247690 345036924
3179.7C45036924k205402k219915k224118k183288k097458k069115k088011k086758
$$ 345036924 342831522 340611607 338387489 336204201 334106743 332037628 329949617 327862859
3196C27862859k064049j990647j912415j905530j884342j805156j777113j808434j816452
$$ 327862859 325798810 323808163 321895748 319990218 318105876 316300720 314523607 312715173 310898721
3214.3C10898721j774877j722425j707018j733720j780242j802116j774609j764894
$$ 310898721 309123844 307401419 305694401 303960681 302180439 300378323 298603714 296838820
3230.7B96838820j795262j854569j957744k034247k042741k036005k076268k151519
$$ 296838820 295043558 293188989 291231245 289196998 287154257 285118252 283041984 280890465
3247B80890465k187163k190679k215207k238363k246260k246738k229959k211332k165943
$$ 280890465 278703302 276512623 274297416 272059053 269812793 267566055 265336096 263124764 260958821
3265.3B60958821k075196j961022j825512j700908j603991j501858j372054j231939
$$ 260958821 258883625 256922603 255097091 253396183 251792192 250290334 248918280 247686341
3281.6B47686341j124009j029283r10088p93517p11024o35296n21272m01795l47629
$$ 247686341 246562332 245533049 244622961 243829444 243118420 242483124 241961852 241560057 241212428
3300B41212428l24950k70784k40505k46405k09242j40071j12683j20461j01358o8798
$$ 241212428 240887478 240616694 240376189 240129784 239920542 239780471 239667788 239547327 239445969 239377171
3320.4B39377171q7708j29000j37850j50741j55672j40369j47551j74821k19240k59713
$$ 239377171 239289463 239160463 239022613 238871872 238716200 238575831 238428280 238253459 238034219 237774506
3340.8B37774506k77221l22729l94374l97355l55124l95567m84958m67583l86805m04402
$$ 237774506 237497285 237174556 236780182 236382827 236027703 235632136 235147178 234679595 234292790 233888388
3361.2B33888388m61623m45158m24966m60908n40167n73829m73916l46914l28988m09499
$$ 233888388 233426765 232981607 232556641 232095733 231555566 230981737 230507821 230160907 229831919 229422420
3381.6B29422420m34026l20136j42828o3971j65939k87190k59027j05917J7941m1485
$$ 229422420 228988394 228668258 228525430 228461459 228295520 228008330 227749303 227643386 227661327 227619842
3402B27619842j89528j34811N1439J30042J23084J10194J18673J69173K66418L69846
$$ 227619842 227430314 227295503 227346942 227476984 227600068 227710262 227828935 227998108 228264526 228634372
3422.4B28634372M73991N95212O82161O83650P46518Q74505Q31783O71044O69568Q56221
$$ 228634372 229108363 229703575 230385736 231069386 231815904 232690409 233522192 234193236 234862804 235719025
3442.8B35719025J037583J096487J056701J076028J167476J255363J340643J399293
$$ 235719025 236756608 237853095 238909796 239985824 241153300 242408663 243749306 245148599
3459.1B45148599J378954J401364J578167J701281J569241J323641J319021J547575
$$ 245148599 246527553 247928917 249507084 251208365 252777606 254101247 255420268 256967843
3475.4B56967843J784414J846283J732469J747161J905382J932084J856864J847178
$$ 256967843 258752257 260598540 262331009 264078170 265983552 267915636 269772500 271619678
3491.7B71619678J887738J948208J983225K034724K069592J978815J929402K043069
$$ 271619678 273507416 275455624 277438849 279473573 281543165 283521980 285451382 287494451
3508B87494451K158940K252727K300918K211094K173931K292871K468020K454787K278686
$$ 287494451 289653391 291906118 294207036 296418130 298592061 300884932 303352952 305807739 308086425
3526.4C08086425K285063K472610K640575K721458K649576K573609K744317K948046
$$ 308086425 310371488 312844098 315484673 318206131 320855707 323429316 326173633 329121679
3542.7C29121679K966315K839118K775252K877682L045201L129781L125220L211558
$$ 329121679 332087994 334927112 337702364 340580046 343625247 346755028 349880248 353091806
3559C53091806L325463L312259L300697L570855L844857L770322L692865L821850L954321
$$ 353091806 356417269 359729528 363030225 366601080 370445937 374216259 377909124 381730974 385685295
3577.4C85685295M053235M188567M237831M204869M278422M393011M318446M321247
$$ 385685295 389738530 393927097 398164928 402369797 406648219 411041230 415359676 419680923
3593.7D19680923M501581M627109M617929M630685M659653M577607M613489M727125
$$ 419680923 424182504 428809613 433427542 438058227 442717880 447295487 451908976 456636101
3610D56636101M768044M804879M705340M725575M995734M946798M693806M512131M676670
$$ 456636101 461404145 466209024 470914364 475639939 480635673 485582471 490276277 494788408 499465078
3628.4D99465078N014509M780352M609347M640042M560829M500866M517257M434883
$$ 499465078 504479587 509259939 513869286 518509328 523070157 527571023 532088280 536523163
3644.7E36523163M275322M390002M588961M311800M014254M148125M211247L937483
$$ 536523163 540798485 545188487 549777448 554089248 558103502 562251627 566462874 570400357
3661E70400357L720165L685593L510177L285408L400147L290415K979755L031493L034174
$$ 570400357 574120522 577806115 581316292 584601700 588001847 591292262 594272017 597303510 600337684
3679.4F00337684K949178K989769K906084K630651K356172K341270K392233K257287
$$ 600337684 603286862 606276631 609182715 611813366 614169538 616510808 618903041 621160328
3695.7F21160328K045274J857937J801908J926839J946211J727879J458645J382768
$$ 621160328 623205602 625063539 626865447 628792286 630738497 632466376 633925021 635307789
3712F35307789J596927J670301J542330J419008J317441J175046J124025J356363J463294
$$ 635307789 636904716 638575017 640117347 641536355 642853796 644028842 645152867 646509230 647972524
3730.3F47972524J266182J012027R86934J250922J293421Q25167O23464J243890J262545
$$ 647972524 649238706 650250733 651237667 652488589 653782010 654607177 655230641 656474531 657737076
3748.7F57737076O63996O92308J196325J268506R94742R33707J008093R24170Q32736
$$ 657737076 658401072 659093380 660289705 661558211 662552953 663486660 664494753 665418923 666251659
3767.1F66251659P63476P70510Q89718R63390R31561Q02636P38978O83845O25670P33196
$$ 666251659 667015135 667785645 668675363 669638753 670570314 671372950 672111928 672795773 673421443 674154639
3787.5F74154639Q60930Q53359P03931O03080P04944O01530M21524O49035O24836M98652
$$ 674154639 675015569 675868928 676572859 677175939 677880883 678482413 678903937 679552972 680177808 680676460
3807.8F80676460P72119R36746O79493M11392N41806M41551L31760N96344O66320O51658
$$ 680676460 681448579 682385325 683064818 683476210 684018016 684459567 684791327 685387671 686053991 686705649
3828.2F86705649N96106N41449N93006L90411J95801M39823N65588N17428O48260P57575
$$ 686705649 687301755 687843204 688436210 688826621 689022422 689462245 690027833 690545261 691193521 691951096
3848.6F91951096L91603m11332k36452P84040R27150N99861L52919L63946M14849K56717
$$ 691951096 692342699 691931367 691694915 692478955 693406105 694005966 694358885 694722831 695137680 695394397
3869F95394397K68578L75212L74913M40836L74555L77000M31537K37465K39253L15190
$$ 695394397 695662975 696038187 696413100 696853936 697228491 697605491 698037028 698274493 698513746 698828936
3889.4F98828936J86443K56062M09543K68757N2095N0187J29402K70485L79384L43561
$$ 698828936 699015379 699271441 699680984 699949741 700001836 700052023 700181425 700451910 700831294 701174855
3909.8G01174855L47376L03269Q5651J2577J69277J87993R1493J40608K38120J91570
$$ 701174855 701522231 701825500 701911151 701923728 702093005 702280998 702372491 702513099 702751219 702942789
3930.2G02942789J28865J89841K12073J50502J45852J99378J86443J26660J42515J91211
$$ 702942789 703071654 703261495 703473568 703624070 703769922 703969300 704155743 704282403 704424918 704616129
3950.6G04616129J95623J74761J44958J48893J86085J85490J50621J42515J47342J13964
$$ 704616129 704811752 704986513 705131471 705280364 705466449 705651939 705802560 705945075 706092417 706206381
3971G06206381J11699J56880J36137Q5890J16527J81675J43588O4850J16169J98066
$$ 706206381 706318080 706474960 706611097 706696987 706813514 706995189 707138777 707203627 707319796 707517862
3991.4G07517862K07186J99795J59442
$$ 707517862 707725048 707924843 708084285
3997.5G08084285
$$ 708084285
##END=$$ End of the data block
