##TITLE=G15-51-CE $$ Begin of the data block
##JCAMP-DX=5.00 $$ ACD/SpecManager v 10.08
##SPECTROMETER/DATA SYSTEM=Alpha
##DATE=22 Oct 2013 11:25:32
##DATA TYPE=INFRARED SPECTRUM
##DATA CLASS=XYDATA
##ORIGIN=
##OWNER=
##NPOINTS=1765
##FIRSTX=399.75695801
##LASTX=3997.56933594
##MAXX=3997.56933594
##MINX=399.75695801
##MAXY=0.79769146
##MINY=0.22736590
##XFACTOR=1.0000000000
##YFACTOR=1.000000000000000e-9
##FIRSTY=0.46474600
##DELTAX=2.03957629
##XUNITS=1/CM
##YUNITS=ARBITRARY UNITS
##XYDATA=(X++(Y..Y))
399.8 464745998 462191761 460402757 459131241 458497345 458709836 459564626 460343122 460622907 460177243
418.1 460177243 458789587 457078815 455648601 454272777 452862054 451552778 450180680 448983610
434.4 448983610 448414624 448567361 449570537 451364219 453296125 454672009 455178946 455168784 455088258
452.8 455088258 454694152 453357965 450911611 448172688 445827246 443962574 441973001 439466715 436814994
471.1 436814994 434405267 432666689 431455195 430194944 429005116 428368181 428128749 427579671 426251769
489.5 426251769 424367428 422522247 420892209 419171900 417089969 414575279 411890477 409418046
505.8 409418046 407000542 404197365 401200414 398662060 396570325 394363314 392040342 390264273
522.1 390264273 389466643 389450222 389717907 390044957 390825748 392562807 395203710 398062885 400432557
540.5 400432557 402149767 403281391 403850943 403695583 402695179 401239604 399831265 398466438 396780252
558.8 396780252 394651592 392208248 389679313 387279510 385045350 383278668 382562160 383100897 384694546
577.2 384694546 386986762 389642090 392598897 395795792 398857266 401225924 402555346 403055251 403361440
595.6 403361440 403846085 404248089 404211104 403972477 404059529 404560179 405226767 405799270 406251013 406923234
616 406923234 408170044 409948200 411942512 414086670 416689068 419719458 422518611 424739927 426587582
634.3 426587582 428297698 430039138 431749612 433079720 434066415 435096741 436264366 437290013 437807173
652.7 437807173 437876970 437995672 438509405 439199656 439618915 439821720 440369427 441699922 443070114 444238424
673.1 444238424 445411980 446755767 448509097 450484961 451994389 452736288 453208059 453844219 454329789
691.4 454329789 454038799 452870548 451454341 450652033 450776756 451549768 452664882 454218626 456565887
709.8 456565887 459744841 463300794 466816396 470512390 474957615 480135381 485278875 489913672
726.1 489913672 494274646 498636752 502710819 505888224 507965207 509413004 510752261 511859894
742.4 511859894 512308717 511948168 511112750 510248482 509402215 508220315 506457508 504485548 503077090
760.8 503077090 502621233 502975881 504161298 506583273 510561705 515835822 521763444 527750552 533416271
779.1 533416271 538657248 543410301 547410786 550508142 552998066 555263281 557582080 560057163
795.4 560057163 562695682 565592229 568846107 572374165 575781763 578638136 580772400 582304537
811.7 582304537 583417416 584199429 584478974 583944321 582630515 580814779 578506410 575622261 572345197
830.1 572345197 568957508 565695107 562594831 559556484 556538403 553612232 551026344 548961043
846.4 548961043 547213852 545496643 543864310 542558730 541702449 541430175 542297304 545103312 550052464
864.8 550052464 556565464 563727379 570463240 575844407 579455256 581226408 581002235 578547120 574112356
883.1 574112356 568583250 562825501 557080865 551180005 545211613 539628327 534632266 529778779
899.4 529778779 524379373 518146694 511299372 504167557 496863276 489319772 481709391 474654734
915.8 474654734 468852729 464601874 461686075 459719390 458427548 457578182 457019061 456627786 456220120
934.1 456220120 455747306 455301166 454783469 453610033 450771868 445471048 437775850 428451031 418256789
952.5 418256789 407664329 397020310 386604935 376566231 366887242 357484341 348420680 339995980
968.8 339995980 332567483 326272666 321037859 316808522 313584447 311273038 309612036 308221877
985.1 308221877 306799114 305298448 303844124 302525133 301381379 300455600 299835593 299604148 299636006
1003.5 299636006 299550116 298980892 297883153 296474248 294975191 293458641 291881204 290232033 288562417
1021.8 288562417 286876589 285074174 283082187 281007737 278995454 277050257 275088429 273045748
1038.1 273045748 271008104 269104362 267371327 265848458 264618695 263794482 263514102 263848662 264674723
1056.5 264674723 265825301 267277956 269105136 271245241 273260772 274393201 274140209 272876292
1072.8 272876292 271653414 271408409 272460401 274682581 277842641 281696856 285980552 290425241
1089.1 290425241 294780761 298859984 302538484 305705220 308281094 310245603 311747998 313119739
1105.4 313119739 314734310 316802233 319212526 321739852 324303001 326847076 329209745 331242770
1121.8 331242770 332931429 334477037 336272806 338612407 341350496 344001681 346154481 347648829
1138.1 347648829 348455995 348584563 348156303 347406834 346634716 346090049 345843226 345920563 346488744 347779155
1158.5 347779155 349920332 352865368 356411725 360332042 364560664 369254053 374573648 380461633
1174.8 380461633 386713505 393215299 399966538 406825453 413457781 419574022 424985558 429504424
1191.1 429504424 432934344 435135663 436132133 436157197 435576499 434744358 433895111 433134586 432561576
1209.5 432561576 432264000 432198048 432199061 432081252 431728423 431109756 430233240 429055601 427529007 425736874
1229.9 425736874 423910737 422304451 421042293 420114338 419538945 419471055 420069635 421320975 423076510
1248.2 423076510 425193191 427569747 430120915 432740808 435311496 437731445 439970016 442134142
1264.5 442134142 444388658 446750194 449030876 451056540 452786475 454242676 455458045 456522048
1280.8 456522048 457576334 458743691 460005730 461153567 461954266 462253362 461989164 461166233 459852248
1299.2 459852248 458146036 456171662 454080611 452027142 450166404 448594749 447381258 446629167
1315.5 446629167 446434706 446723610 447179496 447349370 446865827 445612729 443722308 441458762 439094186
1333.9 439094186 436897695 435079426 433769733 432922959 432308614 431687415 430912316 429924428 428705424
1352.2 428705424 427194387 425372571 423328221 420983523 418084681 414605349 410815120 407082796
1368.5 407082796 403927386 401236713 398417950 395306796 391914815 388257354 384653360 381580621
1384.9 381580621 379330456 378074259 377623141 377481014 377347648 377275258 377407074 377956837 379037797
1403.2 379037797 380542070 382207096 383859754 385530084 387270093 389112651 391110539 393366575
1419.5 393366575 395651996 397883445 400024235 401725709 402743489 403098434 402992219 402470469 401838005
1437.9 401838005 401623785 401829630 402325273 402990878 403630614 404059798 404268950 404682785 406099886
1456.2 406099886 408786595 411635667 414337367 417361945 421012819 425485522 431514025 439841747
1472.6 439841747 448727816 456210881 462171108 466563672 469367027 470585495 470253646 468167454
1488.9 468167454 464485079 460225761 455271363 449087352 442760557 437068164 431623548 424620152
1505.2 424620152 414492071 405229717 397603691 390188396 383690625 379035294 376306742 374179065
1521.5 374179065 371870369 369432449 366842061 364568412 362500101 360331267 358702481 357703656
1537.8 357703656 356788337 356384546 356919557 358218640 360321581 363324136 367038637 371155232 375369191
1556.2 375369191 380429834 386330396 390761793 394435704 397983223 401275456 404404789 406958073
1572.5 406958073 408966660 410651684 411847919 412615418 412997007 413042516 412734628 412049681 410900712
1590.9 410900712 409227371 406889319 403846830 400115550 395640701 390420705 384442389 377586812
1607.2 377586812 369704813 361276388 352835923 343363106 331992686 321547836 311623603 300079316
1623.5 300079316 288501799 277755886 267492056 258561879 250440270 242047325 235823259 232608557
1639.8 232608557 231002137 230454475 230818868 232033610 233580187 235583588 238654986 241976053 245459497
1658.2 245459497 249806076 255329400 261707544 268062651 275122225 283347607 291276574 299512565
1674.5 299512565 308585972 317305684 325734824 335274309 347449332 359329194 370129973 382047832
1690.8 382047832 394621164 409605831 426975161 444417566 463238895 478986472 491957277
1705.1 491957277 504645824 515585303 524795592 532773852 539908767 546886861 553154111 558041155
1721.4 558041155 562094927 565731406 568943679 571858943 574382186 576754630 579189420 581610441
1737.7 581610441 584453106 587903500 591848135 596445203 601969123 608736336 616280794 623329520
1754 623329520 630110681 637018263 643728912 650422812 656552076 661964715 667211771 672311664 677298129
1772.4 677298129 681811154 685538411 688971877 692394495 695600986 698427796 700972974 703372836
1788.7 703372836 705722511 708150327 710392356 712326288 714199424 716235280 718318224 720171571
1805 720171571 721790135 723374963 725099981 726835787 728394568 729796708 731236994 732749999 734212935
1823.4 734212935 735559642 736772299 737954438 739263237 740602255 741728604 742692351 743692756
1839.7 743692756 744733930 745724797 746657014 747492969 748291492 749161303 750037849 750827491 751521707
1858 751521707 752221286 752975345 753727257 754356086 754868865 755460501 756191850 756935179 757599413 758221447
1878.4 758221447 758844852 759514093 760227859 760906398 761508107 762124717 762795031 763416886 763970852 764501691
1898.8 764501691 765044093 765569091 766017795 766384006 766734362 767150283 767610013 768005252 768306971 768643558
1919.2 768643558 769049525 769471288 769854903 770143509 770408690 770741463 771065295 771294653 771512926 771763980
1939.6 771763980 772020400 772294819 772554517 772768259 773010492 773332298 773683965 773975015 774175227 774414480
1960 774414480 774768233 775123358 775350869 775503516 775707901 776002407 776325464 776545525 776654303 776784182
1980.4 776784182 777027130 777282596 777414083 777445853 777507663 777681708 777889431 778006554 778031051 778066516
2000.8 778066516 778165162 778253853 778221130 778083622 777946353 777868032 777772009 777562261 777271569 776990533
2021.2 776990533 776800394 776639342 776371658 776000381 775668800 775457442 775299430 775068820 774730563 774414062
2041.6 774414062 774241328 774167538 774049819 773884475 773773074 773774564 773849964 773908377 773929358 773955703 774027169
2064 774027169 774155259 774311543 774421990 774480700 774559438 774709225 774890900 774999321 775015175 775049388 775166988
2086.5 775166988 775318742 775466383 775600016 775747597 775927722 776126862 776313365 776455104 776578307 776752949
2106.9 776752949 776992619 777206361 777333558 777401567 777491391 777651370 777812898 777873695 777872503 777940750 778107584
2129.3 778107584 778283477 778373480 778409421 778505087 778711021 778937578 779048562 779041708 779060125 779229939 779503345
2151.7 779503345 779722035 779827535 779954076 780257344 780677557 781024933 781276286 781583548 782065690 782663584
2172.1 782663584 783184111 783535779 783869267 784380317 785006762 785529494 785872817 786178529 786622286 787187696
2192.5 787187696 787687063 788007855 788278282 788688183 789233148 789730072 790044844 790270329 790629506 791161954
2212.9 791161954 791675150 792011321 792228758 792524040 792954266 793363869 793608844 793732524 793905795 794209182
2233.3 794209182 794543028 794750094 794815004 794909775 795165241 795472622 795654237 795685053 795710564 795889616
2253.7 795889616 796153486 796306312 796311915 796330154 796503484 796785116 796993256 797015905 796979189 797095776
2274.1 797095776 797343910 797492504 797441185 797356486 797443151 797629893 797691464 797555447 797365367 797337055
2294.5 797337055 797471464 797540307 797386825 797141433 797029495 797058702 797042727 796848416 796555758 796378553
2314.9 796378553 796385586 796359003 796111226 795743167 795467377 795336843 795229912 794983804 794579327 794181049
2335.3 794181049 793947577 793803871 793528557 793161213 792877495 792712212 792549014 792269766 791860878 791424394
2355.7 791424394 791071832 790775359 790405989 789971828 789662540 789512575 789347708 789056897 788695931 788384736
2376.1 788384736 788209438 788132608 787982702 787673354 787300229 786980152 786711514 786403656 785957992 785392642
2396.5 785392642 784872353 784468770 784044445 783474565 782836258 782274306 781790078 781248152 780564725 779803872
2416.9 779803872 779101014 778496683 777855992 777082801 776262701 775502682 774801731 774076700 773266852 772407591
2437.3 772407591 771571159 770794392 770038664 769233108 768372536 767527521 766766369 766052425 765290141 764448285
2457.7 764448285 763605416 762846708 762135148 761387467 760595977 759842813 759160161 758469462 757713675 756912708
2478.1 756912708 756121218 755377352 754660547 753935874 753217816 752524316 751860142 751217842 750564158 749885380
2498.5 749885380 749198079 748510659 747845352 747219145 746584594 745914042 745237589 744584918 743955433 743305743
2518.9 743305743 742604196 741851866 741103709 740424216 739738762 738945007 738091230 737264931 736472130 735695601
2539.2 735695601 734906077 734053671 733176231 732370138 731659591 730962038 730181396 729352593 728587329 727909267
2559.6 727909267 727211356 726410151 725574553 724816382 724141002 723459661 722700715 721881628 721106350 720421731
2580 720421731 719752908 719018996 718207717 717407525 716697156 716032982 715330243 714565039 713786781 713059247
2600.4 713059247 712364733 711572349 710611999 709603310 708679140 707798898 706799209 705633402 704440653
2618.8 704440653 703315794 702202320 701001465 699677944 698290467 696960747 695716679 694417000
2635.1 694417000 692987680 691552222 690242171 689018607 687740982 686336458 684867442 683461070
2651.4 683461070 682172656 680916429 679572761 678172946 676859200 675655365 674415708 673067153
2667.7 673067153 671723664 670507491 669390082 668253899 667054176 665836394 664689064 663643599
2684.1 663643599 662584841 661411822 660181344 658983231 657851219 656745493 655565679 654277325
2700.4 654277325 652949154 651650131 650366426 649024010 647576392 646110535 644740701 643431127
2716.7 643431127 642089367 640691400 639291823 637983322 636777163 635575593 634333432 633091152
2733 633091152 631900489 630798519 629732072 628616631 627455711 626315951 625263989 624278069 623245895
2751.4 623245895 622149765 621073067 620050788 619057536 618042350 616965532 615854502 614776850
2767.7 614776850 613722563 612607002 611397386 610152960 608929694 607695580 606365323 604916334
2784 604916334 603402674 601869583 600338161 598757684 597061038 595294118 593546927 591803074 589961290
2802.3 589961290 587983310 585926473 583864033 581801355 579665780 577414811 575105965 572795630
2818.7 572795630 570438743 567953110 565314293 562571108 559778512 556893528 553784728 550374746
2835 550374746 546653092 542566419 537961423 532579899 526276708 519284666 512174785 505661488 500377595
2853.3 500377595 496589422 494024724 492039204 489942312 487192601 483563304 479258895 474783510
2869.7 474783510 470651448 467183441 464476973 462460130 460962623 459771007 458629429 457344502
2886 457344502 455912828 454372764 452675343 450776428 448653728 446307749 443785727 441085160 438095927
2904.3 438095927 434680969 430757970 426311225 421359718 415939480 410173357 404371470 398998141
2920.6 398998141 394505620 391178131 389111966 388314635 388784021 390499562 393372476 397214502 401731700
2939 401731700 406577349 411377400 415740371 419362217 422131211 424116313 425506651 426649183 427983105
2957.4 427983105 429834932 432383686 435719609 439861745 444723696 450129598 455923647 461992770
2973.7 461992770 468168288 474231571 480041295 485506088 490510583 494981587 498927742 502334177
2990 502334177 505104899 507198930 508683562 509569407 509782732 509365320 508507073 507366180 506072760
3008.3 506072760 504780591 503567636 502473295 501463175 500387371 499115199 497552633 495678991
3024.7 495678991 493620545 491540372 489467949 487325728 485081702 482795060 480486006 478079498
3041 478079498 475553572 472964823 470356911 467749357 465151072 462548673 459913731 457276076 454737127
3059.3 454737127 452337623 450040430 447851330 445812285 443922430 442147136 440431446 438731402
3075.6 438731402 437065840 435443848 433862358 432371467 430990398 429671347 428383797 427143902
3092 427143902 425960243 424794614 423575133 422284901 420983225 419667572 418277621 416822106 415337741
3110.3 415337741 413839132 412308067 410713375 409059018 407329470 405525267 403699726 401847929
3126.6 401847929 399941087 397998661 396010876 393978179 391955495 389938354 387863249 385739475
3143 385739475 383619428 381486773 379327804 377185434 375037581 372817606 370566845 368339241 366121858
3161.3 366121858 363894343 361648053 359380960 357102424 354861945 352658063 350439936 348195940
3177.6 348195940 345956087 343736231 341508090 339292407 337140024 335054874 332996041 330903828
3193.9 330903828 328779608 326691896 324679673 322744548 320863605 318994135 317131370 315302432
3210.3 315302432 313491553 311696649 309932113 308153868 306379527 304644525 302897453 301120400
3226.6 301120400 299339324 297542572 295701891 293785542 291806191 289814860 287788987 285726339
3242.9 285726339 283650547 281514943 279307008 277085900 274870455 272621453 270353526 268110514
3259.2 268110514 265893102 263699234 261528224 259409666 257436574 255644709 253944904 252301216
3275.5 252301216 250779957 249395281 248127967 246986687 245979488 245085999 244293526 243612319 243010566
3293.9 243010566 242452055 241957918 241579294 241301700 241058290 240823656 240575150 240321383 240124181 239992499
3314.3 239992499 239895865 239806473 239694118 239572912 239479870 239374831 239214137 239036784 238871142 238724843
3334.7 238724843 238573864 238338873 237997517 237641558 237328738 237004384 236656502 236285895 235825345 235305578
3355.1 235305578 234834880 234427154 234026626 233586147 233134329 232688174 232166871 231563702 231007159 230568960
3375.5 230568960 230198309 229838789 229467243 229131058 228872269 228684515 228556186 228374630 228073224 227834493
3395.9 227834493 227802098 227841109 227732986 227490216 227365896 227435738 227584615 227706596 227763593 227854356
3416.3 227854356 228065938 228361785 228714228 229181051 229781702 230496824 231243595 232011423 232843727 233603030
3436.6 233603030 234248787 234979466 235888705 236901104 237974837 239064068 240161121 241338462 242621660
3455 242621660 243974268 245362043 246709600 248053953 249573842 251269132 252886236 254238635 255537003
3473.4 255537003 257036746 258789510 260676891 262479514 264225274 266074687 267962486 269814342
3489.7 269814342 271705329 273655683 275670886 277709812 279754192 281825453 283810437 285705119
3506 285705119 287730634 289961666 292294383 294592202 296758294 298901975 301180929 303638607 306091756
3524.4 306091756 308397681 310748130 313286811 315918624 318592280 321265072 323897243 326658428
3540.7 326658428 329617292 332614183 335461438 338224471 341097832 344117314 347250551 350479811
3557 350479811 353792489 357139647 360448301 363767415 367372364 371226311 374995500 378691524 382517546
3575.3 382517546 386500120 390606195 394854069 399114758 403273404 407501578 411916077 416291535
3591.7 416291535 420682847 425285131 430029064 434751302 439434081 444065094 448559493 453117758
3608 453117758 457876682 462702841 467547238 472306550 477090538 482127011 487065434 491669714 496096134
3626.3 496096134 500816345 505961061 510814250 515416086 520003319 524547756 529113472 533685088
3642.6 533685088 538064539 542212188 546537399 551148713 555458784 559453070 563627601 567882478
3659 567882478 571845889 575582147 579252303 582724810 585999310 589448273 592775702 595704675 598676920
3677.3 598676920 601728320 604716122 607682049 610508382 613096535 615465403 617778122 620145321
3693.6 620145321 622496188 624696732 626633704 628397942 630258381 632176042 633841813 635200500
3709.9 635200500 636587381 638283372 640029550 641605198 643019557 644291520 645406246 646496296
3726.3 646496296 647828102 649223506 650430918 651476204 652544558 653887689 655250311 656045377
3742.6 656045377 656559169 657729030 658933818 659567714 660324872 661578536 662851930 663843572 664786637
3760.9 664786637 665796161 666700423 667521060 668273270 669057131 670030713 671064198 671968460 672684133
3779.3 672684133 673364639 674065292 674721122 675402701 676200211 677088261 677866578 678483963 679133952 679644465
3799.7 679644465 680036545 680786490 681512892 682033598 682810783 683750153 684382081 684722126 685235918 685665309
3820.1 685665309 685989857 686641455 687387347 688026369 688524246 689003170 689614832 690032482 690162659 690524042
3840.5 690524042 691135764 691739261 692414284 693190873 693628013 693214893 692949653 693786740 694790363
3858.8 694790363 695414603 695699513 695997775 696450412 696695805 696840703 697186768 697662532 698179722 698555648
3879.2 698555648 698877931 699261725 699541628 699834645 700139403 700344503 700690687 701167464 701445520 701482713
3899.6 701482713 701514125 701630235 701864302 702212989 702576518 702933252 703206897 703290999 703328788 703493774
3920 703493774 703677714 703785777 703922093 704116046 704240143 704343498 704556704 704789996 704955816 705068886
3940.4 705068886 705190301 705384910 705600381 705771744 705945075 706136584 706295848 706453502 706656933 706853867
3960.8 706853867 706995904 707116604 707270384 707445979 707592070 707738340 707922459 708112717 708252430 708334744
3981.2 708334744 708430529 708525658 708589852 708723545 708942771 709146559 709307790 709434152
3997.5 709434152
##END=$$ End of the data block
