##TITLE=G15-51-CE $$ Begin of the data block
##JCAMP-DX=5.00 $$ ACD/SpecManager v 10.08
##SPECTROMETER/DATA SYSTEM=Alpha
##DATE=22 Oct 2013 11:25:32
##DATA TYPE=INFRARED SPECTRUM
##DATA CLASS=XYDATA
##ORIGIN=
##OWNER=
##NPOINTS=1765
##FIRSTX=399.75695801
##LASTX=3997.56933594
##MAXX=3997.56933594
##MINX=399.75695801
##MAXY=0.79835880
##MINY=0.22753219
##XFACTOR=1.0000000000
##YFACTOR=1.000000000000000e-9
##FIRSTY=0.46562850
##DELTAX=2.03957629
##XUNITS=1/CM
##YUNITS=ARBITRARY UNITS
##XYDATA=(X++(Y..Y))
399.8D65628505k377033j913846j728833j108885J59502J094431J178473N88447n60403
418.1D60960358j565039j481443j317293j523286j688868j772344j634925j088202
434.4D48888958m06832J96278R34154J719385K079636J572013M52399k37256l17574
452.8D54881161m94658j118452j914859k371758k502829k378165k305299k438486k505154
471.1D36851501k187013j498044j163453j261234j195997p73191l70890o34492j370728
489.5D26396459j633674j461118j601160j990705k329797k617478k612770k396822
505.8D09752935k467096k777725k873331k589763k324402k366662k251238j579553
522.1C90523165p15732j02878K17974L80606P36058J609623K562761K880395K434969
$$ plain form
399.8 465628505 463251472 461337626 459608793 458499908 458659410 459753841 460932314 461520761 460960358
418.1 460960358 459395319 457913876 456596583 455073297 453384429 451612085 449977160 448888958
434.4 448888958 448482126 448678404 449612558 451331943 453411579 454983592 455435991 455198735 454881161
452.8 454881161 454386503 453268051 451353192 448981434 446478605 444100440 441795141 439356655 436851501
471.1 436851501 434664488 433166444 432002991 430741757 429545760 428772569 428401679 427767187 426396459
489.5 426396459 424762785 423301667 421700507 419709802 417380005 414762527 412149757 409752935
505.8 409752935 407285839 404508114 401634783 399045020 396720618 394353956 392102718 390523165
522.1 390523165 389807433 389704555 389922529 390303135 391039193 392648816 395211577 398091972 400526941
540.5D00526941J709342J160711O68794k1041q27014j349360j419395j457185j723319
558.8C97268474k088070k414346k501457k410055k257168j770347p55877M99905J559942
577.2C85131001K283752K760530L102481L262639L079772K349317J228124M10855K59519
595.6D03867990L84688L11345N364j33693J35631N17785O56486M60088L24964P37608
616D07268256J449346J845211J946956K219051K702177K998501K750009K104670J694202
634.3D26978379J824469K034724J838326J305968R46760R01103R41753R27806O41018
652.7D38340306K12521J30742M51088O92070N47916L06785N20527J327187J454204
671D43983346J193822J164317J365244J699746J814782J429856P88242N60343O95378
$$ plain form
540.5 400526941 402236283 403396994 404065788 404044747 403217733 401868373 400448978 398991793 397268474
558.8 397268474 395180404 392766058 390264601 387854546 385597378 383827031 383071154 383571059 385131001
577.2 385131001 387414753 390175283 393277764 396540403 399620175 401969492 403197616 403608471 403867990
595.6 403867990 404252678 404564023 404569387 404435694 404571325 405089110 405745596 406205684 406530648 407268256
616 407268256 408717602 410562813 412509769 414728820 417430997 420429498 423179507 425284177 426978379
634.3 426978379 428802848 430837572 432675898 433981866 434928626 435829729 436771482 437699288 438340306
652.7 438340306 438552827 438683569 439134657 439826727 440374643 440681428 441201955 442529142 443983346
671 443983346 445177168 446341485 447706729 449406475 451221257 452651113 453439355 453999698 454695076
689.4D54695076M66078l44276j172781j371622p95633J48624Q69245J166731J589715
707.7D55251157K421469L164440L438771L412455L668636M499942N217195N129039
724D86203104M633725M335970M294783M007309L168881K157748J509964J322091J058221
742.4E12691796L89159l70563p67171q25643r43244j373112j854777j882673j324296
760.8E03739476m98414L08395J214921K448917L986597N318939N967140N961061N641639
779.1E34088671N254567M772365M062116L130794K409100K171636K305150K538085
795.4E60732484K692342K895295L256381L531575L389359K799272K046883J513958
811.7E82857549J192510Q31604K27154n56171j286507j863718k331495k836287l287554
$$ plain form
689.4 454695076 455161154 454816878 453644097 452272475 451476842 451625466 452494711 453661442 455251157
707.7 455251157 457672626 460837066 464275837 467688292 471356928 475856870 481074065 486203104
724 486203104 490836829 495172799 499467582 503474891 506643772 508801520 510311484 511633575 512691796
742.4 512691796 513080955 512710392 511943221 511117578 510174334 508801222 506946445 505063772 503739476
760.8 503739476 503241062 503549457 504764378 507213295 511199892 516518831 522485971 528447032 534088671
779.1 534088671 539343238 544115603 548177719 551308513 553717613 555889249 558194399 560732484
795.4 560732484 563424826 566320121 569576502 573108077 576497436 579296708 581343591 582857549
811.7 582857549 584050059 584881663 585108817 584552646 583266139 581402421 579070926 576234639 572947085
830.1E72947085l425777l291071l124177l040433l107428l100396k711832k091587
846.4E49054384j644253j563430j565039j311183r08256l68059Q12054K809703N036474
864.8E50352395O646752P153153O618321N322695L651559J807630l06010k549529m422068
883.1E74274898n496622n817949n860925n951762n910874n519569n016744m904747
899.4E29795706n403578o187379o797851p133483p355988p565022p573724p012397
915.8D74766284n804628m281312k915144j987040j360119q56131n05864l74705m37558
934.1D56243783n08159m40568m67241j132399k844035n337924p715434r323418j0204405
952.5D18270200j0610342j0638058j0386228j0022819r695202r407938r021252q386791
$$ plain form
830.1 572947085 569521308 566230237 563106060 560065627 556958199 553857803 551145971 549054384
846.4 549054384 547410131 545846701 544281662 542970479 542062223 541694164 542506218 545315921 550352395
864.8 550352395 556999147 564152300 570770621 576093316 579744875 581552505 581246495 578696966 574274898
883.1 574274898 568778276 562960327 557099402 551147640 545236766 539717197 534700453 529795706
899.4 529795706 524392128 518204749 511406898 504273415 496917427 489352405 481778681 474766284
915.8 474766284 468961656 464680344 461765200 459778160 458418041 457561910 457056046 456681341 456243783
934.1 456243783 455735624 455295056 454827815 453695416 450851381 445513457 437798023 428474605 418270200
952.5 418270200 407659858 397021800 386635572 376612753 366917551 357509613 348488361 340101570
968.8C40101570p447273o347894n251408m178524l165156k281069j660556j434177
985.1C08335513j463860j484305j413941j318425j216263j021922o54488k04862P0095
1003.5B99627542m7177n23656j052618j410514j556605j546354j562982j636565j663655
1021.8B88627416j725286j888961k024621k036214j965612j921206j980633k089143
1038.1B72995740k085090j913547j655072j393974j153380q25852l16023L03000Q40962
1056.5B64796764J186937J454592J780807K044678J942516J140385k16126j214415
1072.8B72916138j153737k12997J015007K159238L148466L906310M338354M451960
1089.1B90568739M323065M038692L663361L216088K645284J958996J433581J349658
$$ plain form
968.8 340101570 332654297 326306403 321054995 316876471 313711315 311430246 309769690 308335513
985.1 308335513 306871653 305387348 303973407 302654982 301438719 300416797 299762309 299557447 299627542
1003.5 299627542 299580365 299056709 298004091 296593577 295036972 293490618 291927636 290291071 288627416
1021.8 288627416 286902130 285013169 282988548 280952334 278986722 277065516 275084883 272995740
1038.1 272995740 270910650 268997103 267342031 265948057 264794677 263968825 263652802 263955802 264796764
1056.5 264796764 265983701 267438293 269219100 271263778 273206294 274346679 274130553 272916138
1072.8 272916138 271762401 271549404 272564411 274723649 277872115 281778425 286116779 290568739
1089.1 290568739 294891804 298930496 302593857 305809945 308455229 310414225 311847806 313197464
1105.4C13197464J654595K067566K378136K564251K618790K519250K304762K004415
1121.8C31309229J698494J579732J804203K319574K731681K663523K192110J532435
1138.1C47830981P84069R0629m17471p05778p52718n84513k83867R3222N93752J301884
1158.5C47950190K146095K934516L528476L906637M218966M673153N284458N874396
1174.8C80516887O266355O485909O684274O815970O668091O166368N392403M458844
1191.1D29455101L400386K194971R77158K6316n21034p79271q66920p95424n74917
1209.5D32516366k86221n6535N901j20134l66956o37322q89749j173406j492411j750589
1229.9D25748944j803636j622111j291662r18389n33789l7700O06716J262158J761615
$$ plain form
1105.4 313197464 314852059 316919625 319297761 321862012 324480802 327000052 329304814 331309229
1121.8 331309229 333007723 334587455 336391658 338711232 341442913 344106436 346298546 347830981
1138.1 347830981 348615050 348705679 348288208 347582430 346829712 346245199 345961332 346054554 346648306 347950190
1158.5 347950190 350096285 353030801 356559277 360465914 364684880 369358033 374642491 380516887
1174.8 380516887 386783242 393269151 399953425 406769395 413437486 419603854 424996257 429455101
1191.1 429455101 432855487 435050458 436027616 436053932 435532898 434753627 433886707 433091283 432516366
1209.5 432516366 432230145 432173610 432179511 432059377 431692421 431055099 430165350 428991944 427499533 425748944
1229.9 425748944 423945308 422323197 421031535 420113146 419579357 419541657 420148373 421410531 423172146
1248.2D23172146K108336K371430K545238K605289K554118K405286K236903K183586
1264.5D42182332K270967K366483K288550K023429J711488J459092J246869J083166
1280.8D56632376J037538J125127J251906J198441Q43853K82257l05801q42214j309305
1299.2D59914178j689583j963139k082169k018333j821219j575262j243561p63774
1315.5D46757138j82808K99901M43578J50919m70817j218766j869798k267271k387822
1333.9D39254254k209097j800060j296401q57383o22183o20276p71761r94086j235366
1352.2D28847641j510918j825214k071500k350837k885580l487289l800422l743141
1368.5D07172740l183127k700120k802611l100633l386200l664553l627300l073841
$$ plain form
1248.2 423172146 425280482 427651912 430197150 432802439 435356557 437761843 439998746 442182332
1264.5 442182332 444453299 446819782 449108332 451131761 452843249 454302341 455549210 456632376
1280.8 456632376 457669914 458795041 460046947 461245388 462089241 462371498 462065697 461223483 459914178
1299.2 459914178 458224595 456261456 454179287 452160954 450339735 448764473 447520912 446757138
1315.5 446757138 446574330 446874231 447317809 447468728 446997911 445779145 443909347 441642076 439254254
1333.9 439254254 437045157 435245097 433948696 433091313 432469130 431848854 431077093 430083007 428847641
1352.2 428847641 427336723 425511509 423440009 421089172 418203592 414716303 410915881 407172740
1368.5 407172740 403989613 401289493 398486882 395386249 392000049 388335496 384708196 381634355
1384.9C81634355k214641j212895m28587j36614j26123n8234J60009N67734J074553
1403.2C79259557J505285J661837J633763J668454J758188J850575K007425K281636
1419.5C93626720K295613K222896K115309J676172J014233L57329j01626n13434o38247
1437.9D02054965k18749K15769M85599O38902O26863M18752K12491M43518J434803
1456.2D06312913K660066K810984K684772L041745L673702M461080N988032Q274734
1472.6D39908028Q857250P483870N956977M362375K750635J176298l48330k098948
1488.9D68048155l707617m282266m965484o188810o335229n699575n442708o998450
1505.2D24428016j0106474r226501p616013p411778o443471m565627k677053k131432
$$ plain form
1384.9 381634355 379419714 378206819 377778232 377641618 377515495 377457261 377617270 378185004 379259557
1403.2 379259557 380764842 382426679 384060442 385728896 387487084 389337659 391345084 393626720
1419.5 393626720 395922333 398145229 400260538 401936710 402950943 403308272 403206646 402693212 402054965
1437.9 402054965 401836216 402051985 402537584 403176486 403803349 404222101 404434592 404878110 406312913
1456.2 406312913 408972979 411783963 414468735 417510480 421184182 425645262 431633294 439908028
1472.6 439908028 448765278 456249148 462206125 466568500 469319135 470495433 470147103 468048155
1488.9 468048155 464340538 460058272 455092788 448903978 442568749 436869174 431426466 424428016
1505.2 424428016 414321542 405095041 397479028 390067250 383623779 379058152 376381099 374249667
1521.5C74249667k316743k407551k549499k252639k050638k138197j597077r63747
1537.8C57973576q70377l83705N61595J344412K113820K972900L695012M155784M301548
1556.2C75864565N132854N911947M387259L599554L523767L342033L154129K515405
1572.5D07431513J947820J628667J157970P49081L95656P3790l12656p19309j166612
1590.9D11185920j667231k336919l039867l708273m453242n225688o007970o880700
1607.2C77866030p870496q403331q430689r455174j1344374j0428249r901256j1523723
1623.5C00508738j1602968j0797799j0267228q896202q113384q425042o257623l216684
1639.8B32931808j586497n35548L49477J190364J537681K011552L081710L312140L470242
$$ plain form
1521.5 374249667 371932924 369525373 366975874 364723235 362672597 360534400 358937323 357973576
1537.8 357973576 357103199 356719494 357281089 358625501 360739321 363712221 367407233 371563017 375864565
1556.2 375864565 380997419 386909366 391296625 394896179 398419946 401761979 404916108 407431513
1572.5 407431513 409379333 411008000 412165970 412915051 413310707 413384497 413071841 412352532 411185920
1590.9 411185920 409518689 407181770 404141903 400433630 395980388 390754700 384746730 377866030
1607.2 377866030 369995534 361592203 353161514 343706340 332361966 321933717 312032461 300508738
1623.5 300508738 288905770 278107971 267840743 258944541 250831157 242406115 236148492 232931808
1639.8 232931808 231345311 230809763 231159240 232349604 233887285 235898837 238980547 242292687 245762929
1658.2B45762929M345939N534708O384790O362915P080019Q211911P875889Q228153
1674.5B99787253R112835Q740872Q435577R533048J2124658J1812687J0767191J1923790
1690.8C82237911J2581736J4955700J7336487J7456293J8838644J5737832J2968987
1705.1D92113590J2688101J0934114R219885P989526P157087P054031O336451M902005
1721.4E58394790M053890L623307L191292K914012K516746K357901K461195K442240
1737.7E81955373K844632L463209L947794M600108N540549O774486P539153P041931
1754F23707235O788313O930411O725788O685913O093383N380988N244434N086481M971862
1772.4F77614808M542708L770888L458798L427327L208637K825320K531767K395689
$$ plain form
1658.2 245762929 250108868 255643576 262028366 268391281 275471300 283683211 291559100 299787253
1674.5 299787253 308900088 317640960 326076537 335609585 347734243 359546930 370314121 382237911
1690.8 382237911 394819647 409775347 427111834 444568127 463406771 479144603 492113590
1705.1 492113590 504801691 515735805 524955690 532945216 540102303 547156334 553492785 558394790
1721.4 558394790 562448680 566071987 569263279 572177291 574694037 577051938 579513133 581955373
1737.7 581955373 584800005 588263214 592211008 596811116 602351665 609126151 616665304 623707235
1754 623707235 630495548 637425959 644151747 650837660 656931043 662312031 667556465 672642946 677614808
1772.4 677614808 682157516 685928404 689387202 692814529 696023166 698848486 701380253 703775942
1788.7G03775942K353847K422035K247036J951992J879990K029121K064407J836777
1805G20561147J604795J574934J734316J742423J566887J425147J455664J517356J459360
1823.4G34642029J327872J188994J184284J331568J348436J132190R60708R57012R97901
1841.7G45070994R97066R41873Q23915Q11398R12905R03785P74741O69480P04526P67887
1862.1G53378570P40886O14524N24044O17921P43568P47919O71029O04272O00457O77288
1882.5G59920478P27177O82473O11603O17862O49392N94378N34475N28276N37336N10811
1902.9G65914261M63188L97563L54469M00722M49419M01080L28421L72648M22240L99649
1923.3G69903660L65317L05414K76029L27587L27230K21967J85252K24292K65002K93136
$$ plain form
1788.7 703775942 706129789 708551824 710798860 712750852 714630842 716659963 718724370 720561147
1805 720561147 722165942 723740876 725475192 727217615 728784502 730209649 731665313 733182669 734642029
1823.4 734642029 735969901 737158895 738343179 739674747 741023183 742155373 743116081 744073093 745070994
1841.7 745070994 746068060 747009933 747833848 748645246 749558151 750461936 751236677 751906157 752610683 753378570
1862.1 753378570 754119456 754733980 755258024 755875945 756619513 757367432 758038461 758642733 759243190 759920478
1882.5 759920478 760647655 761330128 761941731 762559593 763208985 763803363 764337838 764866114 765403450 765914261
1902.9 765914261 766377449 766775012 767129481 767530203 767979622 768380702 768709123 769081771 769504011 769903660
1923.3 769903660 770268977 770574391 770850420 771178007 771505237 771727204 771912456 772136748 772401750 772694886
1943.7G72694886K61366K11299K34544L05116L45886L11136K29418K59757L63350L43144
1964.1G75559902K16782J67549K18987K81632K95580K17855J37567J59562K48015K50161
1984.5G77753592J38402M6789Q7917J89126J87516Q8334J9789N6982J15871Q8275m3333
2006.9G78729260j68085j77086q7142n5432j56581k78771l01361k11716j71065k65003
2027.3G76857018l76999l42250k20239j69635k29597l22401l00229j62363o2108j03653
2047.7G74567544j50024r9242r000N6147O4314L8921K0564M8101J18732J68622J28388
2070.2G74953067P8380R2447J39177J58787J03831J9252J8061J07169J68741J54316
2090.5G75993228J08123J30772K04325K32875J89722J26660J20640J77741K49445K26200
$$ plain form
1943.7 772694886 772956252 773167551 773402095 773707211 774053097 774364233 774593651 774853408 775216758 775559902
1964.1 775559902 775776684 775944233 776163220 776444852 776740432 776958287 777095854 777255416 777503431 777753592
1984.5 777753592 777891994 777938783 778026700 778215826 778403342 778491676 778511465 778568447 778684318 778772593 778729260
2006.9 778729260 778561175 778384089 778296947 778241515 778084934 777806163 777504802 777293086 777122021 776857018
2027.3 776857018 776480019 776137769 775917530 775747895 775518298 775195897 774895668 774733305 774671197 774567544
2047.7 774567544 774417520 774318278 774309278 774365425 774429739 774468660 774489224 774537325 774656057 774824679 774953067
2070.2 774953067 775031447 775123894 775263071 775421858 775525689 775544941 775563002 775670171 775838912 775993228
2090.5 775993228 776101351 776232123 776436448 776669323 776859045 776985705 777106345 777284086 777533531 777759731
2110.9G77759731J05977L9577J14203K15471J90854N4002j9968P6175J93059J88351
2131.3G78917432R6202L0994P6771J87755K20596J08838k3484J5080J97053L01898
2151.7G80129135K32458J13666J34051K94268M09007L69072K67386K87593M65989N95093
2172.1G83297718N21123L63946L55899N16296O03735N15878L54648K97964M48584N85199
2192.5G87860990M84347L00169K81036M28617N65707N02527K84851K00689L54647N34654
2212.9G91798234N35130L70026K16544K57313M13895M32074K56419R8646J56581L19004
2233.3G94853866L36230J91033P8976J22607K46763K84433J71960K9504L9935J90258
2253.7G96545565K57194J59979L2663M1426J81853K62261J72794J9550p033J26004
$$ plain form
2110.9 777759731 777865708 777905285 778019488 778234959 778425813 778479815 778459847 778536022 778729081 778917432
2131.3 778917432 779013634 779044628 779121399 779309154 779529750 779638588 779615104 779630184 779827237 780129135
2151.7 780129135 780361593 780475259 780609310 780903578 781312585 781681657 781949043 782236636 782702625 783297718
2172.1 783297718 783818841 784182787 784538686 785054982 785658717 786174595 786529243 786827207 787275791 787860990
2192.5 787860990 788345337 788645506 788926542 789355159 789920866 790423393 790708244 790908933 791263580 791798234
2212.9 791798234 792333364 792703390 792919934 793177247 793591142 794023216 794279635 794378281 794534862 794853866
2233.3 794853866 795190096 795381129 795460105 795582712 795829475 796113908 796285868 796315372 796355307 796545565
2253.7 796545565 796802759 796962738 796995401 797036827 797218680 797480941 797653735 797673285 797666252 797792256
2274.1G97792256K18391J15872m0233m7088Q8751J65403O5446j22964j94967m5717
2294.5G97995150J13130P4029r8408j69098o1214K8789n6147k30849k78414j42395
2314.9G97174573q822l4391j63436k52664k08915j21236j13904k12431l55184l76105
2335.3G95327485k70367k45094l63171m10021l03864j67251j55687k52903l34322l26038
2355.7G92498767l03745l10898l32296m37617m20988k18033j81616l29196l87669l18706
2376.1G89258003j88827r9778j96040l59893l99590l41773l01957l58164m87626n40137
2396.5G85984218m53472l60429m15325n81503o45042n58257m89950n62906p19309p92146
2416.9G80405879p05600n99980o46770p80821q27372p55191o81460p02083p82907q46684
$$ plain form
2274.1 797792256 798010647 798126519 798086286 798039198 798127949 798293352 798358798 798235834 798040867 797995150
2294.5 797995150 798108280 798182309 798083901 797914803 797853589 797882378 797826231 797595382 797316968 797174573
2314.9 797174573 797165751 797131360 796967924 796715260 796506345 796385109 796271205 796058774 795703590 795327485
2335.3 795327485 795057118 794812024 794448853 794038832 793734968 793567717 793412030 793159127 792824805 792498767
2355.7 792498767 792195022 791884124 791551828 791114211 790693223 790475190 790293574 789964378 789576709 789258003
2376.1 789258003 789069176 788969398 788773358 788413465 788013875 787672102 787370145 787011981 786524355 785984218
2396.5 785984218 785530746 785170317 784754992 784173489 783528447 782970190 782480240 781917334 781198025 780405879
2416.9 780405879 779700279 779100299 778453529 777672708 776845336 776090145 775408685 774706602 773923695 773077011
2437.3G73077011q40843p75456p50482p96735q47102q40067p56383o95587p63237q80003
2457.7G65131116q70705p37309o79314p55906q06630p67052p24376p16149p32541p65860
2478.1G57575274p84159p58767p13289o93858p05421p15971o93738o67930o68764o72281
2498.5G50501096o80804o78957o30676n99683o43670o92010o79910o33419o14822o48677
2518.9G43998468p00414p46489p58767p13408o85394p36713q06987q22902q11517q11458
2539.2G36404419q14796q42154q56399p78616o73055o81937p97033q39472p49886o81877
2559.6G28689194p29621q02219p96735p35700o87659o89208p50482q16942q00192p09534
2580G21170902o67512p51853q50916q00371o71387o31094o96003p83503p86782p23660
$$ plain form
2437.3 773077011 772236168 771460712 770710230 769913495 769066393 768226326 767469943 766774356 766011119 765131116
2457.7 765131116 764260411 763523102 762843788 762087882 761281252 760514200 759789824 759073675 758341134 757575274
2478.1 757575274 756791115 756032348 755319059 754625201 753919780 753203809 752510071 751842141 751173377 750501096
2498.5 750501096 749820292 749141335 748510659 747910976 747267306 746575296 745895386 745261967 744647145 743998468
2518.9 743998468 743298054 742551565 741792798 741079390 740393996 739657283 738850296 738027394 737215877 736404419
2539.2 736404419 735589623 734747469 733891070 733112454 732439399 731757462 730960429 730120957 729371071 728689194
2559.6 728689194 727959573 727157354 726360619 725624919 724937260 724248052 723497570 722680628 721880436 721170902
2580 721170902 720503390 719751537 718900621 718100250 717428863 716797769 716101766 715318263 714531481 713807821
2600.4G13807821p21633q24750r44793r61423q97586q93712j021743j164854j177668
2618.8G05199659j123667j126826j207411j321077j371563j305520j241327j303851
2635.1F95198417j421094j429737j323521j263678j313567j383305j391828j337945
2651.4F84333742j277984j305937j400829j427531j319468j173913j183689j301944
2667.7F73942447j328230j237631j143813j143158j219451j269221j189888j052141
2684.1F64358914j027525j125395j196623j174450j126706j137734j229822j318038
2700.4F55022621j320660j264155j256943j354038j444280j409293j325607j321077
2716.7F44326568j394928j456976j423001j301825j190424j189292j251518j252771
$$ plain form
2600.4 713807821 713086188 712261438 711316645 710355222 709457636 708563924 707542181 706377327 705199659
2618.8 705199659 704075992 702949166 701741755 700420678 699049115 697743595 696502268 695198417
2635.1 695198417 693777323 692347586 691024065 689760387 688446820 687063515 685671687 684333742
2651.4 684333742 683055758 681749821 680348992 678921461 677601993 676428080 675244391 673942447
2667.7 673942447 672614217 671376586 670232773 669089615 667870164 666600943 665411055 664358914
2684.1 664358914 663331389 662205994 661009371 659834921 658708215 657570481 656340659 655022621
2700.4 655022621 653701961 652437806 651180863 649826825 648382545 646973252 645647645 644326568
2716.7 644326568 642931640 641474664 640051663 638749838 637559414 636370122 635118604 633865833
2733F33865833j171410j077771j085043j148343j123071j047432j020014j043618j083493
2751.4F24065638j113296j081705r82642r45926j027882j125455j135707j055240j025677
2769.7F14572108j115084j230299j279652j240314j220166j319111j458525j521290
2786F04187667j500189j490474j573622j691401j736462j722217j760006j878798j995444
2804.4E88839054k039015k040625k071261k146661k240479k303541k323628k372801
2820.7E71301043k504528k659499k763808k815783k891064l094375l395796l706753
2837E47469437m078030m642964n438328o298422o939590p103444o577253n344152l818632
2855.4D97228622k585351j989186k090901k745986l635734m299313m443199m121124
$$ plain form
2733 633865833 632694423 631616652 630531609 629383266 628260195 627212763 626192749 625149131 624065638
2751.4 624065638 622952342 621870637 620887995 619942069 618914187 617788732 616653025 615597785 614572108
2769.7 614572108 613457024 612226725 610947073 609706759 608486593 607167482 605708957 604187667
2786 604187667 602687478 601197004 599623382 597931981 596195519 594473302 592713296 590834498 588839054
2804.4 588839054 586800039 584759414 582688153 580541492 578301013 575997472 573673844 571301043
2820.7 571301043 568796515 566137016 563373208 560557425 557666361 554571986 551176190 547469437
2837 547469437 543391407 538748443 533310115 527011693 520072103 512968659 506391406 501047254 497228622
2855.4 497228622 494643271 492654085 490563184 487817198 484181464 479882151 475438952 471317828
2871.7D71317828l485084k722531k030999j507223j215845j168102j277625j420320
2888D56490099j541286j693845j898408k120793k334684k526104k709032k975523l422052
2906.4D35268372l962308m479319m973501n437016n771429n796939n366742m492045
2922.7C94989073l336489k050191p39992M85510J659781K832055L848105M544199M873723
2941D07105774M819899M382879L631175K762496J977444J382291J131654J337200J876831
2959.4D30407643K568990L341973M142672M871458N437732N827665O071091O165683
2975.7D68834907O112933N913436N527884N009532M482120L964723L417044K808512
2992E06071091K128303J460969Q54194K44260l45468q38518j175881j307666j296401
$$ plain form
2871.7 471317828 467832744 465110213 463079214 461571991 460356146 459188044 457910419 456490099
2888 456490099 454948813 453254968 451356560 449235767 446901083 444374979 441665947 438690424 435268372
2906.4 435268372 431306064 426826745 421853244 416416228 410644799 404847860 399481118 394989073
2922.7 394989073 391652584 389602393 388862401 389347911 391007692 393839747 397687852 402232051 407105774
2941 407105774 411925673 416308552 419939727 422702223 424679667 426061958 427193612 428530812 430407643
2959.4 430407643 432976633 436318606 440461278 445332736 450770468 456598133 462669224 468834907
2975.7 468834907 474947840 480861276 486389160 491398692 495880812 499845535 503262579 506071091
2992 506071091 508199394 509660363 510514557 510758817 510413349 509574831 508398950 507091284 505794883
3010.4E05794883j231790j101911r80079j023412j221299j521379j876592k095908
3026.7D94742513k102495k064079k109229k224595k316713k341360k397418k498001
3043D76688623k549707k574176k599865k602458k623141k675861k649456k519370k398789
3061.4D53495800k303749k189189k053827j912564j804441j753897j721501j659990
3077.7D38096642j586526j530498j464993j382828j316875j271606j255899j247883
3094D27039534j211405j194715j221240j269609j355052j425445j428068j440435j500070
3112.4D14993495j573742j636505j673817j728088j800805j823485j852066j935511
3128.7D00969476j978100j978725j996815k026618k049684k075076k112002k146124
$$ plain form
3010.4 505794883 504563093 503461182 502481103 501457691 500236392 498715013 496838421 494742513
3026.7 494742513 492640018 490575939 488466710 486242115 483925402 481584042 479186624 476688623
3043 476688623 474138916 471564740 468964875 466362417 463739276 461063415 458413959 455894589 453495800
3061.4 453495800 451192051 449002862 446949035 445036471 443232030 441478133 439756632 438096642
3077.7 438096642 436510116 434979618 433514625 432131797 430814922 429543316 428287417 427039534
3094 427039534 425828129 424633414 423412174 422142565 420787513 419362068 417934000 416493565 414993495
3112.4 414993495 413419753 411783248 410109431 408381343 406580538 404757053 402904987 400969476
3128.7 400969476 398991376 397012651 395015836 392989218 390939534 388864458 386752456 384606332
3145C84606332k162159k151698k135157k157212k242773k289027k224505k175540k220184
3163.4C64848077k263158k267301k277047k266079k225906k206832k231002k237290
3179.7C46873462k218038k216786k207935k169907k119928k095253k095461k095401
3196C29654753k071887k013296j942426j900852j894027j874804j822472j792222j819223
3214.3C12523544j844168j803636j721353j692354j744688j805395Tj791239j840680
3232.7B96474636j930625j991361k001911k017171k062082k114594k141416k167880
3249B80047596k230645k271265k264827k246439k252609k280265k246559k139687k039045
3267.4B60076255j947344j844078j740098j632690j537025j446143j302064j136705
$$ plain form
3145 384606332 382444173 380292475 378157318 376000106 373757333 371468306 369243801 367068261 364848077
3163.4 364848077 362584919 360317618 358040571 355774492 353548586 351341754 349110752 346873462
3179.7 346873462 344655424 342438638 340230703 338060796 335940868 333845615 331750154 329654753
3196 329654753 327582866 325569570 323627144 321726292 319832265 317957461 316134989 314342767 312523544
3214.3 312523544 310679376 308875740 307154387 305462033 303717345 301911950 300106555 298315316 296474636
3232.7 296474636 294544011 292552650 290550739 288533568 286471486 284356892 282215476 280047596
3249 280047596 277816951 275545686 273280859 271034420 268781811 266501546 264254987 262115300 260076255
3267.4 260076255 258128911 256284833 254544735 252912045 251375020 249928877 248626813 247490108
3283.7B47490108j025364r18507p78199o71237o12513n45367m55097l77833l21016
3302B41784975k59936k33829k44200k37703k12402j54808j26511j46329j16810r2089
3322.4B39960358j21907j49309j68235j70275j71796j75401j61067j93834k87444l49089
3342.8B38012001l72082l84078l61323l65093m65587n40450m76644m05877m14610m24773
3363.2B33801484m28647m54426m93735n68300n89922m94093m01839l48732l30612l28288
3383.6B29362890k82168j91570j47372k12729k94641k47270p5221M0055l7313k04816
3404B27709845j77652K5049J40995J13040O4969J05813K28658L35917L72097M19200
3424.4B29337931N60760P37176P54058P51555Q59365Q23497O79806O97315Q46520R49800
$$ plain form
3283.7 247490108 246464744 245546237 244768038 244096801 243484288 242938921 242483824 242105991 241784975
3302 241784975 241525039 241291210 241047010 240809307 240596905 240442097 240315586 240169257 240052447 239960358
3322.4 239960358 239838451 239689142 239520907 239350632 239178836 239003435 238842368 238648534 238361090 238012001
3342.8 238012001 237639919 237255841 236894518 236529425 236063838 235523388 235046744 234640867 234226257 233801484
3363.2 233801484 233372837 232918411 232424676 231856376 231266454 230772361 230370522 230021790 229691178 229362890
3383.6 229362890 229080722 228889152 228741780 228529051 228234410 227987140 227911919 227951974 227914661 227709845
3404 227709845 227532193 227557242 227698237 227811277 227876246 227982059 228210717 228546634 228918731 229337931
3424.4 229337931 229898691 230635867 231389925 232141480 233000845 233824342 234504148 235201463 236047983 236997783
3444.8B36997783J036033J110718J132026J168162J272768J366749J387611J372799
3461.1B46844649J418829J573310J695349J614482J385927J334160J529038J795769
3477.4B59191513J898974J754850J700581J840531J883030J835943J896441J983940
3493.8B73985803K012789K017796K057881K082854K010167J950860K032935K170384
3510.1B90321469K262682K277017K222836K240002K351612K479404K449721K300918
3526.4C08905661K325773K504617K640069K742082K761394K680003K755702K954453
3542.7C30269754L025204K889424K826423K947628L023714L057063L143608L240973
3559C54423791L336787L389359L400922L624648L850489L773243L712594L847748L985107
$$ plain form
3444.8 236997783 238033816 239144534 240276560 241444722 242717490 244084239 245471850 246844649
3461.1 246844649 248263478 249836788 251532137 253146619 254532546 255866706 257395744 259191513
3477.4 259191513 261090487 262845337 264545918 266386449 268269479 270105422 272001863 273985803
3493.8 273985803 275998592 278016388 280074269 282157123 284167290 286118150 288151085 290321469
3510.1 290321469 292584151 294861168 297084004 299324006 301675618 304155022 306604743 308905661
3526.4 308905661 311231434 313736051 316376120 319118202 321879596 324559599 327315301 330269754
3542.7 330269754 333294958 336184382 339010805 341958433 344982147 348039210 351182818 354423791
3559 354423791 357760578 361149937 364550859 368175507 372025996 375799239 379511833 383359581 387344688
3577.4C87344688M109085M257202M282445M240691M299939M415601M390359M418374
3593.7D21758384M598438M717976M697859M700244M696190M565120M604131M780710
3610D59119052M839748M845202M725665M738092N051315N019277M673690M429728M643321
3628.4E02085090N071759M890144M690051M647493M581511M550219M482984M319549
3644.7E39318800M164875M337608M616499M354239M021764M145443M203081L935218
3661E73097527L727675L657698L446520L232300L384054L275215K996445L111183L075839
3679.4F03004456K921640K921522K817810K563774K344489K352715K451062K393305
3695.7F23770773K161146J867830J706124J784742J880228J738370J428961J373291
$$ plain form
3577.4 387344688 391453773 395710975 399993420 404234111 408534050 412949651 417340010 421758384
3593.7 421758384 426356822 431074798 435772657 440472901 445169091 449734211 454338342 459119052
3610 459119052 463958800 468804002 473529667 478267759 483319074 488338351 493012041 497441769 502085090
3628.4 502085090 507156849 512046993 516737044 521384537 525966048 530516267 534999251 539318800
3644.7 539318800 543483675 547821283 552437782 556792021 560813785 564959228 569162309 573097527
3661 573097527 576825202 580482900 583929420 587161720 590545774 593820989 596817434 599928617 603004456
3679.4 603004456 605926096 608847618 611665428 614229202 616573691 618926406 621377468 623770773
3695.7 623770773 625931919 627799749 629505873 631290615 633170843 634909213 636338174 637711465
3712F37711465J680494J726091J519084J363575J290381J198530J177132J374245J410842
3730.3F50451839J199007R93490J032055J326620J324952P59840N00381J175403J235068
3748.7F59998655O62983P87794J315415J299501R24229Q40485R71735R57966Q78811
3767.1F68637574P52449P76350R48489R89556R20713P84338P18891P03395O66380P36475
3787.5F76634610Q65996Q92222P36653N68390N86570M61518L64185P23004P30753N89430
3807.8F83153331Q13723Q74996N71609L71992N54562L89337K98739P01725P81060O51717
3828.2F89162791N39005N18858O07193L80873J35064M22180O04153N42164O53445P50006
3848.6F94315732L67879m39226j99557Q79407R90093O02424L10123L00408L51548J98543
$$ plain form
3712 637711465 639391959 641118050 642637134 644000709 645291090 646489620 647666752 649040997 650451839
3730.3 650451839 651650846 652644336 653676391 655003011 656327963 657087803 657588184 658763587 659998655
3748.7 659998655 660661638 661449432 662764847 664064348 664988577 665829062 666800797 667758763 668637574
3767.1 668637574 669390023 670166373 671114862 672104418 673025131 673809469 674528360 675231755 675898135 676634610
3787.5 676634610 677500606 678392828 679129481 679697871 680284441 680745959 681110144 681833148 682563901 683153331
3807.8 683153331 683967054 684842050 685413659 685785651 686340213 686729550 687028289 687730014 688511074 689162791
3828.2 689162791 689701796 690220654 690827847 691208720 691343784 691765964 692370117 692912281 693565726 694315732
3848.6 694315732 694683611 694244385 694044828 694924235 695914328 696516752 696826875 697127283 697478831 697677374
3869F97677374K23160L89099M98652N72860L93510L28839L73542K12074K66015L13163
3889.4G01248288J93477L48270M65989K26319J669L7193J63376L13521L81350L31819
3909.8G03711271L01838K21014N4300M8935J93716J92403J14441J47820K04861J63019
3930.2G05353618J43885K30372K30909J24871J03295J75715K16305K16484K13027K07305
3950.6G07215786J86145J32978J23501J76311J87575J62244J22428P8440R6321J23620
3971G08605349J43230J91093J68383R7692J20163J92344J98722J24216P3075J20223
3991.4G10034490J78277J83880J67072
3997.5G10563719
$$ plain form
3869 697677374 697900534 698289633 698788285 699361145 699754655 700083494 700457036 700669110 700935125 701248288
3889.4 701248288 701441765 701790035 702256024 702482343 702484012 702521205 702684581 702998102 703379452 703711271
3909.8 703711271 704013109 704234123 704288423 704337358 704531074 704723477 704837918 704985738 705190599 705353618
3930.2 705353618 705497503 705727875 705958784 706083655 706186950 706362665 706578970 706795454 707008481 707215786
3950.6 707215786 707401931 707534909 707658410 707834721 708022296 708184540 708306968 708385408 708481729 708605349
3971 708605349 708748579 708939672 709108055 709205747 709325910 709518254 709716976 709841192 709914267 710034490
3991.4 710034490 710212767 710396647 710563719
3997.5 710563719
##END=$$ End of the data block
