##TITLE=G14-52-SE $$ Begin of the data block
##JCAMP-DX=5.00 $$ ACD/SpecManager v 10.08
##SPECTROMETER/DATA SYSTEM=Alpha
##DATE=17 Oct 2013 10:58:30
##DATA TYPE=INFRARED SPECTRUM
##DATA CLASS=XYDATA
##ORIGIN=
##OWNER=
##NPOINTS=1765
##FIRSTX=399.75695801
##LASTX=3997.56933594
##MAXX=3997.56933594
##MINX=399.75695801
##MAXY=0.79583925
##MINY=0.26949960
##XFACTOR=1.0000000000
##YFACTOR=1.000000000000000e-9
##FIRSTY=0.54039955
##DELTAX=2.03957629
##XUNITS=1/CM
##YUNITS=ARBITRARY UNITS
##XYDATA=(X++(Y..Y))
399.8E40399551j893341k390444k624989j564443M86672J611411P81775n80371j067399
418.1E33158422q83639o69837j024604k274752l033817k040088n37753l15607r77873
436.5E21400452r93848P0691J637638K487421J527607k36869j014948p48872l57390
454.8E23771882o37650j764298k645135k558052k092779j973450k187372k514719k432704
473.2E04965723j648128j001180r80258j308202j511097j065404k11179j59234j245141
491.5D95835900k362698k339065j517445j369715k272218l172338l329724k924770
507.9D76547927k369523k237738k701759l175050k890676j820654r87708r64821j191526
526.2D58208472q44539K19941J366258J890451J854211J875192K104878K280653J854330
$$ plain form
399.8 540399551 538506210 536115766 533490777 531926334 532413006 534024417 534806192 534225821 533158422
418.1 533158422 532274783 531604946 530580342 528305590 525271773 523231685 522693932 522378325 521400452
436.5 521400452 520406604 520477295 522114933 524602354 526129961 525893092 524878144 524129272 523771882
454.8 523771882 523134232 521369934 518724799 516166747 514073968 512100518 509913146 507398427 504965723
473.2 504965723 503317595 502316415 501336157 500027955 498516858 497451454 497240275 497081041 495835900
491.5 495835900 493473202 491134137 489616692 488246977 485974759 482802421 479472697 476547927
507.9 476547927 474178404 471940666 469238907 466063857 463173181 461352527 460364819 459399998 458208472
526.2 458208472 457363933 457583874 458950132 460840583 462694794 464569986 466674864 468955517 470809847
544.6D70809847M71234j066505j616180j103491n22554p71642j722335k506167k516240
562.9D59455967j952797j589120j811385k147972j720220j59413J604945K450794K345681
581.3D56476480J999676K128005K683014K841323J979292M15414o29961l56525N57929
599.6D68094647R27359L59505m96954o03765J99974J074642J216560N13405l1471O80864
620D71934766K216756L279745L090501K062857J400680J891970K834917K912521J918971
638.4D93543684P15197M29004J313627K086073J612663K65390o02484k16514Q68798
656.7E00015438J406788P15197l53814m44173P96854K363503J647711O18756K58565
675.1E07024825O75499J783073K514422K019525O27517l79205j25944P04229P02321
$$ plain form
544.6 470809847 471281081 470214576 468598396 467494905 466972351 466200709 464478374 461972207 459455967
562.9 459455967 457503170 455914050 454102665 451954693 450234473 450075060 451680005 454130799 456476480
581.3 456476480 458476156 460604161 463287175 466128498 468107790 468523204 467893243 467536718 468094647
599.6 468094647 469022006 469381511 468884557 468280792 468480766 469555408 470771968 471285373 471253902 471934766
620 471934766 474151522 477431267 480521768 482584625 483985305 485877275 488712192 491624713 493543684
638.4 493543684 494258881 494687885 496001512 498087585 499700248 499965638 499363154 499146640 500015438
656.7 500015438 501422226 502137423 501783609 501339436 502136290 504499793 506147504 506766260 507024825
675.1 507024825 507700324 509483397 511997819 514017344 514644861 514265656 514139712 514843941 515546262
693.5E15546262m60386j756132j773417k33173J640379K371312J774847J097143J627862
711.8E19834697L241718M489839M387140L469944K994538L678560M985094N405784
728.1E52487314M196048K385318J550376K091408K767742K243757N81205q16345q55267
746.5E66631556J53720Q22544Q3566j567841k527296j797319j59442P98523N82457
764.8E63020468L31700J404285L660917N568564N894542M755437L532112L460526M204214
783.2E95832765M417837L277004J571476P92682J482606K848029L537238K939999K023816
801.6F18723452K008677K840280L493130K857685J144827k02119j61767P66992R96292
819.9F32467449k69831k085745l026664k619028j690984j554966k512574l579617l591537
$$ plain form
693.5 515546262 515085876 513329744 511556327 511323154 512963533 515334845 517109692 518206835 519834697
711.8 519834697 523076415 527566254 531953394 535423338 538417876 542096436 547081530 552487314
728.1 552487314 556683362 559068680 560619056 562710464 565478206 567721963 568303168 567486823 566631556
746.5 566631556 566785276 567607820 567691386 566123545 563596249 561798930 561639488 562438011 563020468
764.8 563020468 563352168 564756453 568417370 573985934 579880476 584635913 588168025 591628551 595832765
783.2 595832765 600250602 603527606 605099082 605891764 607374370 610222399 613759637 616699636 618723452
801.6 618723452 620732129 623572409 627065539 629923224 631068051 630865932 630704165 631471157 632467449
819.9 632467449 632197618 630111873 627085209 624466181 622775197 621220231 618707657 615128040 611536503
838.3F11536503k513290j471400j437962k133727k421856j644969l81529K06172j99914
856.6E99538028o52909J82569K587557N208492O385446N880832M814148M095912L568769
875F31608844K459228L14832k310098m149794m592002m319369m331947m841208n292118
893.3F04546368n127489m436613l976166m400372n530596o522656o810426o642163
909.6E61099887o536126o651402o647706n971312m502833k808154j627207j237511
926E25117636j242101j029850m80473p0631k07841o70195j014173j295090k153277
944.3E16954005m049480o544709q640021r694219r916365r938062j0124146j0419250
960.6D47627753j0595560j0467470j0066628r580851r047597q292467p163912n737454
$$ plain form
838.3 611536503 609023213 607551813 606113851 603980124 601558268 599913299 599531770 599737942 599538028
856.6 599538028 598885119 599067688 601655245 606863737 613249183 619130015 623944163 628040075 631608844
875 631608844 634068072 634382904 632072806 627923012 623331010 619011641 614679694 609838486 604546368
893.3 604546368 599418879 594982266 591006100 586605728 581075132 574552476 567742050 561099887
909.6 561099887 554563761 547912359 541264653 535293341 530790508 527982354 526355147 525117636
926 525117636 523875535 522845685 522365212 522294581 522086740 521416545 520402372 519107282 516954005
944.3 516954005 512904525 506359816 497719795 488025576 478109211 468171149 458047003 447627753
960.6 447627753 437032193 426564723 416498095 406917244 397869647 389577180 382413268 376675814
977C76675814m311919l224402k546937k078891j627951j244903j096606j143068j136899
995.3C58264238q61258l46481J65700L50327J0937o09577j092821j347750j494974
1013.7C53038341j646102j824349j917630j881928j826524j910329k175391k403527
1030C37452561k355576k119094j984119k082795k270192k323538k128691j723140j283437
1048.3C19181979r34959n73247l9965O42419J291155J736433J990020K081603J887500
1066.7C27262938J203835M8757r81480j137287l21388J013458K463847L663749M286498
1085C37502927M393130M317820M255742M187584L890872L163278K198935J469463J293927
1103.4C66673678J544565J869083K058178K182036K431274K788991K951830K623648
$$ plain form
977 376675814 372363895 369139493 366592556 364513665 362885714 361640811 360544205 359401137 358264238
995.3 358264238 357402980 357056499 357222199 357572526 357583463 356973886 355881065 354533315 353038341
1013.7 353038341 351392239 349567890 347650260 345768332 343941808 342031479 339856088 337452561
1030 337452561 335096985 332977891 330993772 328910977 326640785 324317247 322188556 320465416 319181979
1048.3 319181979 318247020 317673773 317633808 318276227 319567382 321303815 323293835 325375438 327262938
1066.7 327262938 328466773 328515530 327534050 326396763 326075375 327088833 329552680 333216429 337502927
1085 337502927 341896057 346213877 350469619 354657203 358548075 361711353 363910288 365379751 366673678
1103.4 366673678 368218243 370087326 372145504 374327540 376758814 379547805 382499635 385123283
1119.7C85123283J978963J528204J612097K180964K796828K933711K473474J821458
1136D02448982J335502R34660M09484k51740p79748q40128m50939N0962M22180P14183
1156.4D03993398J185059K045662L157705M078537M477561M513263M707247N410940
1172.7D33569372O413102P077724P078558O723970O490201O476223O328374N609393
1189.1D85766917M249841K700001J531691Q86619M29809j93298r46194j351952j036317
1207.4D92037117k92509J79976L3557m64439q04514p66068o28591q19057j459360k133072
1227.8D84883040k301842j942932j436979j126409j071959r46492l72708N71281J411467
1246.2D77666467J766950J740903J740366K032608K470642K665371K421826J967102
$$ plain form
1119.7 385123283 387102246 388630450 390242547 392423511 395220339 398154050 400627524 402448982
1136 402448982 403784484 404719144 405128628 404876888 404097140 403257012 402806073 402857035 403279215 403993398
1156.4 403993398 405178457 407224119 410381824 414460361 418937922 423451185 428158432 433569372
1172.7 433569372 439982474 447060198 454138756 460862726 467352927 473829150 480157524 485766917
1189.1 485766917 490016758 492716759 494248450 495135069 495564878 495371580 494425386 493073434 492037117
1207.4 492037117 491744608 491924584 491958141 491493702 490689188 489923120 489294529 488475472 487016112 484883040
1227.8 484883040 482581198 480638266 479201287 478074878 477002919 476056427 475683719 476255000 477666467
1246.2 477666467 479433417 481174320 482914686 484947294 487417936 490083307 492505133 494472235
1262.5D94472235J762480K015501K443642K518594K016544J291633R19342J043916
1278.8E08483887J321614J369535J121343Q62717Q46446R80556Q43644J54674q39531
1297.2E15144885j568675j720787j502037j381754j606644j909613j842261j247525
1313.5E02365589m20689J48475K04742l2902k47955m42386q11517j462609k197772
1331.8D97102976k560705k266675j566202r28819o99043q13663r26554q76070q26299
1350.2D85638946r78261j401633j941234k241015k319306k576232l137410l695846
1366.5D67348009l893137l402024k758801k694965l099322l659218m100144l997296
1382.8D39743102l204734k112060j187176o87718m83483k89649N4270L78758N74648
$$ plain form
1262.5 494472235 496234715 498250216 500693858 503212452 505228996 506520629 507439971 508483887
1278.8 508483887 509805501 511175036 512296379 513159096 514005542 514986098 515829742 515984416 515144885
1297.2 515144885 513576210 511855423 510353386 508971632 507364988 505455375 503613114 502365589
1313.5 502365589 501944900 502093375 502298117 502265215 502017260 501574874 500763357 499300748 497102976
1331.8 497102976 494542271 492275596 490709394 489780575 489081532 488267869 487341315 486465245 485638946
1350.2 485638946 484660685 483259052 481317818 479076803 476757497 474181265 471043855 467348009
1366.5 467348009 463454872 460052848 457294047 454599082 451499760 447840542 443740398 439743102
1382.8 439743102 436538368 434426308 433239132 432551414 432067931 431778282 431832552 432211310 432785958
1401.2D32785958P77602J143217J565338J879215J980692J843870J726240J956045
1417.5D45658177K517790K670198K500952K159893J552075J018256N95689K43902k05099
1435.9D58711833o63787n19187M3035N56588Q32558P33793L05891P182M28140J853973
1456.2D62290019L112078K757221K458900K901852L623009M590362O360948Q547277
1472.6D96641666Q578568O928742N641044M440546K914488J048505p16209k301157
1488.9E23176193l605425m191280n001068o418049o813049o124109n583734o817579
1505.2D78621900j0024786r972304q546889p979989o698549m807055l121137k706200
1521.5D24764991k901882k892524k980888k778381k602160k646655k076894j247317
$$ plain form
1401.2 432785958 433563560 434706777 436272115 438151330 440132022 441975892 443702132 445658177
1417.5 445658177 448175967 450846165 453347117 455507010 457059085 458077341 458673030 458916932 458711833
1435.9 458711833 458048046 457528859 457571894 458128482 458961040 459694833 460000724 460007906 460436046 462290019
1456.2 462290019 465402097 468159318 470618218 473520070 477143079 481733441 488094389 496641666
1472.6 496641666 505220234 512148976 517790020 522230566 525145054 526193559 525477350 523176193
1488.9 523176193 519570768 515379488 510378420 503960371 497147322 491023213 485439479 478621900
1505.2 478621900 468597114 458624810 450077921 442097932 435399383 430592328 427471191 424764991
1521.5 424764991 421863109 418970585 415989697 413211316 410609156 407962501 405885607 404638290
1537.8D04638290r26315o95557o8664P48038J742303K830685L641694M070372M240364
1556.2D20221210N180031N671352L939211L277958L260046L060311K871156K300024
1572.5D49781299J993179J826256J029313M09752J91897Q5116j77622o50644j275897
1590.9D53212649j807511k274305k745211l372371m242927n099893n761981o373018
1607.2D21535432p244765p970393q233011r164214j0814071j0116726r774417j1405468
1623.5C46812367j1672407j1002600j0537475r298593q519620q736908o661773l602266
1639.8B76780725j770080n13553N53339J319796J500517K166152L365607L302723L453463
1658.2B90158689M563034N958587O831675O785870P624715Q789868Q284330Q525401
$$ plain form
1537.8 404638290 403711975 403016418 402947754 403695792 405438095 408268780 411910474 415980846 420221210
1556.2 420221210 425401241 431072593 435011804 438289762 441549808 444610119 447481275 449781299
1572.5 449781299 451774478 453600734 454630047 455039799 455231696 455316812 455139190 454488546 453212649
1590.9 453212649 451405138 449130833 446385622 443013251 438770324 433670431 427908450 421535432
1607.2 421535432 414290667 406320274 398087263 388923049 378108978 367992252 358217835 346812367
1623.5 346812367 335139960 324137360 313599885 304301292 295781672 287044764 280382991 276780725
1639.8 276780725 275010645 274497092 275050431 276370227 277870744 280036896 283402503 286705226 290158689
1658.2 290158689 294721723 300680310 307511985 314297855 321922570 330712438 338996768 347522169
1674.5C47522169R351403Q952409Q738309R996235J2481243J1792868J0644436J1943549
1690.8D31422621J2843072J5398384J7580032J7322808J8295706J5059530J2216211
1705.1E40138364J1706233R854734Q317292P432103O842851O547690N413115M021585
1721.4F00273967L511011L248573K683341K224386J917899J969933J859307J575172
1737.7F19263589J865685K403975L096878M110873N207837O224751O657660O242156
1754F55073404O317318O537080O167829N918443N243957M699707M771531M734754M512191
1772.4G03976214L735065K885461K828896L024698K840221K379834J942456J798630
1788.7G25411475K073407K368033J959026J411318J261175J440525J669586J677215
$$ plain form
1674.5 347522169 356873572 365825981 374564290 384560525 397041768 408834636 419479072 431422621
1690.8 431422621 444265693 459664077 477244109 494566917 512862623 527922153 540138364
1705.1 540138364 551844597 561699331 570016623 577448726 584291577 590839267 596252382 600273967
1721.4 600273967 603784978 607033551 609716892 611941278 613859177 615829110 617688417 619263589
1737.7 619263589 621129274 623533249 626630127 630741000 635948837 642173588 648831248 655073404
1754 655073404 661390722 667927802 674095631 680014074 685258031 689957738 694729269 699464023 703976214
1772.4 703976214 707711279 710596740 713425636 716450334 719290555 721670389 723612845 725411475
1788.7 725411475 727484882 729852915 731811941 733223259 734484434 735924959 737594545 739271760
1805G39271760J464784J170755J060783J201094J467347J504421J157820P81417Q54790
1823.4G49934971J263738J464427J289844P85112M22419O07848J068413J221418R28939
1841.7G58987129N33402L77059N88894R35971R75311N86867J98484K51293P18415J034319
1862.1G65187144Q32618L46124O3956K51531O87659R01461O27994J45316J0729M08769
1882.5G69463301R26733J007259N40793L576j908N24939R60946P68304J66893k16008
1902.9G74144828J6034O15597R17434N26011j35421l00348J94609P74920P76410K69830
1923.3G77799904k66194l08275K24352P57217O69420L3259m28438k20180M40836Q07465
1943.7G79509366M37498k11537m37021j9849N87642P43449K78950k96891l71098J51693
$$ plain form
1805 739271760 740736544 741907299 742968082 744169176 745636523 747140944 748298764 749080181 749934971
1823.4 749934971 751198709 752663136 753952980 754738092 755160511 755768359 756836772 758058190 758987129
1841.7 758987129 759520531 759897590 760486484 761422455 762397766 762984633 763183117 763434410 764152825 765187144
1862.1 765187144 766019762 766365886 766429842 766681373 767369032 768270493 768898487 769043803 769054532 769463301
1882.5 769463301 770390034 771397293 771938086 771941662 771939754 772464693 773425639 774193943 774360836 774144828
1902.9 774144828 774160862 774776459 775693893 776219904 776084483 775784135 775978744 776753664 777530074 777799904
1923.3 777799904 777533710 777225435 777449787 778207004 778876424 778909683 778481245 778261065 778701901 779509366
1943.7 779509366 779946864 779735327 779298306 779278457 779866099 780609548 780888498 780591607 780220509 780372202
1964.1G80372202P38323P10547M9770m66526k76148L49045P35700M69804j77741n17547
1984.5G81987429j84477M25756O51062K39968l91841n22971r954N58257N18263q2791
2004.9G83188701o18220n41269M6432M66525K41399l90768p68542n06938J11520L82007
2025.3G81610847P927n93126p83265l68237K04682L12388j59085o58452o28054q1003
2045.7G78864622M16756L35932k22564o04868l72231K41279N84782L10480k40981m67480
2066.1G78845727j10745M23670N44786J23322l91483m37021M7922N26130M88281p15
2086.5G80059874m13954k78056K64466O17981M03106j43170m23849j25766M42744O55830
2106.9G81059206K64585k96057l90529M8160N00143M83930M6253l56913l05891J56522
$$ plain form
1964.1 780372202 781110525 781821072 781870842 781404316 781128168 781477213 782212913 782682717 782504976 781987429
1984.5 781987429 781802952 782228708 782879770 783119738 782727897 782204926 782194972 782753229 783271492 783188701
2004.9 783188701 782570481 782029212 782075644 782542169 782783568 782392800 781624258 781117320 781228840 781610847
2025.3 781610847 781618774 781025648 780242383 779874146 780078828 780391216 780232131 779573679 778945625 778864622
2045.7 778864622 779281378 779617310 779394746 778789878 778417647 778658926 779243708 779554188 779313207 778845727
2066.1 778845727 778734982 779158652 779703438 779826760 779435277 778998256 779046178 779572308 780060589 780059874
2086.5 780059874 779645920 779367864 779632330 780250311 780653417 780510247 780086398 779960632 780403376 781059206
2106.9 781059206 781323791 781027734 780637205 780685365 781185508 781669438 781715691 781358778 781052887 781209409
2127.3G81209409N22137L84033j05024l77893j34885L37958N08070J94371k24412k79844
2147.7G82033920P6771M72546M92632J11580k38478j49369L13460O57380N13971R4890
2168G84379303r9420J50502N93722P35878M22240M3154j8240K80619O44505O54996
2188.4G87787259K72512n4955L7789M04417O27578M74691J25945m2379J39356M77135
2208.8G90249348O02007L66926L5643n066K58028M74692M08590J59561j7106M3511
2229.2G92576134K57611L72291K42770q643r4294P1883K92957L54707J62482j16467
2249.6G94111431j31786J33157L13580K23517L278j28805k2471K22981K97606J09434
2270G95131922j27197j44958R8467K95758J96457p5579k32160j38521J24097K65419
$$ plain form
2127.3 781209409 781731546 782115579 782010555 781632662 781497777 781835735 782343805 782538176 782313764 782033920
2147.7 782033920 782110691 782583237 783075869 783187449 782948971 782799602 783113062 783770442 784284413 784379303
2168 784379303 784279883 784430385 785024107 785759985 786182225 786225379 786207139 786487758 787132263 787787259
2188.4 787787259 788059771 788004816 788042605 788447022 789074600 789549291 789675236 789632857 789772213 790249348
2208.8 790249348 790851355 791218281 791253924 791248858 791506886 791981578 792390168 792549729 792532623 792576134
2229.2 792576134 792833745 793206036 793448806 793440163 793345869 793417752 793710709 794065416 794227898 794111431
2249.6 794111431 793979645 794112802 794426382 794649899 794653177 794524372 794501901 794724882 795022488 795131922
2270 795131922 795004725 794859767 794958234 795253992 795450449 795374870 795142710 795004189 795128286 795393705
2290.4G95393705P7188k04444k35259j5259J84238J83344J3888j50859j25886Q0288
2310.8G95200944K37822J29760j29760j99675M828K27034K69353R8944j38402j83761
2331.2G95517087j6034P6652l7313k29776l89993l59416l15547m89652n06878j99854
2351.6G93049276J87993M22001M90546J99139l43323o91712o64830m49657l57688n79238
2372G91262507r26494j013160p37369l72887k57015m45008o96063o94931l90053p0929
2392.4G85658598n7221l67760o60420n96165k84255j05083k61009o18517p98583o10054
2412.8G81299531k96115k19942m54425p72715q56638o04868l19481l46362o57261r04202
2433.2G75867522q26836n22077l29316m55618p82549r59217p74146m44710l24666n50092
$$ plain form
2290.4 795393705 795470893 795266449 795031190 795015931 795200169 795383513 795397401 795246542 795120656 795200944
2310.8 795200944 795438766 795568526 795438766 795239091 795243919 795470953 795740306 795839250 795700848 795517087
2331.2 795517087 795501053 795577705 795540392 795310616 794920623 794561207 794245660 793756008 793249130 793049276
2351.6 793049276 793237269 793659270 794149816 794348955 794005632 793313920 792649090 792199433 791841745 791262507
2372 791262507 790336013 789322853 788585484 788212597 787955582 787510574 786814511 786119580 785729527 785658598
2392.4 785658598 785601377 785233617 784573197 783977032 783692777 783587694 783326685 782708168 781909585 781299531
2412.8 781299531 781003416 780783474 780329049 779556334 778699696 778094828 777775347 777428985 776771724 775867522
2433.2 775867522 775040686 774518609 774189293 773733675 772951126 771991909 771217763 770773053 770448387 769898295
2453.6G69898295q72969r26256o65665l62039l29137n98251q59380q03709n14150l30150
2474G63636589m55022p73132r45031p74205m34518k95639n02288p87735q09610n54025
2494.4G57305384k94388l09527n83827q18133p82490m90606k36869l11732o10888p94471
2514.8G52072453o81757m00424k71023m67717p68364q43525o59764m35054l86357n87166
2535.2G46571302q61764q81135o14345l96550m62889o98686q49247p74205n38766m02987
2555.6G40090728n24759p26641p91311o77645m95255m43757n78820p68722q28445o63340
2576G33592033m46498m32074o12855p80761p68662o02603m64260m87328o56009p97748
2596.4G27543235p46131n67138m84407o03020q14081r23931q48294p06672o82473q34644
$$ plain form
2453.6 769898295 769025326 768099070 767433405 767071366 766742229 766143978 765284598 764480889 763966739 763636589
2474 763636589 763181567 762408435 761463404 760689199 760254681 759959042 759456754 758669019 757859409 757305384
2494.4 757305384 757010996 756701469 756117642 755299509 754517019 754026413 753789544 753477812 752866924 752072453
2514.8 752072453 751390696 750990272 750719249 750251532 749483168 748639643 747979879 747544825 747158468 746571302
2535.2 746571302 745709538 744828403 744214058 743817508 743354619 742655933 741806686 741032481 740493715 740090728
2555.6 740090728 739565969 738839328 738048017 737370372 736875117 736431360 735852540 735083818 734255373 733592033
2576 733592033 733145535 732713461 732100606 731319845 730551183 729948580 729484320 728996992 728340983 727543235
2596.4 727543235 726797104 726229966 725745559 725142539 724328458 723404527 722556233 721849561 721167088 720332444
2616.8G20332444j032412j085580r66251q68976r34243j082957j177072j126409j011729
2635.1G11046815r83775j049638j153469j216650j141607j006008r83655j076520j177787
2653.5G01257706j174152j051188r71675j012981j093089j140058j110316j003980
2669.8F92700267r05216r36866j052558j074076r62376q52108q45492q97467r72987
2688.1F84201121j026511r91523r26197r26673j000404j104832j138687j040578r76920
2706.5F75068796j057983j158118j209199j221657j161278j101195j140833j185358
2722.8F65833175j144707j059532r79424r42468r86278j039625j012981r57787r37879
2741.2F56772494r45747r61065r62436r25541q78870q65043q97288r56059r73820r20177
$$ plain form
2616.8 720332444 719300032 718214452 717248201 716379225 715444982 714362025 713184953 712058544 711046815
2635.1 711046815 710063040 709013402 707859933 706643283 705501676 704495668 703512013 702435493 701257706
2653.5 701257706 700083554 699032366 698060691 697047710 695954621 694814563 693704247 692700267
2669.8 692700267 691795051 690858185 689805627 688731551 687769175 686917067 686071575 685174108 684201121
2688.1 684201121 683174610 682183087 681256890 680330217 679329813 678224981 677086294 676045716 675068796
2706.5 675068796 674010813 672852695 671643496 670421839 669260561 668159366 667018533 665833175
2722.8 665833175 664688468 663628936 662649512 661707044 660720766 659681141 658668160 657710373 656772494
2741.2 656772494 655826747 654865682 653903246 652977705 652098835 651233792 650336504 649380445 648406625 647486448
2761.6F47486448q64327r00626r65893r77576r98258j024604j031041j099706j197040
2779.9F38427377j225651j221895j235008j276493j363397j436472j446604j451850
2796.2F27770007j487851j553774j648009j719594j743674j760662j797795j866699
2812.5F14191949j969158k032340k026558k055287k180696k331912k446175k553403
2828.9E96596420k684593k842069l058553l385663l830492m396916n118966n953252
2845.2E65325916o682694o915689o352782n074859l469824k104462j480877j652360
2861.5E31592369k300084l080129l723502m014314l814816l182471k402901j741052
2877.8E07333100j278460j065672j110375j253664j370132j487017j655072j877933
$$ plain form
2761.6 647486448 646622121 645721495 644755602 643778026 642779768 641755164 640724123 639624417 638427377
2779.9 638427377 637201726 635979831 634744823 633468330 632104933 630668461 629221857 627770007
2796.2 627770007 626282156 624728382 623080373 621360779 619617105 617856443 616058648 614191949
2812.5 614191949 612222791 610190451 608163893 606108606 603927910 601595998 599149823 596596420
2828.9 596596420 593911827 591069758 588011205 584625542 580795050 576398134 571279168 565325916
2845.2 565325916 558643222 551727533 545374751 540299892 536830068 534725606 533244729 531592369
2861.5 531592369 529292285 526212156 522488654 518474340 514659524 511477053 509074152 507333100
2877.8 507333100 506054640 504988968 503878593 502624929 501254797 499767780 498112708 496234775
2894.1D96234775k109021k337218k567440k798825l101141l505677l980130m499763
2910.4D71335560n046546n588472n981356n987525n474836m517078l285855j935572
2926.8D33518320n99593O48052J836926K975940L951162M594923M817634M664421M198879
2945.1D60606664L451407K546609J708627J110881Q77381J120865J787335K612948
2961.4D75822717L369689M074633M787624N366623N693555N794972N725384N583465
2977.8E16218662N375028N025268M584491M091799L559649L048003K523005J926064
2994.1E46351969J296997O65546O4075m13656p64132j028657j156270j139939j060427
3012.4E42815506r50396q85427r56356j145363j441658j769065j943887j921832j877308
$$ plain form
2894.1 496234775 494125754 491788536 489221096 486422271 483321130 479815453 475835323 471335560
2910.4 471335560 466289014 460700542 454719186 448731661 443256825 438739747 435453892 433518320
2926.8 433518320 432918727 433566779 435403705 438379645 442330807 446925730 451743364 456407785 460606664
2945.1 460606664 464058071 466604680 468313307 469424188 470301569 471422434 473209769 475822717
2961.4 475822717 479192406 483267039 488054663 493421286 499114841 504909813 510635197 516218662
2977.8 516218662 521593690 526618958 531203449 535295248 538854897 541902900 544425905 546351969
2994.1 546351969 547648966 548314512 548378587 547964931 547200799 546172142 545015872 543875933 542815506
3012.4 542815506 541865110 540979683 540023327 538877964 537436306 535667241 533723354 531801522 529924214
3030.8E29924214j947940k062559k141595k199590k264082k332270k378583k417922
3047.1E12179673k453804k461672k453447k451479k452880k406538k292364k183915
3063.4D93023574k085596j924217j772374j708090j674563j629680j553267j496941
3079.7D79178846j501858j460910j340479j215368j157999j186639j200527j160533
3096D68954533j133591j166612j259386j359135j395225j369358j395762j485139j534283
3114.4D56856042j547098j596391j682788j752943j794994j824588j870155j931518
3130.7D42855567j965642j985401k028912k054334k063960k095848k121449k124667
3147D26415354k120644k134621k157271k183318k195805k194912k220690k249569k272248
$$ plain form
3030.8 529924214 527976274 525913715 523772120 521572530 519308448 516976178 514597595 512179673
3047.1 512179673 509725869 507264197 504810750 502359271 499906391 497499853 495207489 493023574
3063.4 493023574 490937978 489013761 487241387 485533297 483858734 482229054 480675787 479178846
3079.7 479178846 477676988 476216078 474875599 473660231 472502232 471315593 470115066 468954533
3096 468954533 467820942 466654330 465394944 464035809 462640584 461271226 459875464 458390325 456856042
3114.4 456856042 455308944 453712553 452029765 450276822 448481828 446657240 444787085 442855567
3130.7 442855567 440889925 438904524 436875612 434821278 432757318 430661470 428540021 426415354
3147 426415354 424294710 422160089 420002818 417819500 415623695 413428783 411208093 408958524 406686276
3165.4D06686276k300083k288968k227872k192825k229691k266258k229780k204627
3181.7C88746172k239585k251714k224833k177536k113790k086818k103657k102375
3198C71445864k068430j996517j926064j895070j871110j847058j839846j825363j781404
3216.4C54395002j752138j767188j794756j802146j838863j899272j906246j899481
3232.7C39734912j928687j961291j973748k012253k094805k178133k243101k274484
3249C23068410k277583k298772k329081k338082k330273k321601k311200k235085k104491
3267.4C02522242k003372j934379j850724j708687j533657j402616j317710j208812
3283.7B89562285j050323r01372p86274o96451o26385n39929m52399l96371l51369
$$ plain form
3165.4 406686276 404386193 402097225 399869353 397676528 395446837 393180579 390950799 388746172
3181.7 388746172 386506587 384254873 382030040 379852504 377738714 375651896 373548239 371445864
3198 371445864 369377434 367380917 365454853 363559783 361688673 359841615 358001769 356176406 354395002
3216.4 354395002 352642864 350875676 349080920 347278774 345439911 343540639 341634393 339734912
3232.7 339734912 337806225 335844934 333871186 331858933 329764128 327585995 325342894 323068410
3249 323068410 320790827 318492055 316162974 313824892 311494619 309173018 306861818 304626733 302522242
3267.4 302522242 300518870 298584491 296733767 295025080 293491423 292088807 290771097 289562285
3283.7 289562285 288511962 287610590 286824316 286127865 285501480 284961551 284509152 284112781 283761412
3302B83761412k78920k21968k28733k18391j76877j56253j35511j05411j03891j18137
3322.4B82017320r5725p1942j02282j58995j87785j73002j67877k31683l20613l48330
3342.8B80159086l48747l51071l61443m40478n31316n38200m71830l96461m09573n06908
3363.2B75803059n18471m36872m33952n35309n92112n41121m73201m09007l51012l28988
3383.6B71183014k97546j93567r7215j38938k63691k81692j55806m5508o5506j18196
3404B69525349k5749P6383O2615N8770J02818J90765L05563L48389L42459M23282N86301
3426.5B71996945P29442P75754Q39323Q92699P93874P38561Q41737R38416J027762
3444.8B79574513J156360J179517J170575J244337J321673J391679J450688J457542
$$ plain form
3302 283761412 283482492 283260524 283031791 282813400 282636523 282480270 282344759 282239348 282135457 282017320
3322.4 282017320 281921595 281849653 281747371 281588376 281400591 281227589 281059712 280828029 280507416 280159086
3342.8 280159086 279810339 279459268 279097825 278657347 278126031 277587831 277116001 276719540 276309967 275803059
3363.2 275803059 275284588 274847716 274413764 273878455 273286343 272745222 272272021 271863014 271512002 271183014
3383.6 271183014 270885468 270691901 270594686 270455748 270192057 269910365 269754559 269709051 269643545 269525349
3404 269525349 269499600 269575983 269638598 269697368 269800186 269990951 270296514 270644903 270987362 271410644 271996945
3426.5 271996945 272726387 273502141 274341464 275234163 276028037 276766598 277608335 278546751 279574513
3444.8 279574513 280730873 281910390 283080965 284325302 285646975 287038654 288489342 289946884
3461.1B89946884J519293J667618J738370J618892J411944J443744J698852J902669
3477.4C02948266J920641J788467J753867J913279K007335J949817J947701K006382
3493.8C18235755K044111K066762K117842K145529K022594J907915K071589K303273
3510.1C34915370K382248K353371K214670K167940K332717K545685K549737K392203
3526.4C53853941K378136K508223K629042K740442K744854K623647K680242K896458
3542.7C75054985L014237K936274K842158K915233L030092L047883L101677L251731
3559C99194270L310889L255755L320724L683805L868491L637463L513693L661246L886252
3577.4D31332588M064203M091292M025906M082144M248023M255354M121125M186273
$$ plain form
3461.1 289946884 291466177 293133795 294872165 296491057 297903001 299346745 301045597 302948266
3477.4 302948266 304868907 306657374 308411241 310324520 312331855 314281672 316229373 318235755
3493.8 318235755 320279866 322346628 324464470 326609999 328632593 330540508 332612097 334915370
3510.1 334915370 337297618 339650989 341865659 344033599 346366316 348912001 351461738 353853941
3526.4 353853941 356232077 358740300 361369342 364109784 366854638 369478285 372158527 375054985
3542.7 375054985 378069222 381005496 383847654 386762887 389792979 392840862 395942539 399194270
3559 399194270 402505159 405760914 409081638 412765443 416633934 420271397 423785090 427446336 431332588
3577.4 431332588 435396791 439488083 443513989 447596133 451844156 456099510 460220635 464406908
3593.7D64406908M309982M339993M411816M468978M413277M354745M450321M460186
3610D99616206M395604M489004M479289M559935M706740M338086L989875M109085M716038
3628.4E39399862M863918M095256L877223M067719M081845M024983L916621L750324
3644.7E72077751L825665M367351M424334L546774L147721L533662L596902L320455
3661F01840615L184438L031731K839923K954304L164470K879679K835989K815426K322554
3679.4F27869129K169550K323925K410889K513289K458394K027035J778125J835049
3695.7F45385385J842022J724600J590133J459837J416206J527965J584709J433611
3712F57964468J192987J079619J200318J337052J251936J027703R37462J042783J162767
$$ plain form
3593.7 464406908 468716890 473056883 477468699 481937677 486350954 490705699 495156020 499616206
3610 499616206 504011810 508500814 512980103 517540038 522246778 526584864 530574739 534683824 539399862
3628.4 539399862 544263780 548359036 552236259 556303978 560385823 564410806 568327427 572077751
3644.7 572077751 575903416 580270767 584695101 588241875 591389596 594923258 598520160 601840615
3661 601840615 605025053 608056784 610896707 613851011 617015481 619895160 622731149 625546575 627869129
3679.4 627869129 630038679 632362604 634773493 637286782 639745176 641772211 643550336 645385385
3695.7 645385385 647227407 648952007 650542140 652001977 653418183 654946148 656530857 657964468
3712 657964468 659157455 660237074 661437392 662774444 664026380 665054083 665991545 667034328 668197095
3730.3F68197095J276493J270414J012087P33733N84185O93679J119554J067936P25866
3748.7F76681042Q41915Q94964P49946O94632O77049O62685O87063P71164P48575O88136
3769.1F84097171O90281O21557O41168P96079Q08418N98073M47869N22316O42538O97851
3789.5F90563321O78063N78343N57006N38230M91380O35088N32567L44813N34892N40197
3809.9F95993900L99769N05447P30395O19054L99232N23031M55856K96235L33846L44098
3830.3G00600863L76522M90308O07431O31988M20451K15232K07305K22326K29418K56121
3850.7G04257965M62413O73771L50475J21236K45392L86954L59714K13325K84791M36127
3871.1G07792163K61307J44839J75357K98857M48943L70443L02434J40070o496K38835
$$ plain form
3730.3 668197095 669473588 670744002 671756089 672489822 673074007 673767686 674887240 675955176 676681042
3748.7 676681042 677522957 678417921 679167867 679862499 680539548 681202233 681889296 682660460 683409035 684097171
3769.1 684097171 684787452 685409009 686050177 686846256 687654674 688252747 688700616 689222932 689865470 690563321
3789.5 690563321 691241384 691819727 692376733 692914963 693406343 694041431 694573998 694918811 695453703 695993900
3809.9 695993900 696393669 696899116 697629511 698248565 698647797 699170828 699626684 699922919 700256765 700600863
3830.3 700600863 700977385 701467693 702075124 702707112 703127563 703342795 703550100 703772426 704001844 704257965
3850.7 704257965 704720378 705394149 705744624 705865860 706111252 706498206 706857920 707071245 707356036 707792163
3871.1 707792163 708053470 708198309 708373666 708672523 709121466 709491909 709794343 709934413 709927917 710166752
3891.5G10166752L70622J95026J55569K34365K21074K11537K29179J12355K6882O2406
3911.9G11985767Q7082J90974L12745J86205K2173Q6129J49846R7573J55866K61903
3932.3G13536263J71840L9160M8280J15812J62601J35005R8288J69932K28584J22369
3952.7G14828134J4901Q3267J82033J65880J08897Q3745J07348J32143Q7560O4551
3973.1G15858459J21832J15455R0718J71959J76311P3969Q7738J71662J66893R7632
3993.4G17132628M5359P7069
3997.5G17255056
$$ plain form
3891.5 710166752 710537374 710732400 710887969 711122334 711343408 711554945 711784124 711896479 711923361 711985767
3911.9 711985767 712072849 712263823 712576568 712762773 712784946 712871075 713020921 713118494 713274360 713536263
3932.3 713536263 713708103 713747263 713795543 713911355 714073956 714208961 714307249 714477181 714705765 714828134
3952.7 714828134 714843035 714926302 715108335 715274215 715383112 715466857 715574205 715706348 715793908 715858459
3973.1 715858459 715980291 716095746 716186464 716358423 716534734 716608703 716696441 716868103 717034996 717132628
3993.4 717132628 717177987 717255056
3997.5 717255056
##END=$$ End of the data block
