##TITLE=G14-52-SE $$ Begin of the data block
##JCAMP-DX=5.00 $$ ACD/SpecManager v 10.08
##SPECTROMETER/DATA SYSTEM=Alpha
##DATE=17 Oct 2013 10:58:30
##DATA TYPE=INFRARED SPECTRUM
##DATA CLASS=XYDATA
##ORIGIN=
##OWNER=
##NPOINTS=1765
##FIRSTX=399.75695801
##LASTX=3997.56933594
##MAXX=3997.56933594
##MINX=399.75695801
##MAXY=0.79650104
##MINY=0.26949209
##XFACTOR=1.0000000000
##YFACTOR=1.000000000000000e-9
##FIRSTY=0.53907877
##DELTAX=2.03957629
##XUNITS=1/CM
##YUNITS=ARBITRARY UNITS
##XYDATA=(X++(Y..Y))
399.8E39078772j591861k394915k837896j422286P83622J610875N60880q41737j236021
$$ 539078772 537486911 535091996 532254100 530831814 531615436 533226311 533787191 532945454 531709433
418.1E31709433p04110l15607r60767k352118k922893j977623o18457k35200q08418
$$ 531709433 531005323 530689716 529728949 527376831 524453938 522476315 521857858 521622658 520814240
436.5E20814240r90629J93059J913965K350986J179814k45213q08358o36936m01020
$$ 520814240 519823611 520016670 521930635 524281621 525461435 525216222 524407864 523770928 523369908
454.8E23369908o20544j605391k637804k783119k133072j763582k045631k318621k329171
$$ 523369908 522749364 521143973 518506169 515723050 513589978 511826396 509780765 507462144 505132973
473.2E05132973j881599j158238r14514j298338j555026j056700k54006k48819j223058
$$ 505132973 503251374 502093136 501178622 499880284 498325258 497268558 497014552 496765733 495542675
491.5D95542675k150237k265364j771361j451224k126306l167480l322542k796024
$$ 495542675 493392438 491127074 489355713 487904489 485778183 482610703 479288161 476492137
507.9D76492137k180934k110094k751798l150671k744049j854420j180053j111656
$$ 476492137 474311203 472201109 469449311 466298640 463554591 461700171 460520118 459408462
524.2D59408462j196086q00968J85520J318306J880824J810134J827478K198905K439171
$$ 459408462 458212376 457411408 457596928 458915234 460796058 462606192 464433670 466632575 469071746
542.5D69071746J876235L47227j182825j617461j030833l90738o33210j660943k511978
$$ 469071746 470947981 471295208 470112383 468494922 467464089 467073351 466440141 464779198 462267220
560.9D62267220k603561k060502j695127j963347k205670j678407j56492J653254K605110
$$ 462267220 459663659 457603157 455908030 453944683 451739013 450060606 449904114 451557368 454162478
579.2D54162478K491415K036452K097339K650439K799392J966357M32075o32436l96311
$$ 454162478 456653893 458690345 460787684 463438123 466237515 468203872 468635947 468003511 467607200
597.6D67607200N32270R59873L87251n33432o59525K51204J201361J263172M57704
$$ 467607200 468139470 469099343 469486594 468953162 468293637 468544841 469746202 471009374 471467078
616D71467078p7427P40350K367317L431082L140360K037227J353205J800954K802968
$$ 471467078 471389651 472130001 474497318 477928400 481068760 483105987 484459192 486260146 489063114
634.3D89063114K936214J769871N61148N55455J489878K120495J619279L00348n58645
$$ 489063114 491999328 493769199 494330347 494885802 496375680 498496175 500115454 500415802 499857157
652.7D99857157j94162Q31426J433312Q78871l08395o12199O14345K300024J622558
$$ 499857157 499662995 500494421 501927733 502806604 502498209 501886010 502500355 504800379 506422937
671E06422937O27696L34859P19250J760363K536595K033234N32567m60028r8587Q16346
$$ 506422937 507050633 507385492 508104742 509865105 512401700 514434934 514967501 514507473 514408886 515225232
691.4E15225232Q20338m58836j862824j852811k16543J706719K414644J771331J043319
$$ 515225232 516045570 515586734 513723910 511871099 511654556 513361275 515775919 517547250 518590569
709.8E18590569J535416L200472M511594M404843L525913L131509L838062N047381
$$ 518590569 520125985 523326457 527838051 532242894 535768807 538900316 542738378 547785759
726.1E47785759N337477M132330K375841J513839K022147K726317K282262O30617q99077
$$ 547785759 553123236 557255566 559631407 561145246 563167393 565893710 568175972 568806589 567907512
744.4E67907512r95457J41025Q99434R5129j606286k512336j789212k30372P35820
$$ 567907512 566912055 567053080 567952514 568047643 566441357 563929021 562139809 561909437 562645257
762.8E62645257O13868M10139J404763L597200N535125N918443M833401L594160L459573
$$ 562645257 563259125 563669264 565074027 568671227 574206352 580124795 584958196 588552356 592011929
781.2E92011929M156112M351735L240168J565278Q07285J490832K762556L408789K954066
$$ 592011929 596168041 600519776 603759944 605325222 606132507 607623339 610385895 613794684 616748750
799.5F16748750K095461K002359K905786L640532K934575J103223k49982j35959O97017
$$ 616748750 618844211 620846570 623752356 627392888 630327463 631430686 631180704 631044745 631741762
817.9F31741762Q63314k94745k105773l078401k627969j686751j576841k516806l533125
$$ 631741762 632605076 632310331 630204558 627126157 624498188 622811437 621234596 618717790 615184665
836.2F15184665l556371k485275j446009j515627k251148k419055j552224l04937K33531
$$ 615184665 611628294 609143019 607697010 606181383 603930235 601511180 599958956 599654019 599887550
854.6E99887550k48015p64370J26004K642215N241632O332159N863667M856348M129052
$$ 599887550 599639535 598875165 599001169 601643384 606885016 613217175 619080842 623937190 628066242
872.9F28066242L579497K446771L06368k298296m148960m651010m419684m374445m826665
$$ 628066242 631645739 634092510 634398878 632100582 627951622 623300612 618880928 614506483 609679818
891.3F09679818n288720n128264m431308l971517m401028n558550o543160o764233
$$ 609679818 604391098 599262834 594831526 590860009 586458981 580900431 574357271 567593038
907.6E67593038o577134o546915o719052o695629n990505m497289k770186j582146
$$ 567593038 561015904 554468989 547749937 541054308 535063803 530566514 527796328 526214182
923.9E26214182j235783j277208j027048m66346j04845k34663o59705r90748j276970
$$ 526214182 524978399 523701191 522674143 522207797 522102952 521868289 521208584 520217836 518940866
942.3E18940866k170622m090071o560385q619249r659439r889573r935558j0150820
$$ 518940866 516770244 512680173 506119788 497500539 487841100 477951527 468015969 457865149
958.6D57865149j0449320j0592252j0429144j0031492r561896r009749q246898p145942
$$ 457865149 447415829 436823577 426394433 416362941 406801045 397791296 389544398 382398456
974.9C82398456n747527m380136l288538k490073j976222j596033j270414j124114
$$ 382398456 376650929 372270793 368982255 366492182 364515960 362919927 361649513 360525399
991.2C60525399j152038j152367q87602l54797J66893L50476K9444n91725j100212
$$ 360525399 359373361 358220994 357333392 356978595 357145488 357495964 357525408 356933683 355833471
1009.6C55833471j353830j502306j667261j823932j903295j869083j813352j925975
$$ 355833471 354479641 352977335 351310074 349486142 347582847 345713764 343900412 341974437
1025.9C41974437k187818k362222k304524k109438k000481k088427k264083k319485
$$ 341974437 339786619 337424397 335119873 333010435 331009954 328921527 326657444 324337959
1042.2C24337959k119899j736938j318723r33737n50628m0292O16759J265764J721173
$$ 324337959 322218060 320481122 319162399 318228662 317678034 317637742 318254501 319520265 321241438
1060.6C21241438J946271K037674J909673J227439L5852r69768j116186k96205J057326
$$ 321241438 323187709 325225383 327135056 328362495 328398347 327428579 326312393 326016188 327073514
1078.9C27073514K472371L624857M265278M426510M355311M256636M172951L856420
$$ 327073514 329545885 333170742 337436020 341862530 346217841 350474477 354647428 358503848
1095.2C58503848L102511K174348J506955J324504J556814J909226K094776K165585
$$ 358503848 361606359 363780707 365287662 366612166 368168980 370078206 372172982 374338567
1111.6C74338567K404392K794534K952605K634347K024919J551866J595259K148986
$$ 374338567 376742959 379537493 382490098 385124445 387149364 388701230 390296489 392445475
1127.9C92445475K774656K925932K470702J831144J359582R62853M12405k70069p82340
$$ 392445475 395220131 398146063 400616765 402447909 403807491 404770344 405182749 404912680 404130340
1146.2D04130340q50499m89891M8221M54247P17192J193583K085180L182739M072219
$$ 404130340 403279841 402789950 402838171 403292418 404009610 405203193 407288373 410471112 414543331
1164.6D14543331M456341M486263M696190N412847O392062P070899P106155O729126
$$ 414543331 418999672 423485935 428182125 433594972 439987034 447057933 454164088 460893214
1180.9D60893214O457448O448328O325037N609184M247099K695114J516074Q67396
$$ 460893214 467350662 473798990 480124027 485733211 489980310 492675424 494191498 495058894
1197.2D95058894M14401k09629r35286j309485j034885l29793J81973N4836m73499
$$ 495058894 495473295 495263666 494328380 493018895 491984010 491654217 491836190 491891026 491417527
1215.6D91417527q08298p44552o20842q45134j465857k084345k259820j922191j420199
$$ 491417527 490609229 489864677 489243835 488398701 486932844 484848499 482588679 480666488 479246289
1233.9D79246289j149208j109749r44108l49342N87999J432598J797169J770705J744897
$$ 479246289 478097081 476987332 476043224 475693882 476281881 477714479 479511648 481282353 483027250
1252.3D83027250J991152K410829K631456K424896J975357J765967K028197K431601
$$ 483027250 485018402 487429231 490060687 492485583 494460940 496226907 498255104 500686705
1268.6E00686705K470374J993060J327157R77338J083493J338899J368702J119017
$$ 500686705 503157079 505150139 506477296 507454634 508538127 509877026 511245728 512364745
1284.9E12364745Q69632Q38935R44674Q07882J49309q31425j564741j709223j482963
$$ 512364745 513234377 514073312 515017986 515825868 515975177 515143752 513579011 511869788 510386825
1303.3E10386825j355291j587391j921832j849890j219749l92855J55270K02477m2677
$$ 510386825 509031534 507444143 505522311 503672421 502452672 502059817 502215087 502417564 502374887
1321.6E02374887k79784m77791q24689j476348k212524k551168k233446j521230r02146
$$ 502374887 502095103 501617312 500792623 499316275 497103751 494552583 492319137 490797907 489895761
1340D89895761p07000q26508r45479r10580q35121r63986j412004j965910k233952
$$ 489895761 489188761 488362253 487416774 486506194 485671073 484707087 483295083 481329173 479095221
1358.3D79095221k269835k546459l179073l744334l910095l405511k753407k710194
$$ 479095221 476825386 474278927 471099854 467355520 463445425 460039914 457286507 454576313
1374.7D54576313l112554l616899m055292m003882l203005k074986j179964o96361
$$ 454576313 451463759 447846860 443791568 439787686 436584681 434509695 433329731 432633370
1391D32633370m56482k64376M6581L70890N95539Q16137J132399J500129J854629K018511
$$ 432633370 432176888 431912512 431959093 432329983 432925522 433741659 434874058 436374187 438228816 440247327
1411.4D40247327J869798J742482K028763K566159K626866K455235K132088J543372
$$ 440247327 442117125 443859607 445888370 448454529 451081395 453536630 455668718 457212090
1427.7D57212090J039297O14643K49863k03431o89089n56380L6329N83887Q72076P47233
$$ 457212090 458251387 458866030 459115893 458912462 458223373 457666993 457703322 458287209 459159285 459906518
1448.1D59906518K87116K6733N34862J970530L072768K635360K404451K890617L579020
$$ 459906518 460193634 460220367 460755229 462725759 465798527 468433887 470838338 473728955 477307975
1466.4D77307975M568845O434948Q606165Q508355O839215N609870M426420K868235
$$ 477307975 481876820 488311768 496917933 505426288 512265503 517875373 522301793 525170028
1482.8E25170028J014054o78241k249301l650903m280985n013585o376803o824136
$$ 525170028 526184082 525505841 523256540 519605637 515324652 510311067 503934264 497110128
1499.1D97110128o171107n577177o704330r910047j0027856q646220p994026o628275
$$ 497110128 490939021 485361844 478657514 468747467 458719611 450073391 442079365 435451090
1515.4D35451090m729211l059924k655834k903133k907872k998203k804548k581686
$$ 435451090 430721879 427661955 425006121 422102988 419195116 416196913 413392365 410810679
1531.7D10810679k612114k078593j181513p76201o46502j11937P04020J713395K820671
$$ 410810679 408198565 406119972 404938459 404162258 403515756 403403819 404107839 405821234 408641905
1550.1D08641905L658712M134237M352421N282730N595028L793508L236294L315359
$$ 408641905 412300617 416434854 420787275 426070005 431665033 435458541 438694835 442010194
1566.4D42010194L120810K817720K204955J986473J837671R75371L56167J54555M8131
$$ 442010194 445131004 447948724 450153679 452140152 453977823 454953194 455309361 455463916 455512047
1584.7D55512047j78904o09397j255125j837611k305359k756566l392279m253715n078674
$$ 455512047 455333143 454723746 453468621 451631010 449325651 446569085 443176806 438923091 433844417
1603.1D33844417n724817o345600p229477p943452q188754r119838j0823310j0178149
$$ 433844417 428119600 421774000 414544523 406601071 398412317 389292479 378469169 368291020
1619.4C68291020r795487j1382043j1682361j1047900j0560632r263873q456826q725107
$$ 368291020 358495533 347113490 335431129 324383229 313822597 304558724 296101898 287376791
1635.7B87376791o711960l651768j779764m72963N99682J330674J539200K254993L334075
$$ 287376791 280664831 277013063 275233299 274760336 275360018 276690692 278229892 280484885 283818960
1654.1B83818960L176242L400117M561723N962759O827652O815643P702022Q832783
$$ 283818960 286995202 290395319 294957042 300919801 307747453 314563096 322265118 331097901
1670.4C31097901Q286804Q519113R301454Q908778Q745223J0023624J2447477J1712610
$$ 331097901 339384705 347903818 357205272 366114050 374859273 384882897 397330374 409042984
1686.7D09042984J0637492J1971116J2867362J5457987J7658979J7373323J8246234
$$ 409042984 419680476 431651592 444518954 459976941 477635920 495009243 513255477
1701E13255477J4971852J2184620J1675894R813369Q319974P518351O995857O630241
$$ 513255477 528227329 540411949 552087843 561901212 570221186 577739537 584735394 591365635
1717.3E91365635N320967L912449L488481L262579K713799K290011K007961K027571
$$ 591365635 596686602 600599051 604087532 607350111 610063910 612353921 614361882 616389453
1733.6F16389453J814962J524865J877904K428651L117025M141808N207598O169736
$$ 616389453 618204415 619729280 621607184 624035835 627152860 631294668 636502266 642672002
1749.9F42672002O596566O219923O328940O550730O174028N890667N193293M704237
$$ 642672002 649268568 655488491 661817431 668368161 674542189 680432856 685626149 690330386
1766.3F90330386M826844M793763M519761L672897K842784K839446L025771K822220
$$ 690330386 695157230 699950993 704470754 708143651 710986435 713825881 716851652 719673872
1782.6G19673872K399504J969159J829982K141654K382577J903653J392483J285017
$$ 719673872 722073376 724042535 725872517 728014171 730396748 732300401 733692884 734977901
1798.9G34977901J445472J634479J631498J427651J147329J052738J191139J458704
$$ 734977901 736423373 738057852 739689350 741117001 742264330 743317068 744508207 745966911
1815.2G45966911J516342J173020P90954Q84175J304805J492739J294672P38144L73364
$$ 745966911 747483253 748656273 749447227 750331402 751636207 753128946 754423618 755161762 755535126
1833.6G55535126O12080J082480J241207J003146N98967L31342N13077R25243R80914
$$ 755535126 756147206 757229686 758470893 759474039 760073006 760404348 760917425 761842668 762823582
1851.9G62823582N57720J64211K37227P21454J048923Q55207L77357P9334K10702O28651
$$ 762823582 763381302 763545513 763782740 764504194 765553117 766408324 766785681 766865015 767075717 767704368
1872.3G67704368Q98420O61076J52766k861M16339R54151J027047N60046p153m2140
$$ 767704368 768602788 769263864 769416630 769413769 769830108 770784259 771811306 772371352 772364199 772322059
1892.7G72322059N07533R53317P57933J59621k22445J7882O24239R33707N45800j48654
$$ 772322059 772829592 773782909 774540842 774700463 774478018 774495900 775120139 776053846 776599646 776450992
1913.1G76450992l16978K24292P94411P66039K52962k93314l18945K32935P57098O66798
$$ 776450992 776134014 776358306 777152717 777918756 778171718 777878404 777559459 777792394 778549492 779216290
1933.5G79216290M2200m11034j85311M73440P82847L67105k45213m01080L3200O05762
$$ 779216290 779258490 778847456 778662145 779135585 779918432 780285537 780040324 779639244 779672444 780278206
1953.9G80278206P30812K67089k94686l59118J59681P29323P06136O4015m66764k93254
$$ 780278206 781009018 781276107 780981421 780622303 780781984 781511307 782217443 782281458 781814694 781521440
1974.3G81521440L32176P05838M49002j72972n19038j82032M75704P01189K28942m04656
$$ 781521440 781853616 782559454 783008456 782835484 782316446 782134414 782610118 783311307 783540249 783135593
1994.7G83135593n07712k2829N26965N20229o1750n98729n29409K5094M38988K50519
$$ 783135593 782627881 782605052 783132017 783652246 783590496 782991767 782462358 782487452 782926440 783176959
2015.1G83176959l65794p52688n02646J00017L66747k920o13272q09372l70443K26200
$$ 783176959 782811165 782058477 781555831 781655848 782022595 782019675 781406403 780597031 780226588 780452788
2035.5G80452788L29733j44661o42061o21676r9719L79920L16858k17676n93006l60311
$$ 780452788 780782521 780637860 779995799 779374123 779274404 779654324 779971182 779753506 779160500 778800189
2055.9G78800189K49446N90861L19063k31802m70042j17839M34757N61833J20103m06742
$$ 778800189 779049635 779640496 779959559 779727757 779257715 779139876 779574633 780136466 780256569 779849827
2076.3G79849827m46617N4180N45204M90367j7702m22001k82705K52605O12676M16279
$$ 779849827 779403210 779457390 780002594 780492961 780475259 780053258 779770553 780023158 780635834 781052113
2096.7G81052113j08242l84033j08481M22895O16551K46048k82705l73960N6029N10514
$$ 781052113 780943871 780559838 780451357 780874252 781490803 781736851 781454146 781080186 781136215 781646729
2117.1G81646729M75764J0252l71039k86222J74523N32031L86000j05322l62694j11818
$$ 781646729 782122493 782132745 781761706 781475484 781650007 782182038 782568038 782462716 782100022 781988204
2137.5G81988204L38137M87685J92225k21491k94983O6101M63486M80115J07587k34187
$$ 781988204 782326341 782814026 783006251 782784760 782489777 782555878 783019364 783499479 783607066 783372879
2157.9G83372879j40190L15905O60181N22315R8765q4817J54793N48839O96540M35114
$$ 783372879 783232689 783548594 784208775 784731090 784829855 784745038 784899831 785448670 786145210 786580324
2178.2G86580324O1453M887L34501O64294O15120K49088l4928N1558L88383O10710
$$ 786580324 786641777 786646664 786981165 787645459 788260579 788509667 788474739 788526297 788914680 789525390
2198.6G89525390M73261J30116k2292J76132M85301N64516L31044M4048L0696K73764
$$ 789525390 789998651 790128767 790106475 790282607 790767908 791332424 791663468 791707516 791738212 792011976
2219G92011976M69148M10915J45078n9724L6359L10480M29154K46584m3035j11937
$$ 792011976 792481124 792892039 793037117 792977393 793013752 793324232 793753386 793999970 793956935 793844998
2239.4G93844998Q7142L02851L12388R0063j40250q2553K02299L60667K30849m6372
$$ 793844998 793932140 794234991 794547379 794637442 794497192 794414639 794616938 794977605 795208454 795162082
2259.8G95162082j81318o497K75434L08096O5744j69456j49310J06454K98858K02238
$$ 795162082 794980764 794974267 795249701 795557797 795623541 795454085 795304775 795411229 795710087 795912325
2280.2G95912325q2850k46704j24931J51277K78413R1970j85788k25603q882J99318
$$ 795912325 795829475 795582771 795457840 795609117 795887530 795979500 795793712 795568109 795559227 795758545
2300.6G95758545J83583k1458j73330j01030J25170K57015J21832j20580j93358o974
$$ 795758545 795942128 795920670 795747340 795646310 795771480 796028495 796150327 796029747 795836389 795829415
2321G95829415K49386L11971J10268j47461k24591j14441L6061M4525j75297l98815
$$ 795829415 796078801 796390772 796501040 796353579 796128988 796014547 796050608 796095133 795919836 795521021
2341.4G95521021l26216k89202n15640n42223k20001J93238M65632O20186L53754l28720
$$ 795521021 795194805 794905603 794389963 793847740 793627739 793820977 794286609 794906795 795260549 794931829
2361.8G94931829q39710q52704n18978l07143n43594r27925j004934p46787m19080
$$ 794931829 794092119 793239415 792720437 792413294 791869700 790941775 789936841 789190054 788770974
2380.2G88770974l12507m88937p04706o68049l55959l5882o1750m26174o91652n79595
$$ 788770974 788458467 787969530 787264824 786596775 786240816 786204934 786143184 785717010 785025358 784445763
2400.6G84445763k69473j11103k71559o21617q01921o15596k98024k10285m51147p89225
$$ 784445763 784176290 784065187 783793628 783172011 782370090 781754494 781456470 781246185 780795038 780005813
2421G80005813q55625n70536k94208l54707o77944r24885q57830n50330l11017l99887
$$ 780005813 779150188 778579652 778285444 777930737 777252793 776327908 775470078 774919748 774608731 774208844
2441.3G74208844p34985r31561p72119m63605l46839n51283q52645r14216o63161l68595
$$ 774208844 773473859 772542298 771770179 771306574 770959735 770408452 769555807 768641591 767978430 767609835
2461.7G67609835l65258o43968q71957q00430n22554l38674m54604p60854r25362p65860
$$ 767609835 767244577 766600609 765728652 764928222 764405668 764066994 763612390 762851536 761926174 761160314
2482.1G61160314m44770k99394m85539p64311p99596n65410k95221k87533n87225q49724
$$ 761160314 760715544 760416150 759930611 759166300 758366704 757801294 757506073 757218540 756631315 755781591
2502.5G55781591p82907m87447k78771l31044n76317p67589o89149m26471k96235m69864
$$ 755781591 754998684 754511237 754232466 753901422 753325105 752557516 751868367 751441896 751145661 750675797
2522.9G50675797p45475q22306o51657m27544l76106n58197q09670q59797o42120m19855
$$ 750675797 749930322 749108016 748456359 748028815 747652709 747094512 746284842 745425045 744782925 744363070
2543.3G44363070m57287p15554r14455q24809n21838l51787m89831p12752q06093p21813
$$ 744363070 743905783 743190229 742275774 741450965 740929127 740577340 740087509 739374757 738568664 737846851
2563.7G37846851n09798l98338n31018p44104p97332o58214m92990m70161n98967p46548
$$ 737846851 737337053 736938715 736407697 735663593 734866261 734208047 733715057 733244896 732645929 731899381
2584.1G31899381p77722o53267m90248m64976o14285p82967p87139o21855m99487n96404
$$ 731899381 731121659 730468392 729978144 729513168 728898883 728115916 727328777 726706922 726207435 725611031
2604.5G25611031q12411r16600q29220o76275o54697q27432j031995j087665r94504
$$ 725611031 724798620 723882020 723052800 722376525 721721828 720894396 719862401 718774736 717780232
2622.9G17780232r04738r44376j076699j161098j117766j032591r97663j039564j141906
$$ 717780232 716875494 715931118 714854419 713693321 712575555 711542964 710545301 709505737 708363831
2641.2G08363831j186669j108467j014889j012385j084446j150072j149058j082719
$$ 708363831 707177162 706068695 705053806 704041421 702956975 701806903 700657845 699575126
2657.5F99575126j011669r96531j056134j140297j125574j010716r25183r50515j034260
$$ 699575126 698563457 697566926 696510792 695370495 694244921 693234205 692309022 691358507 690324247
2675.9F90324247j049221r68992q83937q70943r08614r68873j007915r66370r26375
$$ 690324247 689275026 688306034 687422097 686551154 685642540 684673667 683665752 682699382 681773007
2694.3F81773007r58204j014531j070738j101076j060129j014113j058400j151502
$$ 681773007 680814803 679800272 678729534 677628458 676568329 675554216 674495816 673344314
2710.6F73344314j206815j211226j158357j095116j130879j196623j139164j014471
$$ 673344314 672137499 670926273 669767916 668672800 667541921 666345298 665206134 664191663
2726.9F64191663r61363r71854j010716j053512j025319r55105r21547r36330r71853
$$ 664191663 663230300 662258446 661247730 660194218 659168899 658213794 657292247 656355917 655384064
2745.2F55384064r66013r02593q32021q22723r08375r99629r90331r16482q74817r10640
$$ 655384064 654418051 653515458 652683437 651860714 650952339 649952710 648962379 648045897 647171080 646260440
2765.6F46260440r89556j031578j027584j012861r92358j044154j168132j240194j243770
$$ 646260440 645270884 644239306 643211722 642198861 641206503 640162349 638994217 637754023 636510253
2784F36510253j231849j266182j368224j454354j472532j463831j471877j525283j632392
$$ 636510253 635278404 634012222 632643998 631189644 629717112 628253281 626781404 625256121 623623729
2802.3F23623729j733005j756668j743615j782715j882613j995206k028346j989841
$$ 623623729 621890724 620134056 618390441 616607726 614725113 612729907 610701561 608711720
2818.7F08711720k035916k185285k337695k462327k568841k682447k839685l061712
$$ 608711720 606675804 604490519 602152824 599690497 597121656 594439209 591599524 588537812
2835E88537812l363490l799915m412711n154610n960404o666780o907046o368279n082309
$$ 588537812 585174322 581374407 576961696 571807086 565846682 559179902 552272856 545904577 540822268
2853.3E40822268l460646k113164j506686j678586k323448l102303l750205m042983
$$ 540822268 537361622 535248458 533741772 532063186 529739738 526637435 522887230 518844247
2869.7E18844247l827453l177106k374053j693011j271188j108229j129150j240075
$$ 518844247 515016794 511839688 509465635 507772624 506501436 505393207 504264057 503023982
2886E03023982j368344j499116j676321j911372k142906k314419k488553k767981l138333
$$ 503023982 501655638 500156522 498480201 496568829 494425923 492111504 489622951 486854970 483716637
2904.3D83716637l553003m006088m521847n081236n589873n938947n971670n517364
$$ 483716637 480163634 476157546 471635699 466554463 460964590 455025643 449053973 443536609
2920.6D43536609m556268l275305j905978n93364O36399J840204K996087L983408M641503
$$ 443536609 438980341 435705036 433799058 433205694 433842093 435682297 438678384 442661792 447303295
2939D47303295M837603M641711M177809L437370K532452J708448J123429R05096J149923
$$ 447303295 452140898 456782609 460960418 464397788 466930240 468638688 469762117 470667213 471817136
2957.4D71817136J779169K592325L401190M128754M793346N329251N655974N809755
$$ 471817136 473596305 476188630 479589820 483718574 488511920 493841171 499497145 505306900
2973.7E05306900N792379N607724N346000N037666M638910M117906L546298L019213
$$ 505306900 511099279 516707003 522053003 527090669 531729579 535847485 539393783 542412996
2990E42412996K502799J952350J372040P34269R6798m10020p78437j037240j147210
$$ 542412996 544915795 546868145 548240185 548974454 549071252 548661232 547882795 546845555 545698345
3008.3E45698345j131773j067579r59456q70407r18269j125455j444578j750827j910865
$$ 545698345 544566572 543498993 542539537 541669130 540750861 539625406 538180828 536430001 534519136
3026.7E34519136j923084j919687j978695k056838k128779k188325k244234k329112
$$ 534519136 532596052 530676365 528697670 526640832 524512053 522323728 520079494 517750382
3043E17750382k387642k414823k469480k468586k414703k420247k458274k433956k322882
$$ 517750382 515362740 512947917 510478437 508009851 505595148 503174901 500716627 498282671 495959789
3061.4D95959789k188862k074152j944482j815379j737535j677513j573533j459688
$$ 495959789 493770927 491696775 489752293 487936914 486199379 484521866 482948333 481488645
3077.7D81488645j435220j478076j475245j392305j269758j176446j152665j169771
$$ 481488645 480053425 478575349 477100104 475707799 474438041 473261595 472108930 470939159
3094D70939159j183390j187593j189977j224905j303941j364976j393676j425207j462698
$$ 470939159 469755769 468568176 467378199 466153294 464849353 463484377 462090701 460665494 459202796
3112.4D59202796j518577j571715j597732j666993j767338j813441j833648j879453
$$ 459202796 457684219 456112504 454514772 452847779 451080441 449267000 447433352 445553899
3128.7D45553899j927376j955807j983226k015858k028555k044320k101213k160579
$$ 445553899 443626523 441670716 439687490 437671632 435643077 433598757 431497544 429336965
3145D29336965k165913k130211k116650k146811k194464k229035k238392k240539k244085
$$ 429336965 427171052 425040841 422924191 420777380 418582916 416353881 414115489 411874950 409630865
3163.4D09630865k241165k259522k299398k308488k274245k238930k243310k249926
$$ 409630865 407389700 405130178 402830780 400522292 398248047 396009117 393765807 391515881
3179.7C91515881k231986k214789k222210k218068k168894k131342k102375k086401
$$ 391515881 389283895 387069106 384846896 382628828 380459934 378328592 376226217 374139816
3196C74139816k078385k018988j954287j929969j903534j878440j879543j874387j835734
$$ 374139816 372061431 370042443 368088156 366158187 364254653 362376213 360496670 358622283 356786549
3214.3C56786549j791179j778036j774610j791030j843393j859009j840621j853854
$$ 356786549 354995370 353217334 351442724 349651694 347808301 345949292 344108671 342254817
3230.7C42254817j880019j944125k048761k081036k068699k094179k133012k177179
$$ 342254817 340374798 338430673 336381912 334300876 332232177 330137998 328004986 325827807
3247C25827807k220899k258151k294034k334178k401381k425433k335578k222359k164453
$$ 325827807 323606908 321348757 319054723 316720545 314319164 311893731 309558153 307335794 305171341
3265.3C05171341k117634k038717j951188j846701j700014j549035j426965j319558
$$ 305171341 303053707 301014990 299063802 297217101 295517087 293968052 292541087 291221529
3281.6B91221529j213968j102894r68099q00729o46144n82814n63145m70489l56316
$$ 291221529 290007561 288904667 287936568 287135839 286489695 285906881 285343736 284873247 284516931
3300B84516931l17991l12627k95132k60621j96547j51842j37061j17988j26362j49756
$$ 284516931 284198940 283886313 283591181 283330560 283134013 282982171 282845110 282727122 282600760 282451004
3320.4B82451004j29342q6963r7633j44422j80066j96814j51515j14918j87933l30508
$$ 282451004 282321662 282234699 282137066 281992644 281812578 281615764 281464249 281349331 281161398 280830890
3340.8B80830890m20839l92764l40462l54111m44800n33432n23805m58509m17262m34727
$$ 280830890 280410051 280017287 279676825 279322714 278877914 278344482 277820677 277362168 276944906 276510179
3361.2B76510179m81486m75884m41253m71681n76526o22213n44727m57287m15742l79861
$$ 276510179 276028693 275552809 275111556 274639875 274063349 273441136 272896409 272439122 272023380 271643519
3381.6B71643519l01152k40743k07246j66654j86056k43604k37763j29610l6330j01417
$$ 271643519 271342367 271101624 270894378 270727724 270541668 270298064 270060301 269930691 269894361 269792944
3402B69792944j97798j03056O1542J11222J03265J49101K35528K96950L21329L45349
$$ 269792944 269595146 269492090 269553632 269664854 269768119 269917220 270152748 270449698 270771027 271116376
3422.4B71116376M54962O12617P07149P21336Q19265R57519Q79377P46876Q36105R72300
$$ 271116376 271571338 272183955 272891104 273612440 274431705 275389224 276268601 277015477 277851582 278823882
3442.8B78823882J002550J057595J106442J158744J266092J341968J395047J468212
$$ 278823882 279826432 280884027 281990469 283149213 284415305 285757273 287152320 288620532
3459.1B88620532J492232J522988J656741J744002J615196J428485J503080J706660
$$ 288620532 290112764 291635752 293292493 295036495 296651691 298080176 299583256 301289916
3475.4C01289916J822442J856655J818657J832723J938761J967310J917720J941204
$$ 301289916 303112358 304969013 306787670 308620393 310559154 312526464 314444184 316385388
3491.7C16385388J992375K029121K063990K118408K146185K076357K031178K127468
$$ 316385388 318377763 320406884 322470874 324589282 326735467 328811824 330843002 332970470
3508C32970470K267122K359570K356916K234668K176761K325923K566307K588660K405435
$$ 332970470 335237592 337597162 339954078 342188746 344365507 346691430 349257737 351846397 354251832
3526.4C54251832K353996K494961K638846K739698K764583K661049K663076K862543
$$ 354251832 356605828 359100789 361739635 364479333 367243916 369904965 372568041 375430584
3542.7C75430584L055751L013045K867043K878129L005296L106356L165841L265351
$$ 375430584 378486335 381499380 384366423 387244552 390249848 393356204 396522045 399787396
3559C99787396L321290L265619L343672L688037L790677L574073L549159L748327L923655
$$ 399787396 403108686 406374305 409717977 413406014 417196691 420770764 424319923 428068250 431991905
3577.4D31991905M055828M143089M123479M153460M277528M223853M071444M203260
$$ 431991905 436047733 440190822 444314301 448467761 452745289 456969142 461040586 465243846
3593.7D65243846M402012M426718M408717M374802M316389M326940M510999M579484
$$ 465243846 469645858 474072576 478481293 482856095 487172484 491499424 496010423 500589907
3610E00589907M491091M501164M416227M500628M751205M440904M021764M105270M746735
$$ 500589907 505080998 509582162 513998389 518499017 523250222 527691126 531712890 535818160 540564895
3628.4E40564895M869282M051089L792405L976703M067302M081487L960789L811776
$$ 540564895 545434177 549485266 553277671 557254374 561321676 565403163 569363952 573175728
3644.7E73175728L989399M524886M366875L355682L037155L515720L562808L252566
$$ 573175728 577165127 581690013 586056888 589412570 592449725 595965445 599528253 602780819
3661F02780819L126025L043950K961337L117442L237308K887010K815545K718508K235174
$$ 602780819 605906844 608950794 611912131 615029573 618266881 621153891 623969436 626687944 628923118
3679.4F28923118K126575K277791K422273K644539K548099J940787J656830J774609
$$ 628923118 631049693 633327484 635749757 638394296 640942395 642883182 644540012 646314621
3695.7F46314621J823127J752854J674771J521826J421451J520574J598597J445711
$$ 646314621 648137748 649890602 651565373 653087199 654508650 656029224 657627821 659073532
3712F59073532J129210R81867J154661J330853J265883J101375R99093J021683J190543
$$ 659073532 660202742 661184609 662339270 663670123 664936006 666037381 667036474 668058157 669248700
3730.3F69248700J373291J278401R40859O75440N87940P84397J219034J110673P45297
$$ 669248700 670621991 671900392 672841251 673516691 674104631 674889028 676108062 677218735 677964032
3748.7F77964032Q05258P79033O17683O05702O80149P01010O89924Q00192Q28922P43151
$$ 677964032 678769290 679548323 680166006 680771708 681451857 682152867 682842791 683642983 684471905 685215056
3769.1F85215056O32882N03421O12676Q62002Q43704N27680L73542N35369O56605O56426
$$ 685215056 685847938 686351359 686964035 687826037 688669741 689197421 689570963 690106332 690762937 691419363
3789.5F91419363O26743N52416N77211O40452O73413P38919N00739L21388M77374M39882
$$ 691419363 692046106 692598522 693175733 693816185 694489598 695228517 695729256 696050644 696528018 696967900
3809.9F96967900L68476N25236P39455O26564M44949N13315L59476K34425L19004L87311
$$ 696967900 697336376 697861612 698601067 699227631 699672580 700185895 700545371 700779796 701098800 701486111
3830.3G01486111M79221N80847O34730N62310L24130J63615J75238K31564L29554M67181
$$ 701486111 701965332 702546179 703180909 703743219 704067349 704230964 704406202 704637766 704967320 705434501
3850.7G05434501O58453N87761J58072N9485K47538L89159L57747J81973K44379M46200
$$ 705434501 706092954 706680715 706838787 706898272 707145810 707534969 707892716 708074689 708319068 708765268
3871.1G08765268L13402J53541J17064K35915M08172L58582L29792K14637R8109K91228
$$ 708765268 709078670 709232211 709349275 709585190 709993362 710351944 710681736 710896373 710994482 711285710
3891.5G11285710L19720J43528J96755K69174J86205K09987J99437j0132p6473N9008
$$ 711285710 711605430 711748958 711945713 712214887 712401092 712611079 712810516 712800384 712723911 712782919
3911.9G12782919J68503K50518K65718J20341J7524R9778J69218J46508J82390K12550
$$ 712782919 712951422 713201940 713467658 713587999 713605523 713705301 713874519 714021027 714203417 714415967
3932.3G14415967P0692n6208L0697J75595K25961J54257P3314J38461K11895J59085
$$ 714415967 714486659 714430451 714461148 714636743 714862704 715016961 715090275 715228736 715440631 715599716
3952.7G15599716J14619J03951P6353J15872J73449J15812M2796P0870R2089Q3030
$$ 715599716 715714335 715818286 715894639 716010511 716183960 716299772 716342568 716413438 716505527 716588557
3973.1G16588557J40071J75774J45018J25408J08063J11521J54435J74582J50323J00732
$$ 716588557 716728628 716904402 717049420 717174828 717282891 717394412 717548847 717723429 717873752 717974484
3993.4G17974484M3213L7968
$$ 717974484 718017697 718055665
3997.5G18055665
$$ 718055665
##END=$$ End of the data block
