##TITLE=G14-52-SE $$ Begin of the data block
##JCAMP-DX=5.00 $$ ACD/SpecManager v 10.08
##SPECTROMETER/DATA SYSTEM=Alpha
##DATE=17 Oct 2013 10:58:30
##DATA TYPE=INFRARED SPECTRUM
##DATA CLASS=XYDATA
##ORIGIN=
##OWNER=
##NPOINTS=1765
##FIRSTX=399.75695801
##LASTX=3997.56933594
##MAXX=3997.56933594
##MINX=399.75695801
##MAXY=0.79690003
##MINY=0.26972923
##XFACTOR=1.0000000000
##YFACTOR=1.000000000000000e-9
##FIRSTY=0.53909254
##DELTAX=2.03957629
##XUNITS=1/CM
##YUNITS=ARBITRARY UNITS
##XYDATA=(X++(Y..Y))
399.8E39092541k112270k694070k779901j123726J047611J542628K97367q42869q98063
$$ 539092541 536980271 534286201 531506300 530382574 531430185 532972813 533270180 532427311 531529248
418.1E31529248n48005p26641j428425k342522k550364j669704o61254l38495o11723
$$ 531529248 530981243 530254602 528826177 526483655 523933291 522263587 521602333 521263838 520652115
436.5E20652115r36269j92702J545965K312899J354039L040o48678o20484l62396o83129
$$ 520652115 519715846 519523144 521069109 523382008 524736047 524739087 524090409 523469925 523107529 522424400
456.9E22424400j908541k787292k648115j919389j551688k049446k688408k666771
$$ 522424400 520515859 517728567 515080452 513161063 511609375 509559929 506871521 504204750
473.2E04204750j872599j045883p64668j027733j343310r92924l25024m50820j392930
$$ 504204750 502332151 501286268 500521600 499493867 498150557 497157633 496832609 496381789 494988859
491.5D94988859k154053k069920j538575j455694k161205k976864l237933k979309
$$ 494988859 492834806 490764886 489226311 487770617 485609412 482632548 479394615 476415306
507.9D76415306k411097k189070k652407l115862k870113j997620j242608j015544
$$ 476415306 474004209 471815139 469162732 466046870 463176757 461179137 459936529 458920985
524.2D58920985j024544p31140J88649J302152J874328J912534J899153K123058K377570
$$ 458920985 457896441 457165301 457353950 458656102 460530430 462442964 464342117 466465175 468842745
542.5D68842745J872450L58015j098692j512200j027137m70370p37607j822502k605945
$$ 468842745 470715195 471073210 469974518 468462318 467435181 466964811 466227204 464404702 461798757
560.9D61798757k426296j905680j754552j952380k153844j681268p1645J753539K527386
$$ 461798757 459372461 457466781 455712229 453759849 451606005 449924737 449853092 451606631 454134017
579.2D54134017K342969K064884K263367K749443K806306J943410L57687p22289l81768
$$ 454134017 456476986 458541870 460805237 463554680 466360986 468304396 468662083 467939794 467558026
597.6D67558026O79881J064360L25918n89132n44727M05908J141220J034468L50356
$$ 467558026 468237907 469302267 469628185 469039053 468494326 468900234 470041454 471075922 471426278
616D71426278n2005P24227K386629L532380L163844K009660J441717J954288K836287
$$ 471426278 471374273 472098500 474485129 478017509 481181353 483191013 484632730 486587018 489423305
634.3D89423305K914578J895010O94841M72248J379728K121806J539082J61707o43551
$$ 489423305 492337883 494232893 494927734 495399982 496779710 498901516 500440598 500602305 499958754
652.7D99958754k26856R50277J567662P93517m08352n88059O25908K412498J822293
$$ 499958754 499731898 500682175 502249837 503043354 502635002 502046943 502672851 505085349 506907642
671E06907642P16269L04341O47783J755119K598047K136529N90384m80652j31428P38620
$$ 506907642 507623911 507928252 508576035 510331154 512929201 515065730 515656114 515175462 515044034 515782654
691.4E15782654P10190n17309j841962j767755q4460J817167K403319J702845J067817
$$ 515782654 516492844 515975535 514133573 512365818 512281358 514098525 516501844 518204689 519272506
709.8E19272506J640022L236294M418373M290640L453493L078819L838002N116284
$$ 519272506 520912528 524148822 528567195 532857835 536311328 539390147 543228149 548344433
726.1E48344433N389571M087687K318680J508177K023160K735198K276897O17385q38459
$$ 548344433 553734004 557821691 560140371 561648548 563671708 566406906 568683803 569301188 568462729
744.4E68462729q68797K05755Q13187p4685j715303k494990j708329k16007O33955
$$ 568462729 567593932 567799687 568612874 568538189 566822886 564327896 562619567 562403560 563037515
762.8E63037515N25713M47273J461804L549039N509258N970537M826009L581942L499984
$$ 563037515 563563228 564010501 565472305 569021344 574530602 580501139 585327148 588909090 592409074
781.2E92409074M221678M445672L259242J461565O79791J445174K829612L496825K944470
$$ 592409074 596630752 601076424 604335666 605797231 606477022 607922196 610751808 614248633 617193103
799.5F17193103K044082K032160K962947L593147K812207J066029k26498j24276Q02100
$$ 617193103 619237185 621269345 624232292 627825439 630637646 631703675 631477177 631352901 632155001
817.9F32155001R49800l88980k201915l063797k613962j725912j583457k494097l575921
$$ 632155001 633104801 632715821 630513906 627450109 624836147 623110235 621526778 619032681 615456760
836.2F15456760l579199k468944j514673j589596k226472k378762j562476l39210J90675
$$ 615456760 611877561 609408617 607893944 606304348 604077876 601699114 600136638 599797428 599988103
854.6E99988103k97785p68363K19762K742112N220711O249606N819440M832566M106760
$$ 599988103 599690318 598921955 599141717 601883829 607104540 613354146 619173586 624006152 628112912
872.9F28112912L557861K403736K68996k292037m129648m639983m413724m410148m909814
$$ 628112912 631670773 634074509 634343505 632051468 627921820 623281837 618868113 614457965 609548151
891.3F09548151n352139n127788m384815l940046m426062n591750o570638o831765
$$ 609548151 604196012 599068224 594683409 590743363 586317301 580725551 574154913 567323148
907.6E67323148o619155o498456o672263o688953n956292m435539k731443j593470
$$ 567323148 560703993 554205537 547533274 540844321 534888029 530452490 527721047 526127577
923.9E26127577j249790j246810r92358m62592j37508k76327o60538r64702j269161
$$ 526127577 524877787 523630977 522638619 522176027 522038519 521762192 521101654 520136952 518867791
942.3E18867791k182007m111827o589412q638233r668082r904266r956508j0172964
$$ 518867791 516685784 512573957 505984545 497346312 487678230 477773964 467817456 457644492
958.6D57644492j0468602j0579824j0373920r970040r535670r051889q329660p205516
$$ 457644492 447175890 436596066 426222146 416252106 406716436 397664547 389334887 382129371
974.9C82129371n735487m270702l192455k511918k027035j610518j276671j125455
$$ 382129371 376393884 372123182 368930727 366418809 364391774 362781256 361504585 360379130
991.2C60379130j138717j114786q39204l15755J66714K90245j9819n88208j105249
$$ 360379130 359240413 358125627 357286423 356970668 357137382 357427627 357407808 356819600 355714351
1009.6C55714351j383632j476825j583576j785666j923531j910955j862168j947075
$$ 355714351 354330719 352853894 351270318 349484652 347561121 345650166 343787998 341840923
1025.9C41840923k186239k360940k303392k110988j996368k081543k259880k297312
$$ 341840923 339654684 337293744 334990352 332879364 330882996 328801453 326541573 324244261
1042.2C24244261k088666j717836j299769r16540n50836l6687O44833J265138J686841
$$ 324244261 322155595 320437759 319137990 318221450 317670614 317633927 318278760 319543898 321230739
1060.6C21230739J965553K062023J847267J168579N0127r43661j126796l32057J045525
$$ 321230739 323196292 325258315 327105582 328274161 328324288 327380627 326253831 325921774 326967299
1078.9C26967299K468139L612846M301041M462928M342109M251957M191130L881961
$$ 326967299 329435438 333048284 337349325 341812253 346154362 350406319 354597449 358479410
1095.2C58479410L119409K167762J511782J343876J555235J894980K098769K194256
$$ 358479410 361598819 363766581 365278363 366622239 368177474 370072454 372171223 374365479
1111.6C74365479K438783K805412K927095K603769K020210J565218J606912K149939
$$ 374365479 376804262 379609674 382536769 385140538 387160748 388725966 390332878 392482817
1127.9C92482817K773673K945870K497077J826763J344055R42260L70592k91825p70449
$$ 392482817 395256490 398202360 400699437 402526200 403870255 404812515 405183107 404891282 404120833
1146.2D04120833q33631m75347O1125M82887P60764J191437K029061L154755M087239
$$ 404120833 403287202 402811855 402872980 403355867 404116631 405308068 407337129 410491884 414579123
1164.6D14579123M448116M437804M656554N442410O455601P065177P047414O691605
$$ 414579123 419027239 423465043 428121597 433564007 440019608 447084785 454132199 460823804
1180.9D60823804O442666O442487O339759N619943M206926K641558J526177R23932
$$ 460823804 467266470 473708957 480048716 485668659 489875585 492517143 494043320 494967252
1197.2D94967252M43637k28494r80377j344145j046896l24189K12222Q1450m76569
$$ 494967252 495410889 495182395 494202018 492857873 491810977 491486788 491699010 491780460 491303891
1215.6D91303891q25763p55846o24240q41379j450986k066314k257705j942813j423985
$$ 491303891 490478128 489722282 489098042 488256663 486805677 484739363 482481658 480538845 479114860
1233.9D79114860j112252j078844r47058l42787O23346J448989J766145J735091J752436
$$ 479114860 478002608 476923764 475976706 475633919 476257265 477706254 479472399 481207490 482959926
1252.3D82959926K019405K431840K652466K437175J993805J786947K005518K413273
$$ 482959926 484979331 487411171 490063637 492500812 494494617 496281564 498287082 500700355
1268.6E00700355K499759J988351J274526R62556J107216J352608J373529J104117
$$ 500700355 503200114 505188465 506462991 507425547 508532763 509885371 511258900 512363017
1284.9E12363017Q44657Q59976R90212Q03828J11282q35002j534104j674712j446962
$$ 512363017 513207674 514067650 515057862 515861690 515972972 515137970 513603866 511929154 510482192
1303.3E10482192j344919j609028j917958j815498j208543m18306J19209J85729l5108
$$ 510482192 509137273 507528245 505610287 503794789 502586246 502167940 502287149 502472878 502437770
1321.6E02437770k55584m55201q33988j502991k230823k545089k187937j484245r27448
$$ 502437770 502182186 501726985 500892997 499390006 497159183 494614094 492426157 490941912 490014464
1340D90014464p57724q44688r25064q91417q50141j004994j441777j952797k198845
$$ 490014464 489256740 488412052 487486988 486595571 485745430 484740436 483298659 481345862 479147017
1358.3D79147017k243608k543241l215313l799200l937185l389448k722054k689481
$$ 479147017 476903409 474360168 471144855 467345655 463408470 460019022 457296968 454607487
1374.7D54607487l114164l637374m062205l971189l162533k076209j207024o96719
$$ 454607487 451493323 447855949 443793744 439822555 436660022 434583813 433376789 432680070
1391D32680070m33564k53945O6995M12315O07074Q14050J151532J526058J875937K018004
$$ 432680070 432246506 431992561 432059556 432471871 433078945 433892995 435044527 436570585 438446522 440464526
1411.4D40464526J858801J754880K057105K595455K623886K408504K093762J541853
$$ 440464526 442323327 444078207 446135312 448730767 451354653 453763157 455856919 457398772
1427.7D57398772J045376O07670K65300j65999p13140o10083L7104O09576Q94905P78347
$$ 457398772 458444148 459051818 459317118 459151119 458437979 457827896 457865000 458474576 459369481 460147828
1448.1D60147828K94596L099N35310K026081L083586K559573K348065K868056L555716
$$ 460147828 460442424 460445523 460980833 463006914 466090500 468650073 470998138 473866194 477421910
1466.4D77421910M554539O446422Q632481Q509218O789387N530476M362285K840817
$$ 477421910 481976449 488422871 497055352 505564570 512353957 517884433 522246718 525087535
1482.8E25087535J014591o68466k262712l695309m318476n022883o375134o842584
$$ 525087535 526102126 525433660 523170948 519475639 515157163 510134280 503759146 496916562
1499.1D96916562o189912n537898o595492r839594j0044992q647442p978738o604641
$$ 496916562 490726650 485188752 478593260 468753666 458708674 450061232 442082494 435477853
1515.4D35477853m680664l012567k640456k912790k904594k975315k770662k530992
$$ 435477853 430797189 427784622 425144166 422231376 419326782 416351467 413580805 411049813
1531.7D11049813k552897k034008j141548p14422o08593j31637O93441J755058K869845
$$ 411049813 408496916 406462908 405321360 404606938 403998345 403866708 404560149 406315207 409185052
1550.1D09185052L666997M148543M443764N407066N555838L662497L161341L261029
$$ 409185052 412852049 417000592 421444356 426851422 432407260 436069757 439231098 442492127
1566.4D42492127L072679K810091K218813K001524J817465Q94457K88814J45734P4148
$$ 442492127 445564806 448374897 450593710 452595234 454412699 455307156 455595970 455741704 455815852
1584.7D55815852j68413o49899j307756j831323k270520k747685l394752m254550n076259
$$ 455815852 455647439 454997540 453689784 451858461 449587941 446840256 443445504 439190954 434114695
1603.1D34114695n709351o320059p219791p949591q166492r055793j0783673j0171979
$$ 434114695 428405344 422085285 414865494 406915903 398749411 389693618 378909945 368737966
1619.4C68737966r766728j1382967j1728108j1061430j0567278r297192q463859q713961
$$ 368737966 358971238 347588271 335860163 324798733 314231455 304934263 296470404 287756443
1635.7B87756443o747574l692239j793862m56929O45489J337021J511753K277046L361583
$$ 287756443 281008869 277316630 275522768 275065839 275711328 277048349 278560102 280837148 284198731
1654.1B84198731L136546L370672M582465N988240O808251O806404P736146Q841515
$$ 284198731 287335277 290705949 295288414 301276654 308084905 314891309 322627455 331468970
1670.4C31468970Q253187Q509546R313434Q897514Q729457J0055572J2496412J1679769
$$ 331468970 339722157 348231703 357545137 366442651 375172108 385227680 397724092 409403861
1686.7D09403861J0556042J1902451J2848884J5476793J7670989J7406374J8273861
$$ 409403861 419959903 431862354 444711238 460188031 477859020 495265394 513539255
1701E13539255J4928341J2140870J1666834R835780Q372485P572234P049143O665409
$$ 513539255 528467596 540608466 552275300 562111080 570483565 578055799 585104942 591770351
1717.3E91770351N301893L893196L499985L271401K709985K297818K070904K131939
$$ 591770351 597072244 600965440 604465425 607736826 610446811 612744629 614815533 616947472
1733.6F16947472J810551J453042J869499K473176L154397M159510N242407O188095
$$ 616947472 618758023 620211065 622080564 624553740 627708137 631867647 637110054 643298149
1749.9F43298149O534338O161928O340385O565451O151975N864381N171776M701913
$$ 643298149 649832487 655994415 662334800 668900251 675052226 680916607 686088383 690790296
1766.3F90790296M860639M848004M557430L641546K769947K811253L061652K846182
$$ 690790296 695650935 700498939 705056369 708697915 711467862 714279115 717340767 720186949
1782.6G20186949K361893J912237J823127K195656K419472J877308J352310J264513
$$ 720186949 722548842 724461079 726284206 728479862 730899334 732776642 734128952 735393465
1798.9G35393465J447856J634240J622558J440167J176715J057148J168668J447857
$$ 735393465 736841321 738475561 740098119 741538286 742715001 743772149 744940817 746388674
1815.2G46388674J505375J138568P76231R21369J363337J540660J302779O86348L25024
$$ 746388674 747894049 749032617 749808848 750730217 752093554 753634214 754936993 755623341 755948365
1833.6G55948365O27458J127422J240432R74178N99504L30031M86552R05157R73641
$$ 755948365 756575823 757703245 758943677 759917855 760517359 760847390 761333942 762239099 763212740
1851.9G63212740N49615J64449K54393P27772J046300Q82209M39286J28567K09689
$$ 763212740 763762355 763926804 764181197 764908969 765955269 766837478 767276764 767405331 767615020
1870.3G67615020N98312Q55803O06001J07526r477M36366R75370J047194N68092n901
$$ 767615020 768213332 769069135 769675136 769782662 769773185 770209551 771184921 772232115 772800207 772794306
1890.7G72794306l0756N06401R27270P44045J88767j82330L6001O27816R08732N05388
$$ 772794306 772763550 773269951 774197221 774941266 775130033 774947703 774983704 775611520 776520252 777025640
1911.1G77025640j31547k55585K41816P57277P38621K46465l08454l24667K56479P84218
$$ 777025640 776894093 776638508 776880324 777637601 778376222 778622687 778314233 777989566 778246045 779030263
1931.5G79030263O45936l3081m48405j31250N44608Q04424L54469k85447m49121K8611
$$ 779030263 779676199 779643118 779194713 779063463 779608071 780412495 780766964 780481517 780032396 780061007
1951.9G80061007O42836P56740K48671l24905l58880J99139P66039O73056j0192m90249
$$ 780061007 780703843 781460583 781709254 781384349 781025469 781224608 781990647 782663703 782653511 782163262
1972.3G82163262k54571L81708P43449M58896j87039n26727j76847M79997O94632K07543
$$ 782163262 781908691 782290399 783033848 783492744 783305705 782778978 782602131 783082128 783776760 783984303
1992.6G83984303m33087n09381J2398N59747N15461r2268o20783n26666N8651M70578
$$ 783984303 783551216 783041835 783054233 783613980 784129441 784037173 783416390 782889724 782948375 783418953
2013G83418953K38955l95715p63714m87089J36852L84331k9922o29127p71701l29256
$$ 783418953 783657908 783262193 782498479 782011390 782148242 782532573 782502651 781873524 781101823 780772567
2033.4G80772567K24829K87532k00569o62983n86092k9028M14908K84016k48134n93006
$$ 780772567 780997396 781284928 781084359 780421376 779835284 779806256 780221164 780505180 780257046 779664040
2053.8G79664040l52145K57731N81384K94208k40803m55022j01149M40061N56827J14679
$$ 779664040 779311895 779569626 780151010 780445218 780204415 779749393 779648244 780088305 780645132 780759811
2074.2G80759811m05013m36485P3969N59807M95136r537m15504k82347K54810O13451
$$ 780759811 780354798 779918313 779992282 780552089 781047225 781037688 780622184 780339837 780594647 781208098
2094.6G81208098L98874j47223m20153j06395M48406O11305K28167k62141l26395P9870
$$ 781208098 781606972 781459749 781039596 780933201 781381607 781992912 782221079 781958938 781632543 781712413
2115G81712413M93169M57823J2875l64602k62439K16782N39064L51906j27673l68416
$$ 781712413 782205582 782663405 782676280 782311678 782049239 782266021 782805085 783156991 783029318 782660902
2135.4G82660902j25289L26752M89295J83701k27272k73943P9453M61697M73321R2149
$$ 782660902 782535613 782862365 783351660 783535361 783308089 783034146 783113599 783575296 784048617 784140766
2155.8G84140766k29001j05679L47077O57440M97937P5579j10209J57594N96762P36773
$$ 784140766 783911765 783806086 784153163 784810603 785308540 785384119 785273910 785431504 786028266 786765039
2176.2G86765039M33266M2677j1921L23713O66261O27994K62022m8101K5749L91365
$$ 786765039 787198305 787240982 787229061 787552774 788219035 788847029 789109051 789060950 789086699 789478064
2196.6G89478064O27219M64559J04248j4901K20478N24699N80550L14891J1444O616
$$ 789478064 790105283 790569842 790674090 790659189 790879667 791404366 791984916 792299807 792311251 792317867
2217G92317867K64943M79042M18067J38224o3420M9889L35873M25696K11060o8247
$$ 792317867 792582810 793061852 793479919 793618143 793554723 793604612 793940485 794366181 794577241 794508994
2237.4G94508994j19925R2924L33786L57926J24693j37508j00375J86801L24667J88887
$$ 794508994 794389069 794481993 794815779 795173705 795298398 795160890 795060515 795247316 795571983 795760870
2257.8G95760870k4557j23143r239K20895L05056J16110j62840j90139Q0765L01718
$$ 795760870 795736313 795613170 795603931 795824826 796129882 796245992 796083152 795893013 795973778 796275496
2278.2G96275496K26915o2942k49446j18434J80304K93732N2988k42293k29001J9193
$$ 796275496 796502411 796439469 796190023 796071589 796251893 796545625 796598613 796356320 796127319 796146512
2298.6G96146512J95444J53482m5956j87754r2983J49190K55346P5698j80781j99914
$$ 796146512 796341956 796495438 796449482 796261728 796168745 796317935 796573281 796648979 796468198 796268284
2319G96268284M6313K68638K62141N4658j88351k22325l5465J07348o080k97427m23908
$$ 796268284 796314597 796583235 796845376 796900034 796711683 796489358 796453893 796561241 796555161 796257734 795833826
2341.4G95833826k85029k35796m45545n36680k78354J68502N05329N84304K31743l51072
$$ 795833826 795548797 795313001 794867456 794330776 794052422 794220924 794726253 795310557 795542300 795191228
2361.8G95191228p39634p42018m47631k66969n39362r47774j016855p36415m04239
$$ 795191228 794451594 793709576 793261945 792994976 792455614 791507840 790490985 789754570 789350331
2380.2G89350331l06010m83811p15256o92844l65198l2604n7757m20689o82712n70714
$$ 789350331 789044321 788560510 787845254 787152410 786787212 786754608 786696851 786276162 785593450 785022736
2400.6G85022736k76030j25229k78115o16729p97630o15716k83301j90734m43101p99895
$$ 785022736 784746706 784621477 784343362 783726633 782929003 782313287 782029986 781839252 781396151 780596256
2421G80596256q76486n77390l00169l78609o93738r09865q20399n02169k97785m41610
$$ 780596256 779719770 779142380 778842211 778463602 777769864 776859999 776039600 775537431 775239646 774798036
2441.3G74798036p84040r59098p65980m41670l48627n65708q57234r11653o41704l38673
$$ 774798036 774013996 773054898 772288918 771847248 771498621 770932913 770075679 769164026 768522322 768183649
2461.7G68183649l59238o44326q61525q06213n37455l36945m47273p50125r15110p54118
$$ 768183649 767824411 767180085 766318560 765512347 764974892 764637947 764190674 763440549 762525439 761771321
2482.1G61771321m15086k76447m90904p84158q14379n68926l15964l21210n76913q21233
$$ 761771321 761356235 761079788 760588884 759804726 758990347 758421421 758105457 757784247 757207334 756386101
2502.5G56386101p87794m76838k35259l36587o33181p86364o60419l92497k82287m89593
$$ 756386101 755598307 755121469 754886210 754549623 753916442 753130078 752469659 752077162 751794875 751305282
2522.9G51305282p81834q51452o67572m30704l69846n57125q05259q30173o32942m69625
$$ 751305282 750523448 749671996 749004424 748573720 748203874 747646749 746841490 746011317 745378375 744908750
2543.3G44908750m91023o69956q34584p76351n31495l91185n26249p43866q10206o78063
$$ 744908750 744417727 743747771 742913187 742136836 741605341 741214156 740687907 739944041 739133835 738455772
2563.7G38455772m70876m18186n72980p64012p96736o40273m65035m56929o20663p93517
$$ 738455772 737984896 737566710 736993730 736229718 735432982 734792709 734327674 733870745 733250082 732456565
2584.1G32456565q02994o26862m51863m71651o41823p61032p20263n72681m97163o26444
$$ 732456565 731653571 731026709 730574846 730103195 729461372 728700340 727980077 727407396 726910233 726283789
2604.5G26283789q56340r46582q18431o54399o50585q37684j052260j081824r46880
$$ 726283789 725427449 724480867 723662436 723008037 722357452 721519768 720467508 719385684 718438804
2622.9G18438804q67009r46879j104057j200736j140594j006306r41097r82821j112104
$$ 718438804 717571795 716624916 715520859 714320123 713179529 712173223 711232126 710249305 709137201
2641.2G09137201j229405j198709j057446r84550j050174j151502j150131j053751
$$ 709137201 707907796 706709087 705651641 704667091 703616917 702465415 701315284 700261533
2657.5G00261533r92238j024366j108110j158595j097023r67980r00924r57072j049876
$$ 700261533 699269295 698244929 697136819 695978224 694881201 693913221 693012297 692055225 691005349
2675.9F91005349j059353r65536q55207q54731r36150r93669r96292r49442r13680
$$ 691005349 689945996 688980460 688125253 687270522 686334372 685340703 684344411 683394969 682481289
2694.3F82481289r47058j011968j080811j130044j088798j026452j058698j158595
$$ 682481289 681534231 680522263 679441452 678311408 677222610 676196158 675137460 673978865
2710.6F73978865j224339j192033j109839j083135j146198j199960j150728j039147
$$ 673978865 672754526 671562493 670452654 669369519 668223321 667023361 665872633 664833486
2726.9F64833486r60469r46403j000941j040935r93073r42111r30131r55045r98914
$$ 664833486 663873017 662926614 661925673 660884738 659891665 658949554 658019423 657064378 656065464
2745.2F56065464r70483q66115q26776q77321r18388r65118r86577r05573q42988r21488
$$ 656065464 655094981 654228866 653402090 652524769 651606381 650641263 649654686 648749113 647906125 646984637
2765.6F46984637j013875j016557j016736j028061j005829j039862j151026j221656
$$ 646984637 645970762 644954205 643937469 642909408 641903579 640863717 639712691 638491035
2782F38491035j235664j253546j298070j359999j412213j450896j477480j492202j531720
$$ 638491035 637255371 636001825 634703755 633343756 631931543 630480647 629003167 627510965 625979245
2800.3F25979245j627565j730501j768649j745999j747072j852452k001882k051175
$$ 625979245 624351680 622621179 620852530 619106531 617359459 615507007 613505125 611453950
2816.6F11453950k035260k078950k178967k308548k458334k577781k681315k852261
$$ 611453950 609418690 607339740 605160773 602852225 600393891 597816110 595134795 592282534
2832.9E92282534l080428l372908l812909m398465n118728n969882o723463o952107
$$ 592282534 589202106 585829198 582016289 577617824 572499096 566529214 559805751 552853644
2849.3E52853644o385267n092025l458857k094090j482845j660525k311588l103256
$$ 552853644 546468377 541376352 537917495 535823405 534340560 532680035 530368447 527265191
2865.6E27265191l777206m083276l861367l193081k370000j691162j282990j120091
$$ 527265191 523487985 519404709 515543342 512350261 509980261 508289099 507006109 505886018
2881.9E05886018j138746j236856j345695j476407j674860j941949k172620k334743
$$ 505886018 504747272 503510416 502164721 500688314 499013454 497071505 494898885 492564142
2898.2D92564142k506227k756923l122926l550738l994375m496634n078852n637020
$$ 492564142 490057915 487300992 484178066 480627328 476632953 472136319 467057467 461420447
2914.5D61420447n984158n975723n496979m535973l274500j936287o30647O43045J881957
$$ 461420447 455436289 449460566 443963587 439427614 436153114 434216827 433586180 434229225 436111182
2932.9D36111182L020942L957600M595697M845231M681230M186928L436148K560139
$$ 436111182 439132124 443089724 447685421 452530652 457211882 461398810 464834958 467395097
2949.2D67395097J753032J149476R21756J183957J819998K592563L336609M070163
$$ 467395097 469148129 470297605 471219361 472403318 474223316 476815879 480152488 484222651
2965.5D84222651M795581N372524N718678N827367N750835N610705N404532N068302
$$ 484222651 489018232 494390756 500109434 505936801 511687636 517298341 522702873 527771175
2981.8E27771175M644275M139125L596008L091395K558648J974404J364172P15971
$$ 527771175 532415450 536554575 540150583 543241978 545800626 547775030 549139202 549855173
2998.1E49855173J20937l51548p36356j008808j134336j150489j091182r61006q56101
$$ 549855173 549976110 549624562 548888206 547879398 546745062 545594573 544503391 543542385 542686284
3016.5E42686284r13620j131118j439810j741528j908660j926780j902520j945258
$$ 542686284 541772664 540641546 539201736 537460208 535551548 533624768 531722248 529776990
3032.8E29776990k044022k131104k203643k267182k326250k375842k406716k437055
$$ 529776990 527732968 525601864 523398221 521131039 518804789 516428947 514022231 511585176
3049.1E11585176k445638k419293k414405k451778k434730k297760k150326k074183
$$ 511585176 509139538 506720245 504305840 501854062 499419332 497121572 494971246 492897063
3065.5D92897063j972258j829356j726210j654148j599729j550346j514644j485675
$$ 492897063 490924805 489095449 487369239 485715091 484115362 482565016 481050372 479564697
3081.8D79564697j412273j338065j285851j206964j142800j139909j156300j183748
$$ 479564697 478152424 476814359 475528508 474321544 473178744 472038835 470882535 469698787
3098.1D69698787j221150j253426j313389j380741j401842j417041j460880j514792
$$ 469698787 468477637 467224211 465910822 464530081 463128239 461711198 460250318 458735526
3114.4D58735526j574457j631379j680851j719237j743704j797408j889824j959891
$$ 458735526 457161069 455529690 453848839 452129602 450385898 448588490 446698666 444738775
3130.7D44738775j988321k006322k032787k043247k056122k110183k148628k147228
$$ 444738775 442750454 440744132 438711345 436668098 434611976 432501793 430353165 428205937
3147D28205937k129465k100289k133548k229363k251953k216965k226442k271682k297312
$$ 428205937 426076472 423976183 421842635 419613272 417361319 415144354 412917912 410646230 408348918
3165.4D08348918k288640k268910k247632k235919k253294k282589k269716k230465
$$ 408348918 406060278 403791368 401543736 399307817 397054523 394771934 392502218 390271753
3181.7C90271753k213448k230406k237856k191157k154052k142697k086461k038717
$$ 390271753 388058305 385827899 383590043 381398886 379244834 377102137 375015676 372976959
3198C72976959k037734j975894j914352j928687j926899j893282j867086j844942j818598
$$ 372976959 370939225 368963331 367048979 365120292 363193393 361300111 359433025 357588083 355769485
3216.4C55769485j791775j766860j785309j828819j824349j821876j879662j932442
$$ 355769485 353977710 352210850 350425541 348596722 346772373 344950497 343070835 341138393
3232.7C41138393j966447k024531k063781k065152k100051k188056k235324k244144
$$ 341138393 339171946 337147415 335083634 333018482 330918431 328730375 326495051 324250907
3249C24250907k275437k308459k330750k359718k385437k345056k256482k196223k154142
$$ 324250907 321975470 319667011 317336261 314976543 312591106 310246050 307989568 305793345 303639203
3267.4C03639203k061665j933276j835674j736463j603722j458049j320869j187443
$$ 303639203 301577538 299644262 297808588 296072125 294468403 293010354 291689485 290502042
3283.7B90502042j037926q98033q11667p69048o87540n42611l98844l17663l13282
$$ 290502042 289464116 288566083 287754416 286985368 286297828 285755217 285356373 285038710 284725428
3302B84725428l16650l14623k95431k04891j45852j45495j22428j14858j19031j14143
$$ 284725428 284408778 284094155 283798724 283593833 283447981 283302486 283180058 283065200 282946169 282832026
3322.4B82832026j41054j77622j69396j38819j48565j87367k14636k51174l27439l77684
$$ 282832026 282690972 282513350 282343954 282205135 282056570 281869203 281654567 281403393 281075954 280698270
3342.8B80698270l77208l57777l35634l77029m76271n42015n26756m82023m56124m51297
$$ 280698270 280321062 279963285 279627651 279250622 278774351 278232336 277705580 277223557 276767433 276316136
3363.2B76316136m65900m73320m65989n13911n94348n74917m76479l99620l72648l40521
$$ 276316136 275850236 275376916 274910927 274397016 273802668 273227751 272751272 272351652 271979004 271638483
3383.6B71638483l00795k49296j75924j83224k34366j89572o5744k0832j43677k43783
$$ 271638483 271337688 271088392 270912468 270729244 270494878 270305306 270239562 270218730 270075053 269831270
3404B69831270j02043R0778J14500P7844J12861J91272K70783L26306L65585M78983
$$ 269831270 269729227 269820005 269934505 270012349 270125210 270316482 270587265 270913571 271279156 271758139
3424.4B71758139O35058P50512P80672Q19176R12100Q62390P25776P79271R65983J086890
$$ 271758139 272393197 273143709 273924381 274743557 275655657 276518047 277243823 278023094 278989077 280075967
3444.8B80075967J137734J134246J153261J243561J346618J430452J479745J470447
$$ 280075967 281213701 282347947 283501208 284744769 286091387 287521839 289001584 290472031
3461.1B90472031J511722J675457J762092J587659J347334J408577J680761J889348
$$ 290472031 291983753 293659210 295421302 297008961 298356295 299764872 301445633 303334981
3477.4C03334981J913578J793622J779080J945943K052813K018273J965285J929074
$$ 303334981 305248559 307042181 308821261 310767204 312820017 314838290 316803575 318732649
3493.8C18732649K013296K146363K182901K147287K036155J967430K100080K293289
$$ 318732649 320745945 322892308 325075209 327222496 329258651 331226081 333326161 335619450
3510.1C35619450K378970K324879K199024K210051K389312K577424K545893K387017
$$ 335619450 337998420 340323299 342522323 344732374 347121686 349699110 352245003 354632020
3526.4C54632020K396822K552450K694547K792150K783447K673417K718091K923698
$$ 354632020 357028842 359581292 362275839 365067989 367851436 370524853 373242944 376166642
3542.7C76166642L085702K999962K813041K868921L050386L109396L146380L306449
$$ 376166642 379252344 382252306 385065347 387934268 390984654 394094050 397240430 400546879
3559D00546879L422051L339917L339499L684670L815263L563047L543555L787429L957390
$$ 400546879 403968930 407308847 410648346 414333016 418148279 421711326 425254881 429042310 432999700
3577.4D32999700M039318M114777M156768M217386M289270M208475M093856M246890
$$ 432999700 437039018 441153795 445310563 449527949 453817219 458025694 462119550 466366440
3593.7D66366440M424453M442990M474520M492879M417420M355937M458725M498959
$$ 466366440 470790893 475233883 479708403 484201282 488618702 492974639 497433364 501932323
3610E01932323M484296M568994M485369M525721M675686M332066M031479M208326M796446
$$ 501932323 506416619 510985613 515470982 519996703 524672389 529004455 533035934 537244260 542040706
3628.4E42040706M807830M009246L854037M027486M013598M006326L953457L859162
$$ 542040706 546848536 550857782 554711819 558739305 562752903 566759229 570712686 574571848
3644.7E74571848M018247M492581M315734L346562L058613L515839L546059L235400
$$ 574571848 578590095 583082676 587398410 590744972 593803585 597319424 600865483 604100883
3661F04100883L118932L074348K995074L141820L261805K875626K771855K657353K196908
$$ 604100883 607219815 610294163 613289237 616431057 619692862 622568488 625340343 627997696 630194604
3679.4F30194604K131224K279461K396583K643347K618253J976967J589417J708329
$$ 630194604 632325828 634605289 637001872 639645219 642263472 644240439 645829856 647538185
3695.7F47538185J817525J745879J634896J496553J455963J579225J623690J466096
$$ 647538185 649355710 651101589 652736485 654233038 655689001 657268226 658891916 660358012
3712F60358012J138746R74656J186847J397133J289964J027048Q96692R79662J163840
$$ 660358012 661496758 662471414 663658261 665055394 666345358 667372406 668269098 669248760 670412600
3730.3F70412600J363516J364827R98497O13332N51581Q19743J247048J102507P41423
$$ 670412600 671776116 673140943 674139440 674752772 675304353 676124096 677371144 678473651 679215074
3748.7F79215074Q29875P95960O26624O40035O60777O25849O65724Q03351Q26955P31647
$$ 679215074 680044949 680840909 681467533 682107568 682768345 683394194 684059918 684863269 685690224 686421871
3769.1F86421871N81324M56155N95390Q42751Q65817O20961M32431M98295N94437O10948
$$ 686421871 687003195 687459350 688054740 688897491 689763308 690384269 690816700 691314995 691909432 692520380
3789.5F92520380O19888O32167O61433O39319O49989P60734N23686K86758M26054M27425
$$ 692520380 693140268 693772435 694433868 695073187 695723176 696483910 697007596 697294354 697720408 698147833
3809.9F98147833L62754N05328P58648O96957M99487N06163L08454K04146L19421L58522
$$ 698147833 698510587 699015915 699774563 700471520 700971007 701477170 701785624 701989770 702309191 702667713
3830.3G02667713M58419O60062P27773N71728K83599Q7380J03176K20477L62158N22435
$$ 702667713 703126132 703786194 704513967 705085695 705369294 705456674 705559850 705780327 706142485 706664920
3850.7G06664920P20441N65589P9035L1949K80976M38332L79503J84894K39074L89636
$$ 706664920 707385361 707950950 708029985 708061934 708342910 708781242 709160745 709345639 709584713 709974349
3871.1G09974349K17676R3758J40011L06845M29034L57091L57807J85251M8459K85864
$$ 709974349 710192025 710285783 710425794 710732639 711161673 711518764 711876571 712061822 712110281 712396145
3891.5G12396145K97963J11998J92046L20554L00288K46405R6739j17839q2910J02759
$$ 712396145 712694108 712806106 712998152 713318706 713618994 713865399 713962138 713844299 713761389 713864148
3911.9G13864148J76251K74896L34561J70648n841K086Q6725J35362K23160K64048
$$ 713864148 714040399 714315295 714649856 714820504 714814663 714816749 714903474 715038836 715261996 715526044
3932.3G15526044J25468M888K9862J44720K42591J54078M4763J23560K00570J42574
$$ 715526044 715651512 715656400 715686262 715830982 716073573 716227651 716272414 716395974 716596544 716739118
3952.7G16739118O0678N8472J24931J93060J78873O4910J7404J08719J44482R0122
$$ 716739118 716799796 716858268 716983199 717176259 717355132 717420042 717437446 717546165 717690647 717780769
3973.1G17780769R9659J19090R2864J26421J58072J29104J32799J51932J28806Q4757
$$ 717780769 717880428 717999518 718092382 718218803 718376875 718505979 718638778 718790710 718919516 719004273
3993.4G19004273R0659J37091
$$ 719004273 719094932 719232023
3997.5G19232023
$$ 719232023
##END=$$ End of the data block
