##TITLE=G14-52-CE $$ Begin of the data block
##JCAMP-DX=5.00 $$ ACD/SpecManager v 10.08
##SPECTROMETER/DATA SYSTEM=Alpha
##DATE=17 Oct 2013 10:58:30
##DATA TYPE=INFRARED SPECTRUM
##DATA CLASS=XYDATA
##ORIGIN=
##OWNER=
##NPOINTS=1765
##FIRSTX=399.75695801
##LASTX=3997.56933594
##MAXX=3997.56933594
##MINX=399.75695801
##MAXY=0.81753284
##MINY=0.25167173
##XFACTOR=1.0000000000
##YFACTOR=1.000000000000000e-9
##FIRSTY=0.51932871
##DELTAX=2.03957629
##XUNITS=1/CM
##YUNITS=ARBITRARY UNITS
##XYDATA=(X++(Y..Y))
399.8 519328713 517478228 515838861 514132679 512888968 512744725 513292432 513567030 513314068 512690961
418.1 512690961 511742592 510761261 509781420 508514345 507133782 506028771 504994154 503739119 502675891
436.5 502675891 502585113 503704131 505310118 506383419 506742120 506865799 507037282 506966174 506258130 504787207
456.9 504787207 502834857 501051903 499353081 497243643 494641930 492051661 490039527 488457084
473.2 488457084 486860394 485268205 484002084 483291894 482988447 482412785 481269062 480042726 478947192
491.5 478947192 477662414 475908250 473709881 471464604 469392300 467169464 464592814 461719364
507.9 461719364 458820224 456318170 454129457 451724231 448997587 446410060 444544584 443710655 443443537
526.2 443443537 443049520 442736208 443228155 444736123 446826905 448882341 450615138 452110559 453233093
544.6 453233093 453633428 453164220 452080339 450905234 449836165 448634446 447137922 445375234 443460703
562.9 443460703 441504300 439357132 437092125 435295194 434585780 435108483 436337739 437834561 439718515
581.3 439718515 442178309 445008695 447622001 449521244 450673759 451229125 451495051 451781243 451953948
599.6 451953948 451903641 451826483 451903641 452177942 452610880 453121603 453599244 454040259 454721332 455993056
620 455993056 457916409 460277975 462846518 465606421 468445450 470970660 473057896 474990338 476897836
638.4 476897836 478746146 480485559 482009888 483259201 484267265 485084623 485737503 486174941 486373305
656.7 486373305 486541092 486896068 487351179 487979114 489434987 491143376 491716921 492581338 494208843
675.1 494208843 495905131 497422040 498986036 500536203 501716256 502388000 502734184 502877355 502676547
693.5 502676547 501982272 500953019 500207067 500354826 501466870 503109455 504922271 507013619 509660363
711.8 509660363 512903631 516506970 520276785 524234116 528454721 532921672 537387729 541443467
728.1 541443467 545044065 548351765 551293015 553677082 555357337 556412458 557111382 557697952 558056831
746.5 558056831 557968855 557530463 556963980 556315184 555496275 554529428 553605020 553103387 553509533 555069327
766.9 555069327 557684004 561244607 565588892 570382476 575286686 579947770 584093750 587698936
783.2 587698936 590792894 593394935 595632017 597564280 599301577 601143360 603434622 606243670
799.5 606243670 609259129 612158656 614856839 617373407 619530737 621044278 621905148 622418523 622761786
817.9 622761786 622726679 621948004 620420754 618466318 616340876 614188433 611953735 609527111 607007504
836.2 607007504 604632437 602410555 600182891 598058283 596368372 595260739 594487548 593762219 593097925
854.6 593097925 592694581 592874527 594098091 596756816 600848615 605985105 611576617 616800249 620882154
872.9 620882154 623525083 624738455 624451935 622536838 619104862 614644349 609834433 605071366 600336909
891.3 600336909 595639586 591148317 586926520 582822442 578465462 573440969 567667484 561400712
907.6 561400712 554889858 548235238 541574836 535310149 529940069 525763392 522830248 520883679
923.9 520883679 519460559 518262088 517257869 516424417 515586793 514582336 513468087 512327552 510821998
942.3 510821998 508132160 503473401 496723562 488465339 479420245 469967186 460207582 450270444
958.6 450270444 440311313 430399179 420573890 410895467 401509941 392715812 384830445 377964497
974.9 377964497 372064769 367090970 363020271 359779537 357118040 354692727 352376848 350245088
991.2 350245088 348341912 346689403 345373809 344486296 344014853 343787551 343474984 342709750 341319293
1009.6 341319293 339442939 337420315 335469216 333543360 331549108 329473555 327303380 325012773
1025.9 325012773 322653443 320319146 318043798 315817505 313640386 311497599 309358329 307219326
1042.2 307219326 305174738 303366065 301879883 300808549 300272346 300351053 300999284 302093089 303547263
1060.6 303547263 305308610 307261020 309074968 310151964 310062319 309108615 308229685 308326036 309725285
1078.9 309725285 312329650 315898776 320102215 324656337 329357326 333913088 338019937 341567367
1095.2 341567367 344538212 346880645 348629117 350026518 351435184 353168905 355357856 357942373
1111.6 357942373 360766470 363683552 366572380 369293094 371752709 373986602 376163781 378482372
1127.9 378482372 381104618 383997291 386818796 389158934 390764445 391599655 391818374 391660005 391321242
1146.2 391321242 390910447 390540391 390410125 390760392 391764760 393511176 396093100 399577320 403875083
1164.6 403875083 408773631 414071620 419726044 425869793 432625055 439874828 447284102 454576433
1180.9 454576433 461613744 468256861 474326491 479558855 483640254 486413598 487971753 488521308
1197.2 488521308 488257557 487398893 486195415 484963119 484006822 483368129 482825607 482182622 481384993
1215.6 481384993 480447650 479366392 478029370 476319999 474292606 472147167 470048785 468039513
1231.9 468039513 466145188 464524031 463382006 462822616 462830156 463332027 464332998 465869248 467855930
1250.3 467855930 470087409 472369283 474602938 476844728 479187429 481545001 483779579 485905379
1266.6 485905379 488041520 490211964 492226690 493831307 495011926 496009916 497087747 498337418
1282.9 498337418 499669373 500961125 502151787 503173530 503820837 503861427 503203809 501984000 500457287
1301.2 500457287 498787016 496985734 495053589 493178546 491628736 490527213 489855915 489588469 489683688
1319.6 489683688 490013897 490267366 490010977 488968372 487212002 485090703 482981622 481115490 479538292
1338 479538292 478296131 477436155 476845026 476309061 475602418 474529803 473104566 471502870 469776958
1356.3 469776958 467815161 465406597 462360084 458764255 454922289 451131403 447816223 444878340
1372.6 444878340 441784769 438430130 434845477 430974245 427073687 423692912 421233475 419829905
1388.9 419829905 419180900 418787688 418468684 418375611 418605775 419206947 420218498 421657264 423367411
1407.3 423367411 425151825 426959515 428797930 430744022 432979077 435627133 438207686 440559745
1423.6 440559745 442763299 444565535 445779830 446316779 446251959 445728272 445134819 444984585 445292711
1442 445292711 445849568 446536154 447306871 447996914 448485136 449184567 451089501 454449505 457802981
1460.3 457802981 460874975 464259267 468227863 472992569 479381174 488084495 497202039 504756033
1476.6 504756033 510685503 515000463 517665327 518623352 517928839 515490472 511447072 506678462 501098037
1495 501098037 494278699 487329960 480969161 474775523 466940492 455952704 445717752 437060475
1511.3 437060475 428687930 421396196 416107178 412852287 410226643 407379329 404379398 401221514
1527.6 401221514 398389012 395797402 393154979 391085804 389683038 388402849 387669057 387972951 389167100
1546 389167100 391210258 394131154 397817463 402031958 406430423 411661774 417524606 421796650 425275743
1564.3 425275743 428644687 431761444 434574038 436684638 438285857 439625651 440427482 440702826 440556645
1582.7 440556645 440100998 439332753 438192666 436568081 434467167 431836843 428666532 424920321 420438647
1601.1 420438647 415212363 409356147 402827352 395360738 387218118 378896117 369595051 358548015
1617.4 358548015 348238558 338276327 326684922 314971656 304066986 293693542 284557343 276101559
1633.7 276101559 267337322 260782897 257425874 255895406 255546302 256179780 257662892 259432018 261765301
1652 261765301 265274107 268894255 272663116 277470946 283692449 290880919 298042148 305970252 315061331
1670.4 315061331 323743612 332703590 342458218 351770848 360794097 371033251 383942783 396390229
1686.7 396390229 407682329 420241028 433710068 449825197 468198508 486225367 505209446
1701 505209446 520974278 533832908 546097219 556334257 564801097 572221398 579039991 585668623
1717.3 585668623 591257274 595412254 598928392 602096260 604645252 606661916 608307898 610011995
1733.6 610011995 611852229 613582969 615616560 618305206 621788502 626212120 631561697 637889385
1749.9 637889385 644890547 651684165 658521414 665418983 671822906 678150117 684161007 689683497
1766.3 689683497 694993794 699928582 704646528 709037840 712829113 716288686 719453335 722205460
1782.6 722205460 724738479 727239609 729585171 731675982 733644724 735484719 737294137 739140213
1798.9 739140213 740899026 742464721 743929744 745476604 747081757 748546302 749740839 750885546
1815.2 750885546 752219617 753675580 754931569 755925477 756919503 758060157 759314775 760473251 761356115
1833.6 761356115 762117803 763035357 764060915 764940619 765618265 766304135 767124176 767986357 768706620
1851.9 768706620 769212425 769702137 770365298 771156013 771842897 772297144 772639751 773146510 773849726 774473548
1872.3 774473548 774910212 775292397 775801718 776421964 777013958 777498662 777917027 778393745 778975368 779533446
1892.7 779533446 779963493 780322850 780707240 781131685 781521082 781847358 782136858 782431662 782761395 783083081
1913.1 783083081 783344805 783571780 783824325 784080923 784357727 784666419 784934521 785140812 785324752 785508275
1933.5 785508275 785674274 785820067 785951555 786089301 786249638 786423922 786583006 786717057 786858916 787046373
1953.9 787046373 787272215 787465513 787606120 787746727 787921131 788112104 788298488 788443923 788563251 788711190
1974.3 788711190 788854301 788961112 789044261 789109588 789146304 789189041 789267540 789355159 789420724 789472878 789548755
1996.7 789548755 789636374 789684296 789661527 789594233 789505899 789417028 789334774 789239228 789077818 788846195 788654983
2019.2 788654983 788519323 788354039 788127661 787857592 787593067 787402391 787237942 787007987 786733508 786507666
2039.6 786507666 786390483 786324441 786203027 786013484 785878837 785881281 785958648 785966396 785876632 785839796 785927474
2062 785927474 786032856 786074996 786101878 786165893 786298335 786463618 786552966 786522150 786510944 786646366 786815703
2084.4 786815703 786870301 786830485 786850512 787025809 787259281 787382543 787392139 787423909 787580192 787819088 787988842
2106.9 787988842 788033485 788048804 788172424 788402855 788565695 788567007 788535118 788624287 788830161 788992107 788999081
2129.3 788999081 788970530 789074898 789313316 789507627 789520562 789468944 789546967 789740086 789922476 790039539
2149.7 790039539 790115237 790227950 790416181 790613055 790760040 790914237 791154504 791490912 791850984 792174101
2170.1 792174101 792484343 792819738 793189108 793549180 793863654 794179976 794544816 794914782 795234323 795527339
2190.5 795527339 795831323 796136320 796440899 796748281 797012746 797254145 797551572 797873735 798164904 798438549
2210.9 798438549 798699856 798954248 799223840 799487591 799712598 799935758 800176859 800387442 800555706 800716817
2231.3 800716817 800890982 801053524 801186383 801291883 801370680 801489711 801678002 801835179 801892638 801934063
2251.7 801934063 802057922 802220166 802358091 802452445 802523673 802633047 802781284 802931309 803013086 802990198
2272.1 802990198 802983105 803063154 803104877 803005993 802872360 802904725 803135633 803412557 803590596 803671181 803813756
2294.5 803813756 804125667 804492176 804729640 804882526 805193543 805783987 806509495 807102978 807481706 807873368
2314.9 807873368 808554113 809572518 810656309 811410189 811933458 812634408 813449681 813887298 813824117
2333.3 813824117 813766181 813966155 814213037 814197123 813407898 811383903 809272528 808787167 810272336
2351.6 810272336 812847674 815270960 816931903 817532837 817056656 815718472 813794136 811420977 808773935
2370 808773935 806130946 803656757 801408350 799361646 797489524 795854926 794548631 793609023 792982638
2388.3 792982638 792538345 792148888 791752160 791354239 790969729 790582836 790157020 789668024 789142251 788636804
2408.7 788636804 788163841 787670374 787136793 786579669 786023021 785471618 784890592 784280479 783658803 783031225
2429.1 783031225 782403231 781768441 781116784 780453205 779805958 779196382 778587580 777922332 777216673 776522219
2449.5 776522219 775843382 775146663 774448872 773814440 773221612 772607267 771974027 771305680 770611703 769972265
2469.9 769972265 769377053 768742383 768053651 767371118 766730487 766119719 765514910 764872253 764202714 763587117
2490.3 763587117 763045192 762501180 761904359 761272430 760662735 760112226 759582758 759018838 758414030 757846296
2510.7 757846296 757354856 756837845 756213725 755547345 754960537 754457831 753937185 753304362 752574980 751908660
2531.1 751908660 751370311 750811040 750098050 749300897 748607218 748058677 747499168 746812224 746059954 745372713
2551.5 745372713 744799078 744265318 743643045 742905438 742184043 741593659 741072655 740463793 739736140 739037573
2571.9 739037573 738463223 737931967 737314761 736559391 735786319 735160172 734635890 734028101 733290672 732572258
2592.3 732572258 731980324 731443465 730818272 730049789 729226053 728470147 727797210 727088034 726239920 725313187
2612.7 725313187 724439859 723648250 722798169 721758246 720611930 719517887 718527973 717569232 716519415
2631 716519415 715372384 714241922 713199854 712173939 711044014 709834337 708682716 707641304 706621647
2649.4 706621647 705502510 704294682 703128695 702075422 701076925 700029492 698916972 697812557
2665.7 697812557 696762145 695756316 694746852 693671942 692565203 691537082 690606773 689680398 688699067
2684.1 688699067 687708199 686761737 685853899 684914887 683896482 682842135 681808829 680799365 679748774
2702.4 679748774 678632319 677504241 676370561 675202250 674008131 672796428 671585321 670400262
2718.7 670400262 669232607 668074071 666936576 665819705 664735556 663704813 662689984 661664665
2735 661664665 660659671 659680426 658715069 657781065 656860232 655907393 654927611 653954685 653019369 652111709
2755.4 652111709 651205838 650284588 649313450 648299336 647295177 646326303 645354033 644324064 643234193
2773.8 643234193 642108440 640953660 639765620 638532043 637245953 635922968 634575069 633206606
2790.1 633206606 631801248 630303860 628727019 627145648 625567734 623934984 622184932 620339096
2806.4 620339096 618477345 616621792 614719927 612713456 610633492 608522832 606323063 603991091
2822.7 603991091 601568580 599051118 596397638 593618214 590675175 587475002 583931029 579916894
2839.1 579916894 575284362 569871604 563560486 556526482 549319327 542687833 537358522 533688664
2855.4 533688664 531400979 529735744 527903795 525414348 522118509 518157721 513934553 509999871
2871.7 509999871 506773531 504362285 502634466 501345694 500243425 499130726 497872502 496421218
2888 496421218 494786441 492956072 490938991 488730013 486261278 483542353 480613798 477396339 473765224
2906.4 473765224 469628513 464901716 459564924 453735679 447644234 441627979 436121941 431559384
2922.7 431559384 428243667 426305652 425736368 426432431 428301156 431301177 435311973 440020323 444977611
2941 444977611 449752390 453992218 457440645 460007310 461760640 462902188 463814497 464997232 466830969
2959.4 466830969 469483823 472972602 477215171 482142329 487689197 493667215 499806285 505890429
2975.7 505890429 511828303 517552674 522903621 527750432 532083333 535904527 539188743 541914642
2992 541914642 544031322 545504272 546362877 546651006 546387494 545636594 544585228 543451428 542382777
3010.4 542382777 541418731 540549636 539722919 538803756 537663162 536212623 534444928 532473803 530488789
3028.7 530488789 528581619 526646852 524600863 522463500 520254970 517983973 515656352 513274550
3045.1 513274550 510821402 508312464 505806983 503301501 500781655 498288602 495839328 493470073
3061.4 493470073 491269261 489231259 487291992 485443205 483676553 481979817 480367601 478826970
3077.7 478826970 477289885 475770235 474347085 473013788 471758097 470575422 469409376 468234926
3094 468234926 467070043 465897799 464694500 463436812 462093115 460708290 459323138 457873523 456342489
3112.4 456342489 454771370 453162640 451507986 449767947 447932541 446066201 444188356 442265809
3128.7 442265809 440290123 438268453 436206430 434113950 431998402 429852098 427654743 425395250
3145 425395250 423096389 420827836 418606907 416329384 413950026 411565185 409218639 406867236 404502541
3163.4 404502541 402127922 399733007 397346228 394981593 392601520 390186787 387762725 385369360
3179.7 385369360 382984012 380582660 378201276 375862181 373576880 371314853 369030654 366746396
3196 366746396 364499480 362314403 360198885 358120441 356059551 354036689 352058738 350090712 348104209
3214.3 348104209 346124321 344176799 342244446 340313792 338360131 336356252 334344178 332362801
3230.7 332362801 330370128 328283846 326103508 323904216 321684271 319401920 317068726 314701110
3247 314701110 312271059 309801847 307342827 304839253 302277625 299758643 297301441 294877738 292511731
3265.3 292511731 290203601 287969440 285862058 283897668 282075256 280402690 278873056 277472883
3281.6 277472883 276200444 275080413 274097621 273181915 272338063 271599889 270972848 270473629 270075828
3300 270075828 269725084 269398123 269070834 268753380 268488199 268265009 268060029 267883778 267747909 267607987
3320.4 267607987 267406315 267190307 266979635 266730756 266505480 266336024 266149402 265895754 265569985 265182644
3340.8 265182644 264773339 264348835 263873279 263374299 262867332 262314588 261713505 261135340 260609686 260061830
3361.2 260061830 259494096 258984625 258497655 257930517 257268369 256596446 255995035 255463034 254958689 254479349
3381.6 254479349 254077971 253741175 253475875 253314286 253093600 252705067 252359003 252237111 252224773 252117217
3402 252117217 251865447 251671731 251691014 251815468 251918584 252010107 252135396 252324402 252611697 252996653
3422.4 252996653 253485054 254099786 254832119 255618870 256486177 257444918 258310050 259038985 259850442 260843188
3442.8 260843188 261940867 263122559 264367729 265640259 266940266 268335819 269868165 271445364
3459.1 271445364 272980452 274556279 276311457 278184712 279938877 281482667 283047467 284818232
3475.4 284818232 286792845 288854092 290834606 292782128 294844240 296958089 299059033 301222205
3491.7 301222205 303421974 305634707 307871580 310149759 312477857 314738929 316901326 319146127
3508 319146127 321569115 324104607 326636434 329085320 331532776 334096551 336821824 339567125 342190385
3526.4 342190385 344805807 347569972 350476623 353460222 356453598 359414607 362465769 365691632
3542.7 365691632 368986398 372171491 375290275 378525794 381893009 385309696 388793290 392393827
3559 392393827 396047145 399654299 403277874 407201856 411351353 415400535 419427007 423635781 427999467
3577.4 427999467 432439327 436934769 441424102 445941418 450604945 455310941 459893167 464568734
3593.7 464568734 469470948 474423081 479279101 484041005 488750577 493407339 498136818 502960086
3610 502960086 507825911 512779117 517660916 522577941 527779520 532817185 537388563 541694403 546310902
3628.4 546310902 551335752 555995464 560394347 564781308 569098234 573340893 577458501 581433415
3644.7 581433415 585415423 589687169 594041705 597920716 601523459 605333447 609146953 612629175
3661 612629175 615908921 619166136 622277081 625269115 628322780 631136179 633825183 636671662 639370620
3679.4 639370620 641893923 644428074 646990597 649536967 651898503 653983235 656007290 658048153
3695.7 658048153 659935176 661589921 663194478 664839804 666385829 667751729 668934941 670055866
3712 670055866 671352506 672807515 674270928 675622523 676833749 677954078 679018617 680088639 681135058
3730.3 681135058 682086229 682949543 683826625 684675217 685341954 685798466 686368406 687356234 688287735 688939273
3750.7 688939273 689704418 690696180 691630721 692406297 693139195 693859935 694555044 695212662 695837379 696537971
3771.1 696537971 697314322 698064506 698775649 699411929 699942529 700432599 700967133 701594710 702313960 703016400
3791.5 703016400 703514934 703879118 704352736 704869628 705375910 705942094 706435740 706899166 707454681 708017290
3811.9 708017290 708449841 708849370 709325671 709678769 710037351 710491538 710882485 711326838 711822867 712301612
3832.3 712301612 712803125 713133395 713289261 713623941 714097619 714526772 714940608 715341270 715536773 715444922
3852.7 715444922 715621233 716200411 716699481 717053711 717352152 717646062 717839777 717916250 718167841 718574166
3873.1 718574166 718944669 719236791 719409406 719609737 719894290 720150471 720388710 720594525 720740974 720915794
3893.5 720915794 721139669 721309125 721423805 721548617 721720695 721970499 722191989 722330391 722474992 722641468
3913.9 722641468 722755075 722843349 722989917 723138392 723258317 723392725 723501682 723594010 723765373 723968804
3934.3 723968804 724076748 724140227 724265754 724421322 724554420 724661231 724771619 724918544 725058556 725155890
3954.7 725155890 725237191 725349784 725493729 725618303 725693464 725729167 725770950 725843966 725953758 726091325
3975.1 726091325 726223588 726415932 726703882 726899087 726897061 726836383 726860166 726964831 727100432 727265298
3995.5 727265298 727416813
3997.5 727416813
##END=$$ End of the data block
