##TITLE=G14-52-CE $$ Begin of the data block
##JCAMP-DX=5.00 $$ ACD/SpecManager v 10.08
##SPECTROMETER/DATA SYSTEM=Alpha
##DATE=17 Oct 2013 10:58:30
##DATA TYPE=INFRARED SPECTRUM
##DATA CLASS=XYDATA
##ORIGIN=
##OWNER=
##NPOINTS=1765
##FIRSTX=399.75695801
##LASTX=3997.56933594
##MAXX=3997.56933594
##MINX=399.75695801
##MAXY=0.81780106
##MINY=0.25194964
##XFACTOR=1.0000000000
##YFACTOR=1.000000000000000e-9
##FIRSTY=0.52007765
##DELTAX=2.03957629
##XUNITS=1/CM
##YUNITS=ARBITRARY UNITS
##XYDATA=(X++(Y..Y))
399.8E20077646j544416j582265j569927p13289K58446L29316k48313o61254o87659
$$ 520077646 518533230 516950965 515381038 514667749 514926195 515255511 515007198 514345944 513658285
418.1E13658285m11689n69046j261294j772761j641691j101374j049578j502276j468718
$$ 513658285 513246596 512677550 511416256 509643495 508001804 506900430 505850852 504348576 502879858
436.5E02879858m18365J236618K062499J441360N27143J55866K25187Q3029o83904
$$ 502879858 502461493 503698111 505760610 507201970 507729113 507884979 508110166 508193195 507509291
454.8E07509291j809835k416432j946032j567096j940101k459318k420425j854002
$$ 507509291 505699456 503283024 501336992 499769896 497829795 495370477 492950052 491096050
471.1D91096050j541883j837552k041250j611263r18627m47332l61741o99908j196742
$$ 491096050 489554167 487716615 485675365 484064102 483145475 482698143 482336402 481636494 480439752
489.5D80439752j480877j452506j523137j981765k267182k131760k018064k311230
$$ 480439752 478958875 477506369 475983232 474001467 471734285 469602525 467584461 465273231
505.8D65273231k923608l094613k622932k227426k338558k645701k526939j819849
$$ 465273231 462349623 459255010 456632078 454404652 452066094 449420393 446893454 445073605
522.1D45073605r65745n19484m55201j54048N84364J387954J846045J906097J871944
$$ 445073605 444107860 443588376 443133175 442979127 443563491 444951445 446797490 448703587 450575531
540.5D50575531J735329J211018L54528n79774j171709j148432r88245j226544j687378
$$ 450575531 452310860 453521878 453876406 453296632 452124923 450976491 449988246 448761702 447074324
558.8D47074324j902074j850158j869797k027631k087921j788139r54807J78188J124799
$$ 447074324 445172250 443322092 441452295 439424664 437336743 435548604 434593797 434771985 435896784
577.2D35896784J736462K163053K542197K762616K577394J991332J249552N36918J30773
$$ 435896784 437633246 439796299 442338496 445101112 447678506 449669838 450919390 451456308 451587081
595.6D51587081J68413K80619J79171P7039K06471L73005L29108K48491M34816P19249
$$ 451587081 451755494 452036113 452215284 452292323 452498794 452871799 453200907 453449398 453884214 454603463
616D54603463R06736J231194J755148K217322K561003K829612K785891K435952K133280
$$ 454603463 455510199 456741393 458496541 460713863 463274866 466104478 468890369 471326321 473459601
634.3D73459601J990945J868635J805782J752883J526267J239449J030325Q41171O62088
$$ 473459601 475450546 477319181 479124963 480877846 482404113 483643562 484673887 485515058 486177146
652.7D86177146M31270K28226K22951K86967L63827P72953J770407J768022M42416
$$ 486177146 486608416 486836642 487059593 487346560 487710387 488483340 490253747 492021769 492464185
671D92464185Q45432J599252J605213J468152J602560J590610J128554N63264K26974
$$ 492464185 493309617 494908869 496514082 497982234 499584794 501175404 502303958 502867222 503094196
689.4E03094196Q7738j14321n70894r92059q17895O8783J143039J725256J846254K073050
$$ 503094196 503181934 503067613 502496719 501504660 500686765 500755548 501898587 503623843 505470097 507543147
709.8E07543147K656698L284514L589272L702462L893018M188776M499852M548490
$$ 507543147 510199845 513484359 517073631 520776093 524669111 528857887 533357739 537906229
726.1E37906229M076958L550947L324389K982498K343118J655578J114071P36415N17547
$$ 537906229 541983187 545534134 548858523 551841021 554184139 555839717 556953788 557690203 558207750
744.4E58207750L07024m5598m13835n78701o65844q51869j004875q87156m22060L77357
$$ 558207750 558514774 558469176 558055341 557476640 556810796 555958927 554954052 554066896 553644836 554022193
764.8E54022193J498580K624035L535867M252612M743397M924000M740297M220248
$$ 554022193 555520773 558144808 561680675 565933287 570676684 575600684 580340981 584561229
781.2E84561229L554165L050864K701938K301157J858294J609206J735031K251745
$$ 584561229 588115394 591166258 593868196 596169353 598027647 599636853 601371884 603623629
797.5F03623629K802193L037214K976596K797425K562583K078175J433373Q86678N42403
$$ 603623629 606425822 609463036 612439632 615237057 617799640 619877815 621311188 622197866 622740269
815.8F22740269L45409j20p33375j505792j945555k140761k207041k295255k423525
$$ 622740269 623085678 623085558 622352183 620846391 618900836 616760075 614553034 612257779 609834254
834.2F09834254k470434k358615k221227k212167k119124j711666j133323p58171p02024
$$ 609834254 607363820 605005205 602783978 600571811 598452687 596741021 595607698 594849527 594147503
852.5E94147503o70850l93450K00867J226604K617658M019677N116880N578041N177498
$$ 594147503 593476653 593083203 593284070 594510674 597128332 601148009 606264889 611842930 617020428
870.9F17020428M069865K632081J153529l32594j901746l395676m453600m863798m789114
$$ 617020428 621090293 623722374 624875903 624543309 622641563 619245887 614792287 609928489 605139375
889.3F05139375m671395m650593m488766m232049m134893m373134n019486n792558
$$ 605139375 600467980 595817387 591328621 587096572 582961679 578588545 573569059 567776501
905.6E67776501o314397o535887o642700o648421o257653n363405m146039k898634
$$ 567776501 561462104 554926217 548283517 541635096 535377443 530014038 525867999 522969365
921.9E22969365j992941j484334j179099r61781q19206q32200r91941j130163j214505
$$ 522969365 520976424 519492090 518312991 517351210 516532004 515699804 514707863 513577700 512363195
940.2E12363195j564204k669990m629970o734788q206785r038955r520799r772152
$$ 512363195 510798991 508129001 503499031 496764243 488557458 479518503 469997704 460225552
956.6D60225552r895533r934276r880215r788215r676457r400427q780092p879913
$$ 460225552 450330019 440395743 430515528 420727313 411050856 401650429 392870337 384990424
972.9C84990424o913751n936295m956782m045040l276467k738446k412557k221764
$$ 384990424 378076673 372140378 367183596 363138556 359862089 357123643 354711086 352489322
989.2C52489322k106249j952082j657009j271307q78424m95612k61039l73900q26478
$$ 352489322 350383073 348430991 346773982 345502675 344624251 344128639 343867600 343493700 342667222
1007.5C42667222j378179j798510j976133j970410j960695k011120k094060k172142
$$ 342667222 341289043 339490533 337514400 335543990 333583295 331572175 329478115 327305973
1023.9C27305973k231956k288580k323300k312034k250433k163827k131045k153039
$$ 327305973 325074017 322785437 320462137 318150103 315899670 313735843 311604798 309451759
1040.2C09451759k127588j995146j771897j467049j053721n37723M8130O19710J097232
$$ 309451759 307324171 305329025 303557128 302090079 301036358 300498635 300546765 301166475 302263707
1058.5C02263707J479268J772135J921624J768440J077593p2569r77695r03845R7454
$$ 302263707 303742975 305515110 307436734 309205174 310282767 310210198 309232503 308328658 308426112
1076.9C08426112J425385K641827L572136M190654M548341M671007M530579M123032
$$ 308426112 309851497 312493324 316065460 320256114 324804455 329475462 334006041 338129073
1093.2C38129073L545672K943337K368540J803636J403600J380354J720280K203107
$$ 338129073 341674745 344618082 346986622 348790258 350193858 351574212 353294492 355497599
1109.5C55497599K607762K846182K923399K871662K698988K444357K216726K139628
$$ 355497599 358105361 360951543 363874942 366746604 369445592 371889949 374106675 376246303
1125.8C76246303K302289K654791K927065K840370K341092J577526Q07464K27034j35094
$$ 376246303 378548592 381203383 384130448 386970818 389311910 390889436 391696900 391923934 391788840
1144.2C91788840l31431m14878l78103j34110L56704J017481J767874K595454L468931
$$ 391788840 391457409 391042531 390664428 390530318 390887022 391904503 393672377 396267831 399736762
1162.6C99736762M284114M892528N262345N611360O151616O782741P236451P392198
$$ 399736762 404020876 408913404 414175749 419787109 425938725 432721466 439957917 447350115
1178.9D47350115P304757P052273O652981O076872N216957M045486K754420J571506
$$ 447350115 454654872 461707145 468360126 474436998 479653955 483699441 486453861 488025367
1195.2D88025367N81861k31892q55088j212806j223445r71108o84202n66274o42091
$$ 488025367 488607228 488375336 487520248 486307442 485083997 484112889 483428687 482862413 482220322
1213.5D82220322p84397r09567j060128j361132j770735k039075k071887k053142k044051
$$ 482220322 481435925 480526358 479466230 478105098 476334363 474295288 472223401 470170259 468126208
1231.9D68126208j918883j615941j142830n55694K1458N12689R99868J536220K003730
$$ 468126208 466207325 464591384 463448554 462892860 462914318 463427007 464426875 465963095 467966825
1250.3D67966825K233594K243668K214134K267122K348304K332181K226859K133370
$$ 467966825 470200419 472444087 474658221 476925343 479273647 481605828 483832687 485966057
1266.6D85966057K122193K146483K021819J638234J218855J030415J088292J237362
$$ 485966057 488088250 490234733 492256552 493894786 495113641 496144056 497232348 498469710
1282.9D98469710J313061J274675J172900J016677O71506O0856o65486j227438j516045
$$ 498469710 499782771 501057446 502230346 503247023 503918529 503979385 503313899 502086461 500570416
1301.2E00570416j654177j798690j932740j872808j553714j088679o38217k42948R4324
$$ 500570416 498916239 497117549 495184809 493312001 491758287 490669608 490031391 489788443 489882767
1319.6D89882767K98441K14010k68608j023531j720190k088338k110035j894086j580328
$$ 489882767 490181208 490395218 490126610 489103079 487382889 485294551 483184516 481290430 479710102
1338D79710102j227111q66264o05672n65410p48366j070738j394629j612366j777231
$$ 479710102 478482991 477616727 477011055 476445645 475697279 474626541 473231912 471619546 469842315
1356.3D69842315j989156k376169l000796l591031l851890l792525l329575k958059
$$ 469842315 467853159 465476990 462476194 458885163 455033273 451240748 447911173 444953114
1372.6D44953114l090322l341466l577918l866852l903448l373563k424241j383930
$$ 444953114 441862792 438521326 434943408 431076556 427173108 423799545 421375304 419991374
1388.9D19991374o68883l94881k78652n2929K31475N52386R65446J434028J712174
$$ 419991374 419322491 418927610 418648958 418596029 418827504 419379890 420345336 421779364 423491538
1407.3D23491538J777321J812875J850903J964688K266497K664804K582938K359151
$$ 423491538 425268859 427081734 428932637 430897325 433163822 435828626 438411564 440770715
1423.6D40770715K206117J811177J230985N28931p6711n15997o27697k09748K82257
$$ 440770715 442976832 444788009 446018994 446547925 446471214 445955217 445327520 445117772 445400029
1442D45400029N61893P43807Q42839O91384M73768P56979J991272L317267L223061
$$ 445400029 445961922 446705729 447548568 448239952 448713720 449470699 451461971 454779238 458002299
1460.3D58002299L020763L405422L946931M728913O448835Q798242R096861P458269
$$ 458002299 461023062 464428484 468375415 473104328 479553163 488351405 497448266 504906535
1476.6E04906535N852819M261672K619445R58205o31750k383172m063845m810035n563736
$$ 504906535 510759354 515021026 517640471 518598676 517966926 515583754 511519909 506709874 501146138
1495E01146138o780684o987572o440431o189167p698208j0852308j0247767q714377
$$ 501146138 494365454 487377882 480937451 474748284 467050076 456197768 445950001 437235624
1511.3D37235624q403868p277191n247026l217042k596646k849937l022790l192931
$$ 437235624 428831756 421554565 416307539 413090497 410493851 407643914 404621124 401428193
1527.6D01428193k865344k562166k576112k047122j349449j162946p26492K33233J136840
$$ 401428193 398562849 396000683 393424571 391377449 390028000 388865054 388138562 388371795 389508635
1546C89508635K002686K930343L737957M280596M516721N390018N812556M105181L420263
$$ 389508635 391511321 394441664 398179621 402460217 406976938 412366956 418179512 422284693 425704956
1564.3D25704956L371626L109336K786279K109408J637161J326829P33674K30521j87069
$$ 425704956 429076582 432185918 434972197 437081605 438718766 440045595 440779269 441009790 440822721
1582.7D40822721m96567p58469j102894j641214k162338k655446l161758l759533m481018
$$ 440822721 440326154 439567685 438464791 436823577 434661239 432005793 428844035 425084502 420603484
1601.1D20603484n176872n822033o539136p478028q129955q286208r253949j1044353
$$ 420603484 415426612 409604579 403065443 395587415 387457460 379171252 369917303 358872950
1617.4C58872950j0341257r947061j1564672j1728436j0921747j0383039r138763q436859
$$ 358872950 348531693 338584632 327019960 315291524 304369777 293986738 284847975 276411116
1633.7B76411116q766800o609082l399134j542747l33518O82265J505434J791358K419979
$$ 276411116 267644316 261035234 257636100 256093353 255759835 256442100 257947534 259738892 262158871
1652B62158871L525078L530443L719210M809201O221056P157058P162153P995993R127081
$$ 262158871 265683949 269214392 272933602 277742803 283963859 291120917 298283070 306279063 315406144
1670.4C15406144Q640706Q931488R741932R277016R007961J0289549J2980044J2457580
$$ 315406144 324046850 332978338 342720270 351997286 361005247 371294796 384274840 396732420
1686.7C96732420J1255026J2493401J3439954J6167313J8457293J8090755J8969118
$$ 396732420 407987446 420480847 433920801 450088114 468545407 486636162 505605280
1701E05605280J5690566J2813031J2245119J0228455Q488715P490992O908178O659687
$$ 505605280 521295846 534108877 546353996 556582451 565071166 572562158 579470336 586130023
1717.3E86130023N513668M054427L470898L173113K585709K073586J729429J800835
$$ 586130023 591643691 595698118 599169016 602342129 604927838 607001424 608730853 610531688
1733.6F10531688J845538J687050K003372K653718L485024M462361N383194O341696
$$ 610531688 612377226 614064276 616067648 618721366 622206390 626668751 632051945 638393641
1749.9F38393641O981492O762623O816864O890476O434441O351232N961359N469560
$$ 638393641 645375133 652137756 658954620 665845096 672279537 678630769 684592128 690061688
1766.3F90061688N334318N017579M762888M332065L714919L440321L172695K753139
$$ 690061688 695396006 700413585 705176473 709508538 713223457 716663778 719836473 722589612
1782.6G22589612K533317K499222K356112K140701K007008J815498J785099J860619
$$ 722589612 725122929 727622151 729978263 732118964 734125972 735941470 737726569 739587188
1798.9G39587188J770317J531542J409769J527548J625239J481414J188517J136422
$$ 739587188 741357505 742889047 744298816 745826364 747451603 748933017 750121534 751257956
1815.2G51257956J330614J446426J264870J037777J030445J140773J228750J121104
$$ 751257956 752588570 754034996 755299866 756337643 757368088 758508861 759737611 760858715
1831.5G60858715Q63850P36534Q59320J013518R65118P50602O25729P21634Q39889
$$ 760858715 761722565 762459099 763318419 764331937 765297055 766047657 766673386 767395020 768234909
1849.9G68234909P58409N58436N33521O72579P54595O51359M90427M38214N33521O11305
$$ 768234909 768993318 769551754 770085275 770757854 771512449 772163808 772654235 773092449 773625970 774237275
1870.3G74237275N42164M41372M23134N28395O21319N89251M74990M15384M86851N77212
$$ 774237275 774779439 775220811 775643945 776172340 776793659 777382910 777857900 778273284 778760135 779337347
1890.7G79337347N16116L83496L51429M11153M61102M18961L46124L15487L14892L08871
$$ 779337347 779853463 780236959 780588388 780999541 781460643 781879604 782225728 782541215 782856107 783164978
1911.1G83164978K80678K50936K45452K71976K82764K98143K83301K12728J80126J92344
$$ 783164978 783445656 783696592 783942044 784214020 784496784 784794927 785078228 785290956 785471082 785663426
1931.5G85663426J86503J66356J58728J41501J35362J55032J79350J56164J17660J47521
$$ 785663426 785849929 786016285 786175013 786316514 786451876 786606908 786786258 786942422 787060082 787207603
1951.9G87207603K00868K19226K00391J66535J43647J61410J98543J98901J28448Q3684
$$ 787207603 787408471 787627697 787828088 787994623 788138270 788299680 788498223 788697124 788825572 788909256
1972.3G88909256J34409J66833J21355O3002L7730K3902O3479J21653J08480M8161
$$ 788909256 789043665 789210498 789331853 789394855 789432585 789456487 789519966 789641619 789750099 789798260
1992.6G89798260K1875N5134Q0109O2882N37o2287r5248r7037q4280p2778j25706k12073
$$ 789798260 789820135 789875269 789955378 790018260 790018797 789956510 789861262 789764225 789679945 789607167 789481461 789269388
2017.1G89269388k00868j69694j90795k27272k59400k54869j89305j67310k31027k73168
$$ 789269388 789068520 788898826 788708031 788480759 788221359 787966490 787777185 787609875 787378848 787105680
2037.5G87105680k32935j36555q3863j25349j83821j28448N722O9797P987o9141k0206
$$ 787105680 786872745 786736190 786652327 786526978 786343157 786214709 786220431 786290228 786298215 786229074 786208868
2060G86208868J08957J40369N7221J4305M3392J10388J33335N5969l0100K3603J75655
$$ 786208868 786317825 786458194 786515415 786529720 786573112 786683500 786816835 786872804 786842704 786866307 787041962
2082.4G87041962K06709P5877m4525J669J59144K20359R8586j3292M4167J95325K60531
$$ 787041962 787248671 787324548 787280023 787281692 787440836 787661195 787759781 787746489 787790656 787985981 788246512
2104.8G88246512J51158K3246L2127J32322J95384J51217L4928q166R2805J94669J39772
$$ 788246512 788397670 788420916 788453043 788585365 788780749 788931966 788966894 788958728 789051533 789246202 789385974
2127.3G89385974q046l9399R5904K33829K00987M3571j5140R3341J86384J67847R6142
$$ 789385974 789377928 789338529 789434433 789668262 789869249 789912820 789897680 789991021 790177405 790345252 790441394
2149.7G90441394N5313J18375K23458K43127J70231J50859K54810L52919L42071L07143
$$ 790441394 790496707 790615082 790838540 791081667 791251898 791402757 791657567 792010486 792352557 792659700
2170.1G92659700K98917L14772L72351L64542K83002K77102L51787L90232L54766L09587
$$ 792659700 792958617 793273389 793645740 794010282 794293284 794570386 794922173 795312405 795667171 795976758
2190.5G95976758K89559K80738L04818L20077K62499K40863L04520L19957K88129K99752
$$ 795976758 796266317 796547055 796851873 797171950 797434449 797675312 797979832 798299789 798587918 798887670
2210.9G98887670L04937K75374K60353K22146J68622J97887K54035K29538J73807J55270
$$ 798887670 799192607 799467981 799728334 799950480 800119102 800316989 800571024 800800562 800974369 801129639
2231.3H01129639J71960J95384J74105R5069N7757J19388J82033J58012P6174M4704
$$ 801129639 801301599 801496983 801671088 801766157 801823914 801943302 802125335 802283347 802359521 802404225
2251.7H02404225Q4698J29223J47402J03593P9513J30713J55568J35481P5162n186
$$ 802404225 802488923 802618146 802765548 802869141 802948654 803079367 803234935 803370416 803445578 803440392
2272.1H03440392n36N7697J3947j05261j04309P7606K47776K52605J59204Q9764J41502
$$ 803440392 803439856 803497553 803511500 803406239 803301930 803379536 803627312 803879917 804039121 804128885 804270387
2294.5H04270387K81989L28303K21371J79947L62873O12974P03096N80371L80397L63946
$$ 804270387 804552376 804880679 805102050 805281997 805644870 806257844 806960940 807541311 807921708 808285654
2314.9H08285654O79373J068831J115560P84457N24998O03676P24852M70876J3590
$$ 808285654 808965027 810033858 811149418 811933875 812458873 813062549 813787401 814258277 814271867
2333.3H14271867o3419J72973K73883k146p86483k003372k108037m96507J456797K538085
$$ 814271867 814208448 814381421 814655304 814653158 813866675 811863303 809755266 809258759 810715556 813253641
2353.6H13253641K414823J629114N03480n37157j279354j836777k284884k549529k641380
$$ 813253641 815668464 817297578 817801058 817263901 815984547 814147770 811862886 809313357 806671977
2372H06671977k531528k266348k039015j870334j647413j326323r45210o07848m32313
$$ 806671977 804140449 801874101 799835086 797964752 796317339 794991016 794045806 793437958 793005645
2390.4G93005645m05729m30166m29690l80218l56674m31180n31912n33521m63963m43518
$$ 793005645 792599916 792169750 791740060 791359842 791003168 790571988 790040076 789506555 789042592 788599074
2410.8G88599074n00202n64516n69284n26070n25356n97417o48677o30439o05285o24835
$$ 788599074 788098872 787534356 786965072 786439002 785913646 785316229 784667552 784037113 783431828 782806993
2431.2G82806993o46890o36577o43850o46889n95808n89371o73830p29382p13408o85632
$$ 782806993 782160103 781523526 780879676 780232787 779636979 779047608 778373778 777644396 776930988 776245356
2451.5G76245356o87302o87658o36816n85974n88715o15418o53147o84500o55592o14166
$$ 776245356 775558054 774870396 774233580 773647606 773058891 772443473 771790326 771105826 770450234 769836068
2471.9G69836068o45339p02143o94633o26683n82635o15299o82950o97076o15597n16772
$$ 769836068 769190729 768488586 767793953 767167270 766584635 765969336 765286386 764589310 763973713 763456941
2492.3G63456941n33224o28352o48737n77569n04911n07831n80669o33359n83231m86434
$$ 763456941 762923717 762295365 761646628 761069059 760564148 760056317 759475648 758842289 758259058 757772624
2512.7G57772624m97400o20902o70493n80668n10573n33879o12795o97911o78838n79238
$$ 757772624 757275224 756654322 755983829 755403161 754892588 754358709 753745914 753048003 752369165 751789927
2533.1G51789927n77509p02798p80106o93858n56647n34714o31094p38382p35283o03556
$$ 751789927 751212418 750509620 749729514 749035656 748479009 747944295 747313201 746574819 745839536 745235980
2553.5G45235980n31197o26028p43925p24256n75543m89652n95212p45117p28131n83052
$$ 745235980 744704783 744078755 743334830 742610574 742035031 741545379 740950167 740205050 739476919 738893867
2573.9G38893867n19038o18577p65145p56263n86629n05805o13034p38740p38561o27875
$$ 738893867 738374829 737756252 736991107 736234844 735648215 735142410 734529376 733790636 733052075 732424200
2594.3G32424200n40793o08802p72536q33452p20203o15060o95050q73744r53198q87155
$$ 732424200 731883407 731274605 730502069 729668617 728948414 728333354 727638304 726764560 725811362 724924207
2614.7G24924207q01206q52942j044989j143813j037717r30309r85742j123071j178920
$$ 724924207 724123001 723270059 722225070 721081257 720043540 719113231 718127489 717004418 715825498
2633.1G15825498j106679j002372j005888j111626j189530j175881j090824j036942
$$ 715825498 714718819 713716447 712710559 711598933 710409403 709233522 708142698 707105756
2649.4G07105756j111567j199842j153111j035929r85205j050115j142502j143455
$$ 707105756 705994189 704794347 703641236 702605307 701620102 700569987 699427485 698284030
2665.7F98284030j042306r50754r99451j107216j090228r84967r18627r28521r87768
$$ 698284030 697241724 696290970 695291519 694184303 693094075 692109108 691190481 690261960 689274192
2684.1F89274192j010239r56178r05395r61780j064777j094759j040399r63688r95696
$$ 689274192 688263953 687307775 686402380 685440600 684375823 683281064 682240665 681276977 680281281
2702.4F80281281j110136j168251j168966j156927j160919j192570j203597j179993
$$ 680281281 679171145 678002894 676833928 675677001 674516082 673323512 672119915 670939922
2718.7F70939922j153052j129627j121402j113712j080871j021862r83894r97066j000703
$$ 670939922 669786870 668657243 667535841 666422129 665341258 664319396 663335502 662338436 661337733
2737.1F61337733r96887j017273j007438r62913r34004r23574r40681r64701r54866
$$ 661337733 660340846 659323573 658316135 657353222 656419218 655495644 654554963 653590262 652635396
2755.4F52635396r17256q97825r31621r66906r89318j004517j005173j038671j088917
$$ 652635396 651718140 650820315 649888694 648921788 647932470 646927953 645922780 644884109 643795192
2773.8F43795192j106381j133859j190782j240432j285255j327813j366794j393855
$$ 643795192 642688811 641554952 640364170 639123738 637838483 636510670 635143876 633750021
2790.1F33750021j417696j480937j544893j569331j590549j655817j746059j799762
$$ 633750021 632332325 630851388 629306495 627737164 626146615 624490798 622744739 620944977
2806.4F20944977j823247j850843j906276j988649k074480k152860k235890k324998
$$ 620944977 619121730 617270887 615364611 613375962 611301482 609148622 606912732 604587734
2822.7F04587734k417565k545476k676904k788126k947212l198325l535867l980815
$$ 604587734 602170169 599624693 596947789 594159663 591212451 588014126 584478259 580497444
2839.1E80497444m607439n441845o353259p041514p193327o640553n365610l693581
$$ 580497444 575890005 570448160 564094901 557053387 549860060 543219507 537853897 534160316
2855.4E34160316k294183j650274j801490k496779l335595l986478m225195l920793
$$ 534160316 531866133 530215859 528414369 525917590 522581995 518595517 514370322 510449529
2871.7E10449529l212691k423465j761258j305639j099646j092017j216710j434952
$$ 510449529 507236838 504813373 503052115 501746476 500646830 499554813 498338103 496903151
2888D96903151j653224j840144k024085k219230k452314k699047k956837l278733l656864
$$ 496903151 495249927 493409783 491385698 489166468 486714154 484015107 481058270 477779537 474122673
2906.4D74122673m119366m693002n291044n826116o140947o031454n471468m538059
$$ 474122673 470003307 465310305 460019261 454193145 448052198 442020744 436549276 432011217
2922.7D32011217l315956j937270n73009O67691J851410L017426M008084M670084M944622
$$ 432011217 428695261 426757991 426184982 426852673 428704083 431721509 435729593 440399677 445344299
2941D45344299M799694M274160L482997K577305J757294J165926R22650J171470J813799
$$ 445344299 450143993 454418153 457901150 460478455 462235749 463401675 464324325 465495795 467309594
2959.4D67309594K603114L429085M270196N035639N599230N955160O133973O113589
$$ 467309594 469912708 473341793 477611989 482647628 488246858 494202018 500335991 506449580
2975.7E06449580N950868N711317N351484M875720M356682L825665L287673K727389
$$ 506449580 512400448 518111765 523463249 528338969 532695651 536521316 539808989 542536378
2992E42536378K120554J490713Q71360K78413k44439o87062j022160j136303j060128
$$ 542536378 544656932 546147645 547019005 547297418 547052979 546365917 545343757 544207454 543147326
3010.4E43147326r64582q86977q44836r22263j126707j436054j772285j971424j957416
$$ 543147326 542182744 541295767 540450931 539528668 538401961 536965907 535193622 533222198 531264782
3028.7E31264782j893699j939357k033114k119303k202034k278089k336025k376497
$$ 531264782 529371083 527431726 525398612 523279309 521077275 518799186 516463161 514086664
3045.1E14086664k457977k523660k510309k513886k520144k489656k462983k363623
$$ 514086664 511628687 509105027 506594718 504080832 501560688 499071032 496608049 494244426
3061.4D94244426k189129k065778j967162j812219j698375j678765j652986j588195
$$ 494244426 492055297 489989519 488022357 486210138 484511763 482832998 481180012 479591817
3077.7D79591817j512975j457035j429856j371682j254022j163781j163572j181483
$$ 479591817 478078842 476621807 475191951 473820269 472566247 471402466 470238894 469057411
3094D69057411j162082j144797j206398j326650j381189j377314j405090j477510j521677
$$ 469057411 467895329 466750532 465544134 464217484 462836295 461458981 460053891 458576381 457054704
3112.4D57054704j525253j566410j636624j724422j832485j900941j914859j910091
$$ 457054704 455529451 453963041 452326417 450601995 448769510 446868569 444953710 443043619
3128.7D43043619j930624k016455k119571k164721k153963k140880k169907k237111
$$ 443043619 441112995 439096540 436976969 434812248 432658285 430517405 428347498 426110387
3145D26110387k287597k278030k256691k285182k351970k400100k380192k328396k342284
$$ 426110387 423822790 421544760 419288069 417002887 414650917 412250817 409870625 407542229 405199945
3163.4D05199945k378941k368867k374798k408534k437324k442717k420306k391607
$$ 405199945 402821004 400452137 398077339 395668805 393231481 390788764 388368458 385976851
3179.7C85976851k376795k381563k378315k343476k317160k312452k270519k211839
$$ 385976851 383600056 381218493 378840178 376496702 374179542 371867090 369596571 367384732
3196C67384732k203524k204210k149701k088875k077013k076804k016962j936615j943469
$$ 367384732 365181208 362976998 360827297 358738422 356661409 354584605 352567643 350631028 348687559
3214.3C48687559j984685j962453j937211j957059j967758j972019j987398k000064
$$ 348687559 346702874 344740421 342803210 340846151 338878393 336906374 334918976 332918912
3230.7C32918912k012402k074808k185970k250642k279043k310485k326309k328724
$$ 332918912 330906510 328831702 326645732 324395090 322116047 319805562 317479253 315150529
3247C15150529k361119k443015k524823k556175k528280k506435k516359k482653k394438
$$ 315150529 312789410 310346395 307821572 305265397 302737117 300230682 297714323 295231670 292837232
3265.3B92837232k287447k177954k068877j936674j816124j697868j520544j378775
$$ 292837232 290549785 288371831 286302954 284366280 282550156 280852288 279331744 277952969
3281.6B77952969j319647j195341j004547q77023p90626o75320n55873m93109m71384
$$ 277952969 276633322 275437981 274433434 273556411 272765785 272090465 271534592 271041483 270570099
3300B70570099m40508l83377l16471k87682k91913k69324k11924j64122j48087j58191
$$ 270570099 270129591 269746214 269429743 269142061 268850148 268580824 268368900 268204778 268056691 267898500
3320.4B67898500j67012j58280j85639k56330k67714k22296k14696k59608l26097l86416
$$ 267898500 267731488 267573208 267387569 267131239 266863525 266641229 266426533 266166925 265840828 265454412
3340.8B65454412m29154m75764m89444m52399m67747n43833n88030n60582n17636n28187
$$ 265454412 265025258 264549494 264060050 263607651 263139904 262596071 262008041 261447459 260929823 260401636
3361.2B60401636n52356n42223n41538n93394o62655o70940o01291n26786m99547m82827
$$ 260401636 259849280 259307057 258765519 258172125 257509470 256838530 256237239 255710453 255210906 254728079
3381.6B54728079m14848l35813k51859j73808k30729l84391l76194j51485J7672o6161
$$ 254728079 254313231 253977418 253725559 253551751 253321022 252936631 252560437 252408952 252426624 252360463
3402B52360463k29537j74582o706M4227M5061J03682J76907K27839K75045L43770M77940
$$ 252360463 252130926 251956344 251949638 251993865 252038926 252142608 252319515 252547354 252822399 253166169 253644109
3424.4B53644109O28412P52568Q19176Q73983R24349Q40604P19607P75933R65357J149655
$$ 253644109 254272521 255025089 255844265 256718248 257642597 258483201 259202808 259978741 260944098 262093753
3444.8B62093753J270413J263559J234174J288056J391768J506091J556277J511097
$$ 262093753 263364166 264627725 265861899 267149955 268541723 270047814 271604091 273115188
3461.1B73115188J541138J739502J886129J771063J557379J595170J800090J972347
$$ 273115188 274656326 276395828 278281957 280053020 281610399 283205569 285005659 286978006
3477.4B86978006K054662K001166J972616K072304K109915K075583K119392K186150
$$ 286978006 289032668 291033834 293006450 295078754 297188669 299264252 301383644 303569794
3493.8C03569794K249956K269596K268701K300561K264589K196193K286523K460301
$$ 303569794 305819750 308089346 310358047 312658608 314923197 317119390 319405913 321866214
3510.1C21866214K550513K529472K427459K424329K592802K786130K753913K605439
$$ 321866214 324416727 326946199 329373658 331797987 334390789 337176919 339930832 342536271
3526.4C42536271K646744K793759K868682K963930L049225L011525L080129L244996
$$ 342536271 345183015 347976774 350845456 353809386 356858611 359870136 362950265 366195261
3542.7C66195261L275574L124982L058255L237336L417582L462374L519684L620982
$$ 366195261 369470835 372595817 375654072 378891408 382308990 385771364 389291048 392912030
3559C92912030L645540L630876L715187L989697M150033M054159M017919M145473M312396
$$ 392912030 396557570 400188446 403903633 407893330 412043363 416097522 420115441 424260914 428573310
3577.4D28573310M478366M595011M561782M525870M657477M743368M624247M671574
$$ 428573310 433051676 437646687 442208469 446734339 451391816 456135184 460759431 465431005
3593.7D65431005M871845M935354M884720M815310M729301M666656M800201M910439
$$ 465431005 470302850 475238204 480122924 484938234 489667535 494334191 499134392 504044831
3610E04044831M884600M929126M886269M965723N187750M938662M544854M459977M807413
$$ 504044831 508929431 513858557 518744826 523710549 528898299 533836961 538381815 542841792 547649205
3628.4E47649205M981875M542947M382193M378974M294277M255175M145921L965258
$$ 547649205 552631080 557174027 561556220 565935194 570229471 574484646 578630567 582595825
3644.7E82595825L952027M284918M379749L839135L544569L796101L800929L481209
$$ 582595825 586547852 590832770 595212519 599051654 602596223 606392324 610193253 613674462
3661F13674462L316402L240109L062129L010750L112197K901613K755881K783894K612233
$$ 613674462 616990864 620230973 623293102 626303852 629416049 632317662 635073543 637857437 640469670
3679.4F40469670K515972K561629K568602K549410K378345K047479J917899J948654
$$ 640469670 642985642 645547271 648115873 650665283 653043628 655091107 657009006 658957660
3695.7F58957660J879573J732051J678408J650810J554787J412153J202345J066685
$$ 658957660 660837233 662569284 664247692 665898502 667453289 668865442 670067787 671134472
3712F71134472J206577J395821J463652J412511J307845J196504J070082J038015J057982
$$ 671134472 672341049 673736870 675200522 676613033 677920878 679117382 680187464 681225479 682283461
3730.3F82283461J021922R18686Q32558P86722P05957N74171O34253R23038R06944
$$ 682283461 683305383 684224069 685056627 685843349 686549306 687123477 687757730 688680768 689587712
3748.7F89587712O95467O90937Q46863Q80301P94649P27535P10904P02143O64234O45518
$$ 689587712 690283179 690974116 691820979 692701280 693495929 694223464 694934368 695636511 696300745 696946263
3769.1F96946263O90639P21217P15911P22766O62505N21243M73797N42403O14762O74009
$$ 696946263 697636902 698358119 699074030 699796796 700459301 700980544 701454341 701996744 702611506 703285515
3789.5G03285515O59347N14090M58956N87463N74410M67897N52594N74172M71711M44293
$$ 703285515 703944862 704458952 704917908 705505371 706079781 706547678 707100272 707674444 708146155 708590448
3809.9G08590448M96089M86195M64321M66525L56138L63767M43876M16398M16517M20988
$$ 708590448 709086537 709572732 710037053 710503578 710859716 711223483 711667359 712083757 712500274 712921262
3830.3G12921262M99189N88178M13657K08854K91944L73661L25203L38376M35829L70860
$$ 712921262 713420451 714008629 714422286 714631140 714923084 715296745 715621948 715960324 716396153 716767013
3850.7G16767013P5519O8665L74913M36485L72469L39687L44455K53618J24693J89543
$$ 716767013 716842532 716911197 717286110 717722595 718095064 718434751 718779206 719032824 719157517 719347060
3871.1G19347060K60412K87593L37303K84910K75433K78592K08139K03729J89781J44601
$$ 719347060 719607472 719895065 720232368 720517278 720792711 721071303 721279442 721483171 721672952 721817553
3891.5G21817553J81675K30610J86324J02640O5684J34051K65419K45691J32620J20819
$$ 721817553 721999228 722229838 722416162 722518802 722584486 722718537 722983956 723229647 723362267 723483086
3911.9G23483086J51276J28210J04964J49965J98841J68920J10209O7234M8220R6261
$$ 723483086 723634362 723762572 723867536 724017501 724216342 724385262 724495471 724562705 724610925 724707186
3932.3G24707186J47641J47700J50204J68681J81794J49727R9123J05321J20640J09374
$$ 724707186 724854827 725002527 725152731 725321412 725503206 725652933 725752056 725857377 725978017 726087391
3952.7G26087391J21296J20044J04308Q7678O4671P3791R0539R4354J21355J71423
$$ 726087391 726208687 726328731 726433039 726520717 726585388 726659179 726749718 726844072 726965427 727136850
3973.1G27136850J53780N8830N0068J37627J45078Q0645N8651Q9884J23620J27613
$$ 727136850 727290630 727349460 727399528 727537155 727682233 727762878 727821529 727911413 728035033 728162646
3993.4G28162646J32323J19626
$$ 728162646 728294969 728414595
3997.5G28414595
$$ 728414595
##END=$$ End of the data block
