##TITLE=G14-52-CE $$ Begin of the data block
##JCAMP-DX=5.00 $$ ACD/SpecManager v 10.08
##SPECTROMETER/DATA SYSTEM=Alpha
##DATE=17 Oct 2013 10:58:30
##DATA TYPE=INFRARED SPECTRUM
##DATA CLASS=XYDATA
##ORIGIN=
##OWNER=
##NPOINTS=1765
##FIRSTX=399.75695801
##LASTX=3997.56933594
##MAXX=3997.56933594
##MINX=399.75695801
##MAXY=0.81841761
##MINY=0.25200441
##XFACTOR=1.0000000000
##YFACTOR=1.000000000000000e-9
##FIRSTY=0.51811314
##DELTAX=2.03957629
##XUNITS=1/CM
##YUNITS=ARBITRARY UNITS
##XYDATA=(X++(Y..Y))
$$ plain form
399.8 518113136 516637802 514956176 513365507 512475789 512530923 513073802 513192415 512650430 511902213
418.1 511902213 511423826 511014640 509945810 508331180 506966889 505983829 505017877 503813207 502645254
436.5 502645254 502297997 503219664 504751205 505725205 506172597 506591260 506712556 506443620 505967855 504780173
456.9 504780173 502678275 500538826 498580843 496355116 493875086 491688311 490000904 488462776
473.2 488462776 486791074 485034734 483641267 482922792 482562304 482104510 481246322 479918659 478469759
491.5 478469759 477074474 475363523 473190755 471045136 469203740 467220813 464662611 461732507
507.9 461732507 458896935 456339508 454070926 451791614 449106276 446399748 444463134 443432033
524.2 443432033 442884296 442516237 442461520 443089902 444501340 446466982 448565900 450450122 452064782
$$ packed form
399.8E18113136j475334j681626j590669q89718N5134N42879J18613n41985p48217
418.1E11902213m78387m09186j068830j614630j364291r83060r65952j204670j167953
436.5E02645254l47257R21667J531541R74000M47392M18663J21296k68936m75765j187682
456.9E04780173k101898k139449j957983k225727k480030k186775j687407j538128
473.2D88462776j671702j756340j393467p18475l60488m57794q58188j327663j448900
491.5D78469759j395285j710951k172768k145619j841396j982927k558202k930104
507.9D61732507k835572k557427k268582k279312k685338k706528j936614j031101
524.2D43432033n47737l68059n4717O28382J411438J965642K098918J884222J614660
$$ plain form
542.5 452064782 453237712 453647971 453124583 451913536 450690538 449697137 448449641 446792305 445087969
560.9 445087969 443329334 441318035 439185500 437189400 435584426 434774250 434995592 436000556 437547505
579.2 437547505 439624786 442162842 444889367 447414935 449415207 450716555 451310486 451512635 451792985
597.6 451792985 452166766 452269793 452188641 452341557 452755839 453185350 453498989 453865916 454484969 455397040
618 455397040 456688732 458467245 460716665 463308394 466110021 468966335 471651107 473968953 475988358
636.3 475988358 477831036 479543149 481150687 482591271 483873755 485040843 485981137 486634403 487029225
654.7 487029225 487239003 487447560 487792283 488254905 488916874 490375280 492175341 492842346 493620872
673.1 493620872 495068580 496686846 498282522 499962449 501511633 502611458 503285050 503683627 503884435
$$ packed form
542.5D52064782J172930M10259n23388j211047j222998r93401j247496j657336j704336
560.9D45087969j758635k011299k132535j996100j604974q10176K21342J004964J546949
579.2D37547505K077281K538056K726525K525568K000272J301348N93931K02149K80350
597.6D51792985L73781J03027q1152J52916M14282M29511L13639L66927O19053R12071
618D55397040J291692J778513K249420K591729K801627K856314K684772K317846K019405
636.3D75988358J842678J712113J607538J440584J282484J167088R40294O53266L94822
654.7D87029225K09778K08557L44723M62622O61969J458406J800061O67005P78526
673.1D93620872J447708J618266J595676J679927J549184J099825O73592L98577K00808
$$ plain form
691.4 503884435 503747165 503079176 502019942 501169682 501233101 502368629 504080236 505982280 508167803
709.8 508167803 510848761 514074445 517658770 521393776 525287449 529508948 534053147 538538992
726.1 538538992 542544901 546152115 549547613 552528322 554847300 556463599 557511508 558182478 558685839
744.4 558685839 559015751 558971107 558526874 557920456 557233393 556345105 555315018 554403901 553965449 554345071
764.8 554345071 555829287 558434188 561985195 566313207 571149409 576127350 580857694 585041165
781.2 585041165 588573873 591564298 594159782 596426070 598378837 600117683 601944089 604198456
797.5 604198456 606904864 609871387 612859011 615654409 618148983 620150566 621517122 622336507 622865558
815.8 622865558 623232841 623251617 622593760 621150017 619154811 616927743 614653587 612292707 609796047
$$ packed form
691.4E03884435j37270o67989j059234q50260O3419J135528J711607J902044K185523
709.8E08167803K680958L225684L584325L735006L893673M221499M544199M485845
726.1E38538992M005909L607214L395498K980709K318978J616299J047909O70970N03361
744.4E58685839L29912m4644m44233o06418o87063q88288j030087r11117m38452L79622
764.8E54345071J484216K604901L551007M328012M836202M977941M730344M183471
781.2E85041165L532708K990425K595484K266288J952767J738846J826406K254367
797.5F04198456K706408K966523K987624K795398K494574K001583J366556Q19385N29051
815.8F22865558L67283J8776o57857j443743j995206k227068k274156k360880k496660
$$ plain form
834.2 609796047 607270300 604893923 602658391 600421309 598317921 596649408 595502913 594689667 593937695
852.5 593937695 593256474 592921793 593183577 594424069 597081363 601174653 606301367 611854613 617038310
870.9 617038310 621107996 623732209 624885261 624551475 622628927 619149506 614605725 609739006 604957104
889.3 604957104 600227833 595511556 590979874 586735606 582595706 578181267 573126674 567351282
905.6 567351282 561089218 554596841 547970831 541329801 535068154 529686153 525523782 522653699
921.9 522653699 520738184 519299507 518105924 517133594 516330361 515479207 514438510 513292134 512081861
940.2 512081861 510512590 507810235 503129423 496351033 488135189 479157805 469705969 459937364
956.6 459937364 450024992 440100163 430257291 420495361 410798073 401360899 392553449 384679198
$$ packed form
834.2F09796047k525747k376377k235532k237082k103388j668513j146495q13246p51972
852.5E93937695o81221l34681K61784J240492K657294M093290N126714N553246N183697
870.9F17038310M069686K624213J153052l33786j922548l479421m543781m866719m781902
889.3F04957104m729271m716277m531682m244268m139900m414439n054593n775392
905.6E67351282o262064o492377o626010o641030o261647n382001m162371k870083
921.9E22653699j915515j438677j193583r72330q03233q51154j040697j146376j210273
940.2E12081861j569271k702355m680812o778390q215844q977384r451836r768605
956.6D59937364r912372r924829r842872r761930r697288r437174q807450p874251
$$ plain form
972.9 384679198 377810746 371889830 366920352 362911165 359708548 357013285 354578137 352293402
989.2 352293402 350169003 348268002 346643597 345350027 344422728 343874574 343604475 343263268 342468232
1007.5 342468232 341102630 339280963 337267518 335300922 333380878 331394434 329297185 327112138
1023.9 327112138 324866235 322572917 320264965 317992121 315783918 313630551 311501414 309366405
1040.2 309366405 307219654 305181086 303401589 301937312 300881058 300350398 300405860 301044822 302164108
1058.5 302164108 303620636 305355579 307272851 309042424 310115248 310067743 309151977 308299690 308406800
1076.9 308406800 309806347 312416941 315985501 320183605 324706972 329324722 333823055 337963879
1093.2 337963879 341552645 344509393 346867889 348687738 350114375 351511449 353261888 355483055
$$ packed form
972.9C84679198o868452n920916m969478m009187l202617k695263k435148k284735
989.2C52293402k124399j901001j624405j293570r27299n48154k70099l41207p95036
1007.5C42468232j365602j821667k013445j966596j920044j986444k097249k185047
1023.9C27112138k245903k293318k307952k272844k208203k153367k129137k135009
1040.2C09366405k146751k038568j779497j464277j056254n30660N5462O38962J119286
1058.5C02164108J456528J734943J917272J769573J072824m7505r15766q52287J07110
1076.9C08406800J399547K610594L568560M198104M523367M617750M498333M140824
1093.2C37963879L588766K956748K358496J819849J426637J397074J750439K221167
$$ plain form
1109.5 355483055 358098686 360970527 363914371 366764158 369415313 371845812 374101609 376281589
1125.8 376281589 378588676 381240338 384167165 387002647 389350682 390934914 391725123 391932547 391800195
1144.2 391800195 391471982 391039938 390654057 390542865 390916526 391940743 393743843 396371424 399826258
1162.6 399826258 404088616 408977509 414229333 419818699 425931811 432662368 439867914 447258890
1178.9 447258890 454565495 461612135 468260646 474321663 479504913 483534157 486287445 487821132
1195.2 487821132 488347560 488092273 487243444 486049563 484849334 483903617 483237714 482686639 482046962
1213.5 482046962 481227219 480268687 479172349 477801263 476071149 474090546 472043157 470009238 468008012
1231.9 468008012 466119677 464495778 463327140 462774128 462843090 463412374 464432269 465937138 467904061
$$ packed form
1109.5C55483055K615631K871841K943844K849787K651155K430499K255797K179980
1125.8C76281589K307087K651662K926827K835482K348035J584232P90209K07424j32352
1144.2C91800195l28213m32044l85881j11192L73661J024217J803100K627581L454834
1162.6C99826258M262358M888893N251824N589366O113112O730557P205546P390976
1178.9D47258890P306605P046640O648511O061017N183250M029244K753288J533687
1195.2D87821132N26428k55287q48829j193881j200229r45717o65903n51075o39677
1213.5D82046962q19743r58532j096338j371086j730114j980603k047389k033919k001226
1231.9D68008012j888335j623899j168638n53012O8962N69284J019895J504869J966923
$$ plain form
1250.3 467904061 470134646 472398341 474641293 476927906 479271293 481585950 483801693 485939443
1266.6 485939443 488087356 490249783 492235541 493828624 495048910 496102303 497195214 498434901
1282.9 498434901 499772519 501067817 502244055 503259122 503899217 503904879 503226161 502037764 500555336
1301.2 500555336 498911798 497141123 495259732 493430585 491890877 490776062 490091056 489808500 489881426
1319.6 489881426 490184546 490422785 490168214 489127398 487372458 485266507 483187556 481355309 479808748
1338 479808748 478565305 477658510 477033585 476483047 475750536 474676430 473266244 471646667 469882637
1356.3 469882637 467908949 465532452 462521046 458909035 455029517 451230019 447921842 444984287
1372.6 444984287 441870779 438466430 434838623 430970013 427113444 423814565 421440810 420040399
$$ packed form
1250.3D67904061K230585K263695K242952K286613K343387K314657K215743K137750
1266.6D85939443K147913K162427J985758J593083J220286J053393J092911J239687
1282.9D98434901J337618J295298J176238J015067O40095N662o78718j188397j482428
1301.2E00555336j643538j770675j881391j829147j539708j114815o85006k82556P2926
1319.6D89881426L03120K38239k54571j040816j754940k105951k078951j832247j546561
1338D79808748j243443r06795o24925n50538p32511j074106j410186j619577j764030
1356.3D69882637j973688k376497l011406l612011l879518l799498l308177k937555
1372.6D44984287l113508l404349l627807l868610l856569l298879k373755j400411
$$ plain form
1388.9 420040399 419365019 419034034 418814629 418769360 418986231 419517457 420500726 421973795 423678279
1407.3 423678279 425443619 427282333 429175496 431206703 433561534 436225563 438701957 440973818
1423.6 440973818 443149090 444985956 446237981 446734011 446655035 446200490 445601612 445347548 445574194
1442 445574194 446115315 446859032 447688580 448375970 448883086 449734509 451871783 455206186 458315641
1460.3 458315641 461281002 464688063 468605608 473310173 479793400 488622487 497682303 505042553
1476.6 505042553 510781646 514990449 517616987 518581390 517947793 515540004 511377931 506476939 500932336
1495 500932336 494206935 487200081 480718046 474562734 467024505 456288427 445958257 437171936
1511.3 437171936 428776413 421552092 416373074 413230002 410697311 407852679 404818088 401636094
$$ packed form
1388.9D20040399o75380l30985k19405m5269K16871N31226R83269J473069J704484
1407.3D23678279J765340J838714J893163K031207K354831K664029K476394K271861
1423.6D40973818K175272J836866J252025M96030p8976m54545n98878k54064K26646
1442D45574194N41121P43717Q29548O87390N07116Q51423K137274L334403L109455
1460.3D58315641K965361L407061L917545M704565O483227Q829087R059816P360250
1476.6E05042553N739093M208803K626538R64403o33597k407789m162073m900992n544603
1495E00932336o725401p006854o482035o155312p538229j0736078j0330170q786321
1511.3D37171936q395523p224321n179018l143072k532691k844632l034591l181994
$$ plain form
1527.6 401636094 398797899 396269560 393712908 391717136 390501201 389476120 388784468 388995558 390105575
1546 390105575 392119467 395092100 398861825 403161585 407719016 413176626 418961465 422958016 426297188
1564.3 426297188 429653943 432796985 435562730 437609106 439244181 440573096 441227287 441390425 441196620
1582.7 441196620 440686911 439865649 438703209 437057465 434926838 432277352 429089427 425333232 420861483
1601.1 420861483 415656924 409831464 403337151 395892471 387756944 379478008 370288312 359301686
1617.4 359301686 348951966 338968873 327359587 315610737 304683924 294276386 285138994 276759356
1633.7 276759356 268050939 261420459 257963568 256405741 256110847 256861389 258416682 260216624 262643009
1652 262643009 266142994 269591957 273253053 278074324 284363121 291560322 298718631 306709588 315833867
$$ packed form
1527.6D01636094k838195k528339k556652j995772j215935j025081o91652K11090J110017
1546C90105575K013892K972633L769725M299760M557431N457610N784839L996551L339172
1564.3D26297188L356755L143042K765745K046376J635075J328915O54191J63138j93805
1582.7D41196620n09709q21262j162440j645744k130627k649486l187925l756195m471749
1601.1D20861483n204559n825460o494313p444680q135527q278936r189696j0986626
1617.4C59301686j0349720r983093j1609286j1748850j0926813j0407538r137392q379638
1633.7B76759356q708417o630480l456891j557827k94894P50542J555293J799942K426385
1652B62643009L499985L448963L661096M821271O288797P197201P158309P990957R124279
$$ plain form
1670.4 315833867 324509203 333488584 343205214 352449208 361505389 371876091 384822279 397119999
1686.7 397119999 408258677 420726925 434214383 450465202 468976676 487098873 506047726
1701 506047726 521656334 534427464 546647251 556862533 565423965 573071599 580161452 586892843
1717.3 586892843 592295289 596240997 599681437 602845311 605462313 607624888 609484076 611402035
1733.6 611402035 613214195 614827037 616835475 619512737 623014927 627516448 632949591 639302909
1749.9 639302909 646214366 652886569 659668267 666564643 673015058 679334342 685235977 690731704
1766.3 690731704 696155071 701252520 706035554 710285366 713909626 717325926 720497012 723251283
1782.6 723251283 725808024 728322148 730714738 732932806 734954655 736726224 738498867 740356207
$$ packed form
1670.4C15833867Q675336Q979381R716630R243994R056181J0370702J2946188J2297720
1686.7C97119999J1138678J2468248J3487458J6250819J8511474J8122197J8948853
1701E06047726J5608608J2771130J2219787J0215282Q561432P647634P089853O731391
1717.3E86892843N402446L945708L440440L163874K617002K162575J859188J917959
1733.6F11402035J812160J612842K008438K677262L502190M501521N433143O353318
1749.9F39302909O911457O672203O781698O896376O450415O319284N901635N495727
1766.3F90731704N423367N097449M783034M249812L624260L416300L171086K754271
1782.6G23251283K556741K514124K392590K218068K021849J771569J772643J857340
$$ plain form
1798.9 740356207 742091298 743573785 744966269 746511042 748155355 749629378 750790596 751910985
1815.2 751910985 753218532 754628301 755893767 756991208 758092940 759296358 760579467 761669040
1831.5 761669040 762440979 763141692 764027297 765061438 766051590 766857326 767500579 768175423 768944323
1849.9 768944323 769651890 770193398 770731986 771436334 772207379 772824883 773295939 773780465 774376750 774988532
1870.3 774988532 775476038 775873423 776281416 776806712 777432561 778021812 778485596 778936267 779501140 780086100
1890.7 780086100 780558169 780926287 781272233 781665623 782102644 782504499 782849669 783160150 783457458 783758104
1911.1 783758104 784052372 784347534 784641385 784918249 785177469 785449982 785710156 785918891 786104739 786283970
1931.5 786283970 786457181 786624312 786793768 786982119 787180662 787334681 787448049 787558913 787684023 787849844
$$ packed form
1798.9G40356207J735091J482487J392484J544773J644313J474023J161218J120389
1815.2G51910985J307547J409769J265466J097441J101732J203418J283109J089573
1831.5G61669040P71939P00713Q85605J034141R90152Q05736O43253O74844P68900
1849.9G68944323P07567N41508N38588P04348P71045O17504M71056M84526N96285O11782
1870.3G74988532M87506L97385M07993N25296O25849N89251M63784M50671N64873N84960
1890.7G80086100M72069L68118L45946L93390M37021M01855L45170L10481K97308L00646
1911.1G83758104K94268K95162K93851K76864K59220K72513K60174K08735J85848J79231
1931.5G86283970J73211J67131J69456J88351J98543J54019J13368J10864J25110J65821
$$ plain form
1951.9 787849844 788048923 788253129 788437486 788600028 788759351 788926601 789103329 789299190 789468288 789587021
1972.3 789587021 789711118 789843738 789959133 790052950 790121257 790165067 790238440 790358841 790470243 790525913
1992.6 790525913 790535331 790547252 790602028 790682971 790706396 790654778 790555060 790445387 790357769 790278971 790151536
2015.1 790151536 789958477 789765835 789592087 789403439 789168179 788899064 788649559 788467407 788303614 788072884
2035.5 788072884 787796438 787584543 787478983 787388027 787249744 787067115 786921620 786923885 787026107 787036121
2055.9 787036121 786937475 786920190 787050128 787189364 787231684 787230909 787270308 787414432 787614763 787713885 787674248
2078.3 787674248 787656784 787786841 787973285 788047552 788004041 788030148 788217127 788449943 788573563 788579762 788609207
2100.7 788609207 788783312 789051771 789241076 789283276 789291382 789391756 789563656 789694130 789722919 789746463
$$ packed form
1951.9G87849844J99079K04206J84357J62542J59323J67250J76728J95861J69098J18733
1972.3G89587021J24097J32620J15395R3817O8307M3810P3373J20401J11402N5670
1992.6G90525913R418J1921N4776Q0943K3425n1618r9718j09673q7618p8798j27435
2015.1G90151536j93059j92642j73748j88648k35260k69115k49505j82152j63793k30730
2035.5G88072884k76446k11895j05560r0956j38283j82629j45495K265J02222J0014
2055.9G87036121r8646j7285J29938J39236M2320p75L9399J44124K00331R9122l9637
2078.3G87674248j7464J30057J86444P4267m3511K6107J86979K32816J23620O199K9445
2100.7G88609207J74105K68459J89305M2200Q106J00374J71900J30474K8789K3544
$$ plain form
2121.1 789746463 789874077 790067971 790192306 790182710 790164948 790274739 790504396 790704310 790752470 790749669 790846825
2143.6 790846825 791014552 791164398 791257262 791328251 791483164 791722834 791937232 792084455 792250991 792509973
2164 792509973 792838931 793178856 793492496 793789566 794112027 794482172 794836938 795130789 795437157 795818627
2184.4 795818627 796208858 796532094 796822131 797121763 797417939 797719002 798025906 798288584 798532963 798828304
2204.8 798828304 799149036 799452305 799743354 800029397 800316513 800592482 800813317 801001906 801244497 801531851
2225.2 801531851 801763892 801918387 802048206 802193582 802368462 802529275 802631259 802719116 802874386 803084850
2245.6 803084850 803237736 803284526 803327024 803449333 803599656 803721607 803805172 803873062 803964138 804093480
2265.9 804093480 804241538 804327428 804320633 804342151 804419279 804413378 804303885 804207325 804250181 804466069 804734290
$$ packed form
2121.1G89746463J27614J93894J24335r596j7762J09791K29657J99914M8160k801R7156
2143.6G90846825J67727J49846R2864P0989J54913K39670K14398J47223J66536K58982
2164G92509973L28958L39925L13640K97070L22461L70145L54766K93851L06368L81470
2184.4G95818627L90231L23236K90037K99632K96176L01063L06904K62678K44379K95341
2204.8G98828304L20732L03269K91049K86043K87116K75969K20835J88589K42591K87354
2225.2H01531851K32041J54495J29819J45376J74880J60813J01984Q7857J55270K10464
2245.6H03084850J52886M6790M2498J22309J50323J21951Q3565O7890R1076J29342
2265.9H04093480J48058Q5890o795K1518P7128n901j09493r6560M2856K15888K68221
$$ plain form
2288.4 804734290 804915071 805013716 805157840 805398166 805677474 805916309 806129277 806482971 807063341 807732165
2308.8 807732165 808317900 808771193 809190512 809823394 810820639 811913729 812646508 813109994 813766122
2327.1 813766122 814606488 815095544 815055192 815023363 815234840 815443099 815406740 814632475 812605679 810455143
2347.5 810455143 809887171 811271012 813761175 816135287 817802727 818417609 818008006 816808343 814910591
2365.9 814910591 812536716 810014725 807476103 805009425 802740872 800686538 798818171 797181964
2382.2 797181964 795880139 794950366 794333816 793910563 793518424 793076277 792658448 792313576 791955471
2400.6 791955471 791511357 791004598 790493667 790012181 789533734 789015949 788474381 787925482 787375689 786825180
2421 786825180 786234558 785604179 784975231 784366012 783751130 783090234 782399535 781732798 781116128 780519962
$$ packed form
2288.4H04734290J80781R8645J44124K40326K79308K38835K12968L53694N80370O68824
2308.8H07732165N85735M53293M19319O32882R97245J093090P32779M63486O56128
2327.1H13766122Q40366M89056m0352l1829K11477K08259l6359p74265k026796k150536
2347.5H10455143n67972J383841K490163K374112J667440O14882m09603j199663j897752
2365.9H14910591k373875k521991k538622k466678k268553k054334j868367j636207
2382.2G97181964j301825r29773o16550m23253l92139m42147m17829l44872l58105
2400.6G91955471m44114n06759n10931m81486m78447n17785n41568n48899n49793n50509
2421G86825180n90622o30379o28948o09219o14882o60896o90699o66737o16670n96166
$$ plain form
2441.3 780519962 779885471 779207230 778525174 777843058 777159691 776475310 775802910 775174558 774556756 773917556
2461.7 773917556 773279667 772622645 771954417 771340072 770746648 770097971 769394457 768689811 768041074 767432272
2482.1 767432272 766804039 766138077 765482843 764922678 764453053 763929427 763274968 762591481 761996508 761500239
2502.5 761500239 760992169 760383427 759747207 759194732 758721054 758222699 757617712 756942749 756314874 755785823
2522.9 755785823 755264699 754632294 753905892 753245175 752726138 752189279 751474380 750668705 749976873 749426603
2543.3 749426603 748857081 748169720 747424841 746747732 746188879 745659351 745026410 744272351 743547142 742982209
2563.7 742982209 742488563 741873682 741119862 740408361 739836454 739291728 738642395 737883329 737157285 736589491
2584.1 736589491 736082375 735451221 734688401 733956695 733352304 732804596 732188165 731445491 730639875 729902029
$$ packed form
2441.3G80519962o34491o78241o82056o82116o83367o84381o72400o28352o17802o39200
2461.7G73917556o37889o57022o68228o14345n93424o48677p03514p04646o48737o08802
2482.1G67432272o28233o65962o55234n60165m69625n23626o54459o83487n94973m96269
2502.5G61500239n08070o08742o36220n52475m73678m98355o04987o74963o27875n29051
2522.9G55785823n21124o32405p26402o60717n19037n36859p14899q05675o91832n50270
2543.3G49426603n69522o87361p44879o77109n58853n29528o32941p54059p25209n64933
2563.7G42982209m93646o14881p53820p11501n71907n44726o49333p59066p26044n67794
2584.1G36589491n07116o31154p62820p31706o04391n47708o16431p42674q05616p37846
$$ plain form
2604.5 729902029 729246616 728533030 727675855 726753056 725887716 725087881 724228501 723199546 722069740
2622.9 722069740 721005917 720045447 719071686 717966676 716781914 715679944 714680076 713662744 712561250
2641.2 712561250 711391211 710243762 709198952 708167195 707014441 705788612 704637587 703599155
2657.5 703599155 702589154 701523900 700395107 699282110 698258817 697293818 696300566 695234478 694140017
2675.9 694140017 693123996 692197919 691250324 690232754 689216256 688282192 687405288 686473429 685456872
2694.3 685456872 684401333 683351994 682335258 681286871 680145562 678967237 677832007 676723421
2710.6 676723421 675556183 674314559 673086524 671926796 670797944 669676483 668553352 667421758
2726.9 667421758 666341662 665327549 664323211 663317144 662312567 661314011 660335839 659368515 658397496
$$ packed form
2604.5G29902029o55413p13586q57175r22799q65340p99835q59380j028955j129806
2622.9G22069740j063823r60470r73761j105010j184762j101970r99868j017332j101494
2641.2G12561250j170039j147449j044810j031757j152754j225829j151025j038432
2657.5G03599155j010001j065254j128793j112997j023293r64999r93252j066088j094461
2675.9F94140017j016021r26077r47595j017570j016498r34064q76904r31859j016557
2694.3F85456872j055539j049339j016736j048387j141309j178325j135230j108586
2710.6F76723421j167238j241624j228035j159728j128852j121461j123131j131594
2726.9F67421758j080096j014113j004338j006067j004577r98556r78172r67324r71019
$$ plain form
2745.2 658397496 657421887 656469822 655544281 654606879 653685272 652809858 651905954 650923431 649910271
2763.6 649910271 648909092 647919118 646925092 645902634 644833028 643724442 642589867 641406417 640148759
2782 640148759 638864934 637584925 636251926 634845495 633397341 631922781 630408049 628839731 627229691
2800.3 627229691 625572920 623844147 622041345 620197773 618331254 616407037 614384890 612268448
2816.6 612268448 610101938 607905388 605635822 603238940 600701094 598051727 595283926 592322350
2832.9 592322350 589091063 585516095 581494093 576863647 571419120 565069497 558018684 550784171
2849.3 550784171 544107020 538764775 535118163 532825708 531121910 529250383 526717603 523374259
2865.6 523374259 519382298 515154302 511232615 508024335 505619347 503867447 502535343 501410067
$$ packed form
2745.2F58397496r75609r52065r25541r37402r21607q75414r03904r82523j013160
2763.6F49910271j001179r89974r94026j022458j069606j108586j134575j183450j257658
2782F40148759j283825j280009j332999j406431j448154j474560j514732j568318j610040
2800.3F27229691j656771j728773j802802j843572j866519j924217k022147k116442
2816.6F12268448k166510k196550k269566k396882k537846k649367k767801k961576
2832.9E92322350l231287l574968m022002m630446n444527o349623p050813p234513
2849.3E50784171o677151n342245l646612k292455j703798j871527k532780l343344
2865.6E23374259l991961m227996l921687l208280k404988j751900j332104j125276
$$ plain form
2881.9 501410067 500313282 499078125 497603506 495918155 494072169 492065191 489869356 487414628
2898.2 487414628 484701425 481759399 478506625 474837750 470669180 465949714 460657865 454834670
2914.5 454834670 448721081 442705035 437193125 432622075 429341942 427447140 426863223 427514046 429376900
2932.9 429376900 432393432 436368406 441016465 445992172 450842619 455123007 458580256 461130381
2949.2 461130381 462858111 464017332 464977682 466212124 468081564 470735550 474220812 478514373
2965.5 478514373 483536392 489130050 495087445 501229346 507382691 513393342 519148111 524506748
2981.8 524506748 529366255 533724785 537604749 540960610 543711424 545832813 547341943 548247099
2998.1 548247099 548555493 548318803 547640085 546653152 545527220 544447601 543507874 542667508 541834474
$$ packed form
2881.9E01410067j096785j235157j474619j685351j845986k006978k195835k454728
2898.2D87414628k713203k942026l252774l668875m168570m719466n291849n823195
2914.5D54834670o113589o016046n511910m571050l280133j894802n83917O50823J862854
2932.9D29376900L016532L974974M648059M975707M850447M280388L457249K550125
2949.2D61130381J727730J159221R60350J234442J869440K653986L485262M293561
2965.5D78514373N022019N593658N957395O141901O153345O010651N754769N358637
2981.8E24506748M859507M358530L879964L355861K750814K121389J509130R05156
2998.1E48247099L08394k36690o78718r86933j125932j079619r39727q40366q33034
$$ plain form
3016.5 541834474 540912330 539802849 538385272 536629319 534688115 532745838 530836582 528882444
3032.8 528882444 526841819 524722815 522533834 520280719 517948210 515517890 513031423 510572791
3049.1 510572791 508163154 505717695 503178775 500620246 498129815 495757848 493533731 491425961
3065.5 491425961 489436805 487611860 485899568 484236002 482642680 481116086 479589850 478075057
3081.8 478075057 476655185 475326598 474059671 472848773 471655279 470459193 469269276 468105018
3098.1 468105018 466927767 465657443 464307338 462928504 461524487 460063785 458536327 456959307
3114.4 456959307 455346495 453716844 452006489 450154006 448235214 446317375 444385767 442411512
3130.7 442411512 440384299 438315004 436214626 434087932 431911647 429686874 427445441 425181746
$$ packed form
3016.5E41834474r22144j109481j417577j755953j941204j942277j909256j954138
3032.8E28882444k040625k119004k188981k253115k332509k430320k486467k458632
3049.1E10572791k409637k445459k538920k558529k490431k371967k224117k107770
3065.5D91425961j989156j824945j712292j663566j593322j526594j526236j514793
3081.8D78075057j419872j328587j266927j210898j193494j196086j189917j164258
3098.1D68105018j177251j270324j350105j378834j404017j460702j527458j577020
3114.4D56959307j612812j629651j710355j852483j918792j917839j931608j974255
3130.7D42411512k027213k069295k100378k126694k176285k224773k241433k263695
$$ plain form
3147 425181746 422911733 420657188 418363869 415978342 413549155 411166400 408835799 406488389 404109478
3165.4 404109478 401716828 399298549 396860838 394421726 391994148 389567286 387154698 384774804
3181.7 384774804 382385790 380004019 377681732 375387937 373095065 370817512 368544817 366274714
3198 366274714 364047915 361902505 359817266 357743919 355671942 353634834 351658404 349707127 347746342
3216.4 347746342 345779032 343815088 341872424 339907855 337883979 335875034 333866388 331778675
3232.7 331778675 329633117 327453971 325233400 322965950 320655972 318315715 315932781 313493609
3249 313493609 311030447 308554679 306046247 303507090 300953358 298428118 295959204 293550640 291235507
3267.4 291235507 289043665 286976635 285025865 283186018 281471401 279920340 278536111 277260870
$$ packed form
3147D25181746k270013k254545k293319k385527k429187k382755k330601k347410k378911
3165.4D04109478k392650k418279k437711k439112k427578k426862k412588k379894
3181.7C84774804k389014k381771k322287k293795k292872k277553k272695k270103
3198C66274714k226799k145410k085239k073347k071977k037108j976430j951277j960785
3216.4C47746342j967310j963944j942664j964569k023876k008945k008646k087713
3232.7C31778675k145558k179146k220571k267450k309978k340257k382934k439172
3249C13493609k463162k475768k508432k539157k553732k525240k468914k408564k315133
3267.4B91235507k191842k067030j950770j839847j714617j551061j384229j275241
$$ plain form
3283.7 277260870 276104897 275105178 274218291 273404181 272670001 272044152 271534652 271103084 270697147
3302 270697147 270332217 270022750 269707203 269389629 269136637 268937171 268750072 268576562 268404961 268208504
3322.4 268208504 267989814 267745048 267487228 267287314 267127723 266919136 266645104 266290069 265851110 265404910
3342.8 265404910 264966786 264491558 264008433 263503462 262895912 262231529 261637658 261106074 260547936 259987861
3363.2 259987861 259479642 258963048 258379459 257725120 257025570 256376386 255843103 255378932 254924387 254493535
3383.6 254493535 254117519 253840208 253645062 253406674 253053844 252706885 252565503 252577186 252478838 252221674
3404 252221674 252025217 252004415 252084017 252164483 252235144 252376705 252627671 252928257 253266454 253728330 254351526
3426.5 254351526 255113095 255918413 256765574 257688701 258545816 259304225 260142267 261138529 262263536
$$ packed form
3283.7B77260870j155973r99719q86887q14110p34180o25849n09500m31568m05937
3302B70697147l64930l09467l15547l17574k52992j99466j87099j73510j71601j96457
3322.4B68208504k18690k44766k57820j99914j59591k08587k74032l55035m38959m46200
3342.8B65404910m38124m75228m83125n04971o07550o64383n93871n31584n58138n60075
3363.2B59987861n08219n16594n83589o54339o99550o49184n33283m64171m54545m30852
3383.6B54493535l76016k77311j95146k38388l52830l46959j41382J1683r8348k57164
3404B52221674j96457k0802P9602Q0466P0661J41561K50966L00586L38197M61876O23196
3426.5B54351526P61569Q05318Q47161R23127Q57115P58409Q38042R96262J125007
$$ plain form
3444.8 262263536 263487518 264707863 265942723 267272055 268682748 270204842 271825284 273374557
3461.1 273374557 274870366 276574969 278475881 280253500 281781763 283334792 285142034 287162602
3477.4 287162602 289228916 291199446 293137342 295190930 297322422 299446076 301603079 303804874
3493.8 303804874 306031257 308254212 310535699 312912226 315212786 317396909 319678158 322124690
3510.1 322124690 324657857 327197552 329668820 332167953 334816992 337601572 340332180 342946947
3526.4 342946947 345634133 348474830 351408720 354423463 357481241 360488832 363545537 366784215
3542.7 366784215 370133698 373343557 376425594 379649192 383048505 386505634 390013844 393642634
3559 393642634 397379547 401134372 404935211 408984601 413147986 417184621 421228707 425429463 429754615
$$ packed form
3444.8B62263536J223982J220345J234860J329332J410693J522094J620442J549273
3461.1B73374557J495809J704603J900912J777619J528263J553029J807242K020568
3477.4B87162602K066314J970530J937896K053588K131492K123654K157003K201795
3493.8C03804874K226383K222955K281487K376527K300560K184123K281249K446532
3510.1C22124690K533167K539695K471268K499133K649039K784580K730608K614767
3526.4C42946947K687186K840697K933890L014743L057778L007591L056705L238678
3542.7C66784215L349483L209859L082037L223598L399313L457129L508210L628790
3559C93642634L736913L754825L800839M049390M163385M036635M044086M200756M325152
$$ plain form
3577.4 429754615 434187740 438744009 443349183 448001802 452770412 457532823 462177783 466937065
3593.7 466937065 471882939 476841450 481773585 486672580 491455853 496139497 500931382 505824149
3610 505824149 510744810 515750945 520703733 525716484 530897081 535793364 540339231 544842780 549690306
3628.4 549690306 554685235 559194684 563496172 567793608 572064221 576362729 580624104 584786355
3644.7 584786355 588940084 593270957 597470045 601107657 604595125 608414829 612206757 615632415
3661 615632415 618889987 622146606 625350773 628534913 631667554 634515047 637281239 639994860 642446458
3679.4 642446458 644830644 647315681 649910569 652573407 655044973 657131076 659054935 660960257
3695.7 660960257 662768602 664484918 666213572 667880893 669411957 670878649 672219038 673307061
$$ packed form
3577.4D29754615M433125M556269M605174M652619M768610M762411M644960M759282
3593.7D66937065M945874M958511M932135M898995M783273M683644M791885M892767
3610E05824149M920661N006135M952788N012751N180597M896283M545867M503549M847526
3628.4E49690306M994929M509449M301488M297436M270613M298508M261375M162251
3644.7E84786355M153729M330873M199088L637612L487468L819704L791928L425658
3661F15632415L257572L256619L204167L184140L132641K847493K766192K713621K451598
3679.4F42446458K384186K485037K594888K662838K471566K086103J923859J905322
3695.7F60960257J808345J716316J728654J667321J531064J466692J340389J088023
$$ plain form
3712 673307061 674363017 675635219 677098274 678610325 679998040 681127667 682105601 683166087 684317887
3730.3 684317887 685483158 686498344 687264264 687934458 688573360 689145744 689850628 690848172 691793323
3748.7 691793323 692454875 693012536 693763316 694648385 695453405 696132064 696787775 697472572 698158264 698848069
3769.1 698848069 699526370 700166762 700854361 701640427 702371001 702901363 703336298 703808665 704358697 704990029
3789.5 704990029 705633342 706207871 706762850 707379162 707996130 708583534 709146559 709611297 710011423 710438609
3809.9 710438609 710921764 711407542 711897373 712430000 712872863 713223875 713593543 713995814 714424253 714848876
3830.3 714848876 715342581 715939522 716416121 716678500 716913044 717174411 717448652 717810929 718313336 718793988
3850.7 718793988 718973041 719020367 719275832 719624937 719982982 720295250 720587015 720868289 721067548 721288264
$$ packed form
3712F73307061J055956J272202J463055J512051J387715J129627R77934J060486J151800
3730.3F84317887J165271J015186P65920O70194O38902N72384P04884R97544R45151
3748.7F91793323O61552N57661P50780Q85069Q05020O78659O55711O84797O85692O89805
3769.1F98848069O78301O40392O87599P86066P30574N30362M34935M72367N50032O31332
3789.5G04990029O43313N74529N54979O16312O16968N87404N63025M64738M00126M27186
3809.9G10438609M83155M85778M89831N32627M42863L51012L69668M02271M28439M24623
3830.3G14848876M93705N96941M76599K62379K34544K61367K74241L62277N02407M80652
3850.7G18793988J79053M7326K55465L49105L58045L12268K91765K81274J99259K20716
$$ plain form
3871.1 721288264 721561730 721835256 722107649 722359955 722666681 723010063 723233700 723324418 723445117 723683596
3891.5 723683596 723942101 724150062 724356115 724561155 724744439 724917293 725011230 725042045 725132883 725269139
3911.9 725269139 725405276 725539029 725647628 725775778 725953341 726136267 726263285 726318240 726393163 726542532
3932.3 726542532 726662517 726746619 726900578 727103770 727300167 727455497 727555156 727610528 727636278 727724671
3952.7 727724671 727885485 728018939 728140295 728287816 728401601 728447914 728479207 728522182 728582323 728717268
3973.1 728717268 728923380 729093075 729223311 729403973 729553878 729570210 729512274 729508638 729616582 729766488
3993.4 729766488 729924798 730111897
3997.5 730111897
$$ packed form
3871.1G21288264K73466K73526K72393K52306L06726L43382K23637R0718J20699K38479
3891.5G23683596K58505K07961K06053K05040J83284J72854R3937L0815R0838J36256
3911.9G25269139J36137J33753J08599J28150J77563J82926J27018N4955P4923J49369
3932.3G26542532J19985Q4102J53959K03192J96397J55330R9659N5372K5750Q8393
3952.7G27724671J60814J33454J21356J47521J13785M6313L1293M2975O0141J34945
3973.1G28717268K06112J69695J30236J80662J49905J6332n7936l636J07944J49906
3993.4G29766488J58310J87099
3997.5G30111897
##END=$$ End of the data block
