##TITLE=G14-51-SE $$ Begin of the data block
##JCAMP-DX=5.00 $$ ACD/SpecManager v 10.08
##SPECTROMETER/DATA SYSTEM=Alpha
##DATE=22 Oct 2013 10:53:20
##DATA TYPE=INFRARED SPECTRUM
##DATA CLASS=XYDATA
##ORIGIN=
##OWNER=
##NPOINTS=1765
##FIRSTX=399.75695801
##LASTX=3997.56933594
##MAXX=3997.56933594
##MINX=399.75695801
##MAXY=0.73684353
##MINY=0.10196945
##XFACTOR=1.0000000000
##YFACTOR=1.000000000000000e-9
##FIRSTY=0.34403554
##DELTAX=2.03957629
##XUNITS=1/CM
##YUNITS=ARBITRARY UNITS
##XYDATA=(X++(Y..Y))
$$ plain form
399.8 344035536 339764267 336675495 334999353 334345758 334513068 335252106 335801810 335970730 335994273
418.1 335994273 335223824 333415806 331036717 328556597 326680869 325287580 323593795 321423441 319716781
436.5 319716781 319726765 321554065 323914707 325461090 326267004 326876163 327294737 327287644 326537102 324859798
456.9 324859798 322589159 320277900 317773819 314786673 311448276 308374643 305977166 303763777
473.2 303763777 301339567 299175888 297733665 296779364 295874864 294846445 293724000 292591989 291363895
491.5 291363895 289621830 287137866 284350514 281792164 279315591 276489586 273327470 270011097
507.9 270011097 266801268 263823509 260898024 257973790 255113751 252519518 250588447 249513566
524.2 249513566 249043092 248766959 248809606 249683544 251436889 253784150 256562769 259440213 261812270
$$ packed form
399.8C44035536m271269l088772j676142o53595J67310P39038N49704J68920K3543
418.1C35994273p70449j808018k379089k480120j875728j393289j693785k170354j706660
436.5C19716781R984J827300K360642J546383Q05914O09159M18574p093p50542j677304
456.9C24859798k270639k311259k504081k987146l338397l073633k397477k213389
473.2C03763777k424210k163679j442223r54301r04500j028419j122445j132011j228094
491.5B91363895j742065k483964k787352k558350k476573k826005l162116l316373
507.9B70011097l209829k977759k925485k924234k860039k594233j931071j074881
524.2B49513566m70474k76133M2647Q73938J753345K347261K778619K877444K372057
$$ plain form
542.5 261812270 263190448 263599098 263337195 262575805 261531085 260348916 258883923 256972015 254669309
560.9 254669309 252139866 249444515 246493265 243498743 241181955 240119860 240271777 241314769 243120402
579.2 243120402 245730326 249096140 252772391 256054133 258483946 259964019 260627955 260928094 261147290
597.6 261147290 261115521 260841399 260625094 260730624 261113942 261483163 261763275 262160361 262874484 264019817
618 264019817 265587747 267548352 269961983 272829622 275976390 278991193 281483144 283488125 285404027
636.3 285404027 287347704 289045006 290328741 291296870 292103797 292868465 293552786 293951184 294093907
654.7 294093907 294250548 294574201 295008808 295391023 295654476 296111465 297284544 298650920 299919665
673.1 299919665 301268101 302748114 304440022 306257814 307864964 308981657 309648782 310087770 310324520
$$ packed form
542.5B61812270J378178M08650k61903p61390j044720j182169j464993j911908k302706
560.9B54669309k529443k695351k951250k994522k316788j062095J51917J042992J805633
579.2B43120402K609924L365814L676251L281742K429813J480073O63936L00139K19196
597.6B61147290l1769k74122k16305J05530L83318L69221K80112L97086P14123J145333
618B64019817J567930J960605K413631K867639L146768L014803K491951K004981J915902
636.3B85404027J943677J697302J283735R68129Q06927P64668O84321L98398J42723
654.7B94093907J56641L23653M34607L82215K63453M56989J173079J366376J268745
673.1B99919665J348436J480013J691908J817792J607150J116693O67125M38988K36750
$$ plain form
691.4 310324520 309981912 308851868 307304412 306132942 305997342 306827128 308177680 309929103 312246919
709.8 312246919 315305084 319072783 323245913 327655643 332489312 337899238 343742609 349589735
726.1 349589735 354835987 359351486 363425404 367042452 369895995 371785432 372804642 373283267 373513311
744.4 373513311 373348534 372585118 371246785 369568259 367846340 365979910 363793105 361678392 360467196
762.8 360467196 360757649 362621218 365882248 370443165 376220793 382981837 390197366 397093087 403093994
781.2 403093994 408159405 412634760 416596591 419753432 422128260 424362600 427115142 430557698
797.5 430557698 434436202 438415229 442378521 446318001 450005919 452883363 454620957 455487132 455964297
815.8 455964297 456161618 455661356 454011530 451277435 447869688 444119662 440160215 435955942 431567460
$$ packed form
691.4C10324520l42608j130044j547456j171470j35600Q29786J350552J751423K317816
709.8C12246919L058165L767699M173130M409730M833669N409926N843371N847126
726.1C49589735N246252M515499M073918L617048K853543J889437J019210M78625K30044
744.4C73513311j64777p63416j338333j678526j721919j866430k186805k114713j211196
762.8C60467196K90453J863569L261030M560917N777628O761044P215529O895721O000907
781.2D03093994N065411M475355L961831L156841K374828K234340K752542L442556
797.5D30557698L878504L979027L963292L939480L687918K877444J737594Q66175M77165
815.8D55964297J97321n00262j649826k734095l407747l750026l959447m204273m388482
$$ plain form
834.2 431567460 427226156 423123866 419269204 415570915 412121892 409312457 407326460 405885696
850.5 405885696 404645264 403413564 402309716 401924193 403248310 407077730 413249493 420966208 429501086
868.9 429501086 437975496 445191413 450125635 452349186 451985508 449311346 444594830 438280433 431113660
887.2 431113660 423892200 417032868 410516381 404144108 397784650 391407758 384842664 377687901
903.5 377687901 369640648 360836804 351743877 342770070 334132433 326074988 319004655 313412577
919.8 313412577 309599221 307333022 305987090 305018902 304273844 303905904 303934842 304051787 304003298 303824812
940.2 303824812 303342551 301593810 297342837 290190905 280828357 270370424 259549320 248576179
956.6 248576179 237528428 226522654 215674937 205089718 194857657 185055882 175859138 167571813
$$ packed form
834.2D31567460m341304m102290l854662l698289l449023k809435j985997j440764
850.5D05885696j240432j231700j103848l85523J324117L829420O171763P716715Q534878
868.9D29501086Q474410P215917M934222K223551l63678k674162m716516o314397p166773
887.2D31113660p221460o859332o516487o372273o359458o376892o565094p154763
903.5C77687901q047253q803844r092927q973807q637637q057445p070333n592078
919.8C13412577l813356k266199j345932r68188p45058l67940K8938J16945m8489j78486
940.2C03824812m82261j748741m250973p151932r362548j0457933j0821104j0973141
956.6B48576179j1047751j1005774j0847717j0585219j0232061r801775r196744q287325
$$ plain form
972.9 167571813 160442799 154546142 149845749 146277055 143751025 142115846 141136467 140486807 139882892
991.2 139882892 139302343 138914481 138829052 139021650 139392972 139803395 140077934 140039131 139585465 138771474
1011.6 138771474 137752309 136677697 135654703 134661689 133574173 132317767 130925506 129498959
1027.9 129498959 128113672 126747206 125335336 123850204 122321703 120844357 119440034 118087679
1044.3 118087679 116888046 115983143 115450069 115323149 115615524 116311677 117401861 118852891 120617010
1062.6 120617010 122568198 124328054 125304043 125103801 124035224 122968175 122648604 123353921 125095814
1081 125095814 127722323 130927563 134429470 138053805 141686291 145190388 148348033 150985271 153082848
1099.3 153082848 154682398 155912608 157041118 158389166 160169631 162353814 164763182 167225972
$$ packed form
972.9A67571813p129014n896657m700393l568694k526030j635179r79379o49660o03915
991.2A39882892n80549l87862q5429J92598L71322M10423K74539l8803m53666q13991
1011.6A38771474j019165j074612j022994r93014j087516j256406j392261j426547
1027.9A29498959j385287j366466j411870j485132j528501j477346j404323j352355
1044.3A18087679j199633r04903n33074j26920K92375O96153J090184J451030J764119
1062.6A20617010J951188J759856R75989k00242j068577j067049l19571P05317J741893
1081A25095814K626509L205240L501907L624335L632486L504097L157645K637238K097577
1099.3A53082848J599550J230210J128510J348048J780465K184183K409368K462790
$$ plain form
1115.6 167225972 169568583 171597943 173253059 174708933 176217765 177932590 179961681 182296261
1132 182296261 184642181 186541066 187656268 187929586 187535673 186768666 185900748 185092181 184441462
1150.3 184441462 184065402 184094325 184687525 186001763 188054949 190770358 194115460 198060587 202547550
1168.7 202547550 207624778 213450566 220071539 227314845 234935448 242725417 250449687 257844388
1185 257844388 264692187 270716816 275579721 279055774 281126678 282005131 282009512 281441540 280567735
1203.3 280567735 279650897 278936625 278576225 278531402 278615355 278671235 278598100 278289557 277630568 276528776
1223.7 276528776 274987638 273134470 271126717 269145817 267370284 265906513 264843792 264294028
1240.1 264294028 264350832 265021086 266247302 267961740 270067066 272446036 274993092 277565837 280057907
$$ packed form
1115.6A67225972K342611K029360J655116J455874J508832J714825K029091K334580
1132A82296261K345920J898885J115202K73318l93913p67007q67918q08567o50719
1150.3A84441462l76060K8923N93200J314238K053186K715409L345102L945127M486963
1168.7B02547550N077228N825788O620973P243306P620603P789969P724270P394701
1185B57844388O847799O024629M862905L476053K070904Q78453M381n67972q73805
1203.3B80567735r16838p14272l60400m4823Q3953N5880p3135l08543o58989j101792
1223.7B76528776j541138j853168k007753j980900j775533j463771j062721n49764
1240.1B64294028N6804O70254J226216J714438K105326K378970K547056K572745K492070
$$ plain form
1258.4 280057907 282453269 284760267 287026763 289322913 291686445 294036508 296177924 297964066
1274.7 297964066 299381733 300512046 301552027 302700549 303978443 305242926 306322724 307100356
1291 307100356 307429790 307178468 306302041 304867744 303041548 301054060 299072921 297113001 295206428
1309.4 295206428 293521672 292276591 291548550 291267931 291277289 291324943 291062772 290149301 288422495 285970628
1329.8 285970628 283092171 280197501 277670503 275685489 274219662 273151904 272349924 271663278 270899564
1348.1 270899564 269867569 268472761 266754389 264821321 262719959 260265678 257164568 253471166
1364.5 253471166 249595568 245911166 242795244 240042910 237107217 233928487 230612502 227146178
1380.8 227146178 223678112 220632628 218423769 217241451 216797888 216618806 216475919 216429278 216603696
$$ packed form
1258.4B80057907K395362K306998K266496K296150K363532K350063K141416J786142
1274.7B97964066J417667J130313J039981J148522J277894J264483J079798P77632
1291C07100356L29434k51322q76427j434297j826196j987488j981139j959920j906573
1309.4B95206428j684756j245081p28041k80619R358M7654k62171r13471j726806k451867
1329.8B85970628k878457k894670k526998j985014j465827j067758q01980o86646p63714
1348.1B70899564j031995j394808j718372j933068k101362k454281l101110l693402
1364.5B53471166l875598l684402l115922k752334k935693l178730l315985l466324
1380.8B27146178l468066l045484k208859j182318m43563j79082j42887m6641J74418
$$ plain form
1399.1 216603696 217104062 217965871 219161615 220535994 222020328 223646864 225320682 227032349 229029194
1417.5 229029194 231590465 234253526 236751378 239099503 241053000 242523059 243401811 243661538 243481860
1435.9 243481860 243243203 243330702 243790060 244449943 245145127 245774642 246209145 246439174 246861160 248345867
1456.2 248345867 251185268 254120559 256975323 260389596 264470339 269231141 275707304 284977913
1472.6 284977913 295017391 303446203 310122609 315072745 318321615 319771737 319390595 317013502
1488.9 317013502 312815845 307903886 302302063 295507282 288519263 282120824 276045024 268599451
1505.2 268599451 258188933 248580217 240631014 233073324 226592407 221940294 219073832 216769293
1521.5 216769293 214343041 211851522 209237486 206881702 204759985 202671707 201051891 199963331
$$ packed form
1399.1B16603696N00366Q61809J195744J374379J484334J626536J673818J711667J996845
1417.5B29029194K561271K663061K497852K348125J953497J470059Q78752K59727j79678
1435.9B43481860k38657Q7499M59358O59883O95184O29515M34503K30029M21986J484707
1456.2B48345867K839401K935291K854764L414273M080743M760802O476163R270609
1472.6B84977913J0039478Q428812O676406M950136L248870J450122l81142k377093
1488.9C17013502m197657m911959n601823o794781o988019o398439o075800p445573
1505.2B68599451j0410518r608716p949203p557690o480917m652113k866462k304539
1521.5B16769293k426252k491519k614036k355784k121717k088278j619816j088560
$$ plain form
1537.8 199963331 199096903 198765233 199216798 200352728 202184275 204799563 208073154 211762145 215605393
1556.2 215605393 220385015 225937083 229805365 232862771 235864028 238736153 241489321 243594244
1572.5 243594244 245185852 246629462 247655123 248249516 248550341 248649478 248547465 248185009 247435957
1590.9 247435957 246255115 244525939 242195308 239251241 235626832 231315181 226326838 220597059
1607.2 220597059 214007363 206901520 199710250 191725835 182295367 173595950 165329769 155917645
1623.5 155917645 146651193 138172477 130152017 123151898 116806962 110434979 105854355 103543863
1639.8 103543863 102410361 101969451 102143325 102865048 103699833 104928479 107073061 109280042 111504346
1658.2 111504346 114419080 118318468 122933127 127549350 132863581 139274850 145501733 152112231
$$ packed form
1537.8A99963331q66428l31670M51565J135930J831547K615288L273591L688991L843248
1556.2B15605393M779622N552068L868282L057406L001257K872125K753168K104923
1572.5B43594244J591608J443610J025661N94393L00825R9137j02013l62456p49052
1590.9B47435957j180842j729176k330631k944067l624409m311651m988343n729779
1607.2B20597059o589696p105843p191270p984415r430468q699417q266181r412124
1623.5A55917645r266452q478716q020460p000119o344936o371983m580624k310492
1639.8A03543863j133502m40910J73874P21723Q34785J228646K144582K206981K224304
1658.2A11504346K914734L899388M614659M616223N314231O411269O226883O610498
$$ plain form
1674.5 152112231 159585252 166842222 173905849 182170302 193163425 204019427 213960662 225190043
1690.8 225190043 237313837 252297997 270243078 288958043 310045749 328048319 343129218
1705.1 343129218 358105749 371124327 382214367 391997665 400913566 409705728 417516977 423593611
1721.4 423593611 428865463 433711886 437917531 441705793 445155889 448851764 452707648 456039369
1737.7 456039369 459685743 464174479 469377846 475389063 482275486 490387857 499456018 508167505
1754 508167505 516751885 525403321 533556223 541773438 549642324 556778133 563560665 569844842 576042652
1772.4 576042652 582067549 587279201 591892064 596131802 600078344 603946686 607713223 611028373
1788.7 611028373 613890648 616825581 619911134 622870982 625586927 628063858 630447149 632887185
$$ packed form
1674.5A52112231P473021P256970P063627Q264453J0993123J0856002R941235J1229381
1690.8B25190043J2123794J4984160J7945081J8714965K1087706J8002570J5080899
1705.1C43129218J4976531J3018578J1090040R783298Q915901Q792162P811249O076634
1721.4D23593611N271852M846423M205645L788262L450096L695875L855884L331721
1737.7D56039369L646374M488736N203367O011217O886423Q112371R068161Q711487
1754E08167505Q584380Q651436Q152902Q217215P868886P135809O782532O284177O197810
1772.4E76042652O024897N211652M612863M239738L946542L868342L766537L315150
1788.7F11028373K862275K934933L085553K959848K715945K476931K383291K440036
$$ plain form
1805 632887185 635404050 637786329 639902651 641880631 643973768 646206498 648348212 650162637 651783586
1823.4 651783586 653588951 655513942 657312751 658934534 660395980 661852002 663438141 664959610
1839.7 664959610 666169465 667227209 668494999 669871569 671144485 672264695 673249424 674238563 675296545
1858 675296545 676397979 677439690 678334057 679083467 679863870 680876017 681954563 682890177 683675528
1876.4 683675528 684460104 685391605 686448991 687458277 688282549 689014077 689884782 690880001 691786051
1894.7 691786051 692516208 693128109 693807304 694617748 695391655 695943236 696334422 696847379 697555065 698211610
1915.1 698211610 698647439 699018300 699479461 700104654 700820565 701342881 701636493 701973379 702483714 702996790
1935.5 702996790 703365088 703584313 703782678 704168618 704726338 705206871 705531061 705861807 706316411 706848025
$$ packed form
1805F32887185K516865K382279K116322J977980K093137K232730K141714J814425J620949
1823.4F51783586J805365J924991J798809J621783J461446J456022J586139J521469
1839.7F64959610J209855J057744J267790J376570J272916J120210R84729R89139J057982
1858F75296545J101434J041711Q94367P49410P80403J012147J078546R35614P85351
1876.4F83675528P84576R31501J057386J009286Q24272P31528Q70705R95219R06050
1894.7F91786051P30157O11901O79195Q10444P73907N51581L91186N12957P07686O56545
1915.1F98211610M35829L70861M61161O25193P15911N22316K93612L36886N10335N13076
1935.5G02996790L68298K19225J98365L85940N57720M80533L24190L30746M54604N31614
$$ plain form
1955.9 706848025 707341433 707742751 708063066 708394468 708820164 709305346 709701240 709968626 710254550 710649252
1976.3 710649252 711096346 711465359 711705685 711867034 712070227 712362528 712634265 712782681 712861896 713045061
1996.7 713045061 713381886 713669479 713715196 713613927 713547885 713582873 713608205 713455558 713130832 712842584
2017.1 712842584 712698221 712528706 712199807 711780250 711424828 711167097 710929573 710603893 710169435 709763288
2037.5 709763288 709496379 709321737 709100425 708813071 708589852 708520412 708525181 708508968 708479464 708509982 708640397
2060 708640397 708811283 708964050 709092379 709215045 709346294 709497213 709636629 709758878 709879994 709985197
2080.3 709985197 710073113 710176349 710335493 710505426 710623026 710711896 710862517 711096168 711334527 711518586
2100.7 711518586 711675406 711866021 712121844 712388873 712554932 712644756 712773860 712988973 713218749 713335931
$$ packed form
1955.9G06848025M93408M01318L20315L31402M25696M85182L95894K67386K85924L94702
1976.3G10649252M47094L69013K40326J61349K03193K92301K71737J48416P9215J83165
1996.7G13045061L36825K87593M5717j01269o6042L4988K5332j52647l24726k88248
2017.1G12842584j44363j69515l28899m19557l55422k57731k37524l25680m34458m06147
2037.5G09763288k66909j74642k21312k87354k23219o9440M769j6213k9504L0518J30415
2060G08640397J70886J52767J28329J22666J31249J50919J39416J22249J21116J05203
2080.3G09985197Q7916J03236J59144J69933J17600Q8870J50621K33651K38359J84059
2100.7G11518586J56820J90615K55823K67029J66059Q9824J29104K15113K29776J17182
$$ plain form
2121.1 713335931 713338792 713376224 713529587 713729262 713870108 713914931 713968158 714139223 714369833 714534104
2141.5 714534104 714624643 714730740 714910686 715117514 715285003 715439260 715632200 715911210 716307521 716774404
2161.9 716774404 717205524 717594504 718032420 718575239 719213903 719849229 720403790 720928550 721515179 722169280
2182.3 722169280 722798407 723323107 723789871 724320173 724942505 725565135 726075828 726463675 726857841 727392912
2202.7 727392912 728018880 728543639 728916883 729297698 729830623 730468452 731009901 731343389 731612623 732026160
2223.1 732026160 732572854 733024299 733229280 733323753 733551919 733927965 734241903 734376192 734434187 734612584
2243.5 734612584 734951854 735234916 735283732 735220611 735258281 735451758 735706091 735836506 735809088 735830903
2263.9 735830903 736024737 736278236 736417353 736411572 736432970 736599922 736797035 736843526 736707091 736560225
$$ packed form
2121.1G13335931K861L7432J53363J99675J40846M4823N3227J71065K30610J64271
2141.5G14534104R0539J06097J79946K06828J67489J54257J92940K79010L96311M66883
2161.9G16774404M31120L88980M37916N42819O38664O35326N54561N24760N86629O54101
2182.3G22169280O29127N24700M66764N30302O22332O22630N10693L87847L94166N35071
2202.7G27392912O25968N24759L73244L80815N32925O37829N41449L33488K69234M13537
2223.1G32026160N46694M51445K04981R4473K28166L76046L13938J34289N7995J78397
2243.5G34612584L39270K83062M8816o3121L7670J93477K54333J30415k7418K1815
2263.9G35830903J93834K53499J39117n781K1398J66952J97113M6491j36435j46866
$$ plain form
2284.3 736560225 736528039 736571372 736562669 736384749 736114502 735910535 735799789 735663712 735386491 735004306
2304.7 735004306 734670222 734473228 734314382 734025776 733594000 733133674 732684612 732254267 731851637 731396258
2325.1 731396258 730900586 730580389 730406344 730029464 729397714 728763282 728298247 728001416 727708161 727393806
2345.5 727393806 727162957 726821661 726234853 725497365 724694312 723913014 723315716 722930193 722656131 722381890
2365.9 722381890 722033262 721755624 721691489 721708179 721604586 721379995 721166730 721013725 720850289 720534980
2386.3 720534980 720020235 719411194 718825519 718270481 717657983 716924548 716124535 715377271 714697838 713985503
2406.7 713985503 713152647 712216377 711270452 710401118 709591389 708695769 707619429 706479013 705443919
2425 705443919 704494178 703492343 702347338 701138496 700053334 699099183 698081315 696875453 695577204
$$ packed form
2284.3G36560225l2186M3333q703j77920k70247k03967j10746j36077k77221l82185
2304.7G35004306l34084j96994j58846k88606m31776m60326m49062m30345m02630m55379
2325.1G31396258m95672l20197j74045l76880o31750o34432m65035k96831k93255l14355
2345.5G27393806k30849l41296n86808p37488q03053p81298n97298l85523k74062k74241
2365.9G22381890l48628k77638o4135J6690j03593k24591k13265j53005j63436l15309
2386.3G20534980n14745o09041n85675n55038o12498p33435q00013p47264o79433p12335
2406.7G13985503q32856r36270r45925q69334q09729q95620j076340j140416j035094
2425G05443919r49741j001835j145005j208842j085162r54151j017868j205862j298249
$$ plain form
2443.4 695577204 694390893 693379462 692360342 691205263 689999938 688841522 687766552 686757922
2459.7 686757922 685691535 684502840 683325648 682275116 681315541 680313706 679192007 678049266
2476 678049266 676999390 676021099 675005853 673891783 672778666 671798289 670902848 669962466 668938220
2494.4 668938220 667902708 666948557 666099250 665284872 664388478 663406551 662449121 661560118 660684407
2512.7 660684407 659766734 658798039 657844007 656955659 656077445 655115724 654038429 652922809 651850402
2531.1 651850402 650824666 649799824 648703516 647540569 646418691 645366251 644296765 643169820
2547.4 643169820 642035067 640977144 640015543 639064193 638026178 636895418 635769725 634746253 633806765
2565.8 633806765 632838964 631784558 630715370 629707932 628727913 627710104 626639009 625547051 624499619
$$ packed form
2443.4F95577204j186311j011431j019120j155079j205325j158416j074970j008630
2459.7F86757922j066387j188695j177192j050532r59575j001835j121699j142741
2476F78049266j049876r78291j015246j114070j113117r80377q95441r40382j024246
2494.4F68938220j035512r54151q49307q14378q96394r81927r57430q89003q75711
2512.7F60684407r17673r68695r54032q88348q78214r61721j077295j115620j072407
2531.1F51850402j025736j024842j096308j162947j121878j052440j069486j126945
2547.4F43169820j134753j057923r61601r51350j038015j130760j125693j023472r39488
2565.8F33806765r67801j054406j069188j007438r80019j017809j071095j091958j047432
$$ plain form
2584.1 624499619 623526692 622542679 621455133 620343864 619317830 618350446 617356062 616271734 615126073
2602.5 615126073 613992751 612852633 611627281 610300124 608913064 607496977 606067121 604617834
2618.8 604617834 603084326 601426959 599720120 598042250 596370459 594654918 592867494 591032863
2635.1 591032863 589228690 587467849 585699379 583888888 582065761 580278873 578519404 576764524
2651.4 576764524 574992597 573201835 571432173 569705069 568012416 566328883 564632952 562936664
2667.7 562936664 561275184 559674978 558089077 556475520 554881871 553357005 551895380 550432801
2684.1 550432801 548930526 547428071 545950711 544478178 542984843 541442811 539839208 538189352
2700.4 538189352 536514640 534820139 533090055 531320751 529551744 527826011 526096106 524301589
$$ packed form
2584.1F24499619r72927r84013j087546j111269j026034r67384r94384j084328j145661
2602.5F15126073j133322j140118j225352j327157j387060j416087j429856j449287
2618.8F04617834j533508j657367j706839j677870j671791j715541j787424j834631
2635.1E91032863j804173j760841j768470j810491j823127j786888j759469j754880
2651.4E76764524j771927j790762j769662j727104j692653j683533j695931j696288
2667.7E62936664j661480j600206j585901j613557j593649j524866j461625j462579
2684.1E50432801j502275j502455j477360j472533j493335j542032j603603j649856
2700.4E38189352j674712j694501j730084j769304j769007j725733j729905j794517
$$ plain form
2716.7 524301589 522480726 520706534 518996179 517326653 515701532 514121830 512565672 511037290
2733 511037290 509551764 508083761 506613910 505167961 503773749 502412736 501037478 499652416 498292774
2751.4 498292774 496983379 495701641 494371653 492979884 491600245 490273148 488970488 487649143
2767.7 487649143 486260474 484783977 483257264 481728733 480194330 478607088 476916850 475115299
2784 475115299 473258078 471386313 469463766 467452198 465372920 463252157 461118877 458970547 456709713
2802.3 456709713 454303324 451830387 449331135 446812630 444227278 441500843 438676775 435822397
2818.7 435822397 432914406 429902673 426772952 423537582 420191109 416659594 412874997 408843368
2835 408843368 404523790 399770528 394376904 388151199 381045640 373285383 365420729 358200818 352320552
$$ packed form
2716.7E24301589j820863j774192j710355j669526j625121j579702j556158j528382
2733E11037290j485526j468003j469851j445949j394212j361013j375258j385062j359642
2751.4D98292774j309395j281738j329988j391769j379639j327097j302660j321345
2767.7D87649143j388669j476497j526713j528531j534403j587242j690238j801551
2784D75115299j857221j871765j922547k011568k079278k120763k133280k148330k260834
2802.3D56709713k406389k472937k499252k518505k585352k726435k824068k854378
2818.7D35822397k907991l011733l129721l235370l346473l531515l784597m031629
2835D08843368m319578m753262n393624o225705p105559p760257p864654p219911n880266
$$ plain form
2853.3 352320552 348054200 345026582 342474222 339661956 336101592 331674784 326615363 321383655
2869.7 321383655 316529065 312474549 309342027 306988895 305185705 303715438 302364707 300971866
2886 300971866 299480349 297871143 296099603 294139743 292001486 289669871 287097245 284260958 281133294
2904.3 281133294 277610749 273597836 269077122 264056981 258607566 252931714 247344121 242220297
2920.6 242220297 237934574 234732464 232698515 231868654 232240617 233765289 236392662 240009710 244343191
2939 244343191 249024540 253686935 257975519 261620909 264496922 266591787 268072784 269366980 270977795
2957.4 270977795 273206592 276158452 279913634 284514099 289854467 295747787 302032948 308573961
2973.7 308573961 315186650 321695715 328028381 334073752 339661598 344725519 349246502 353148699
$$ packed form
2853.3C52320552m266352l027618k552360k812266l560364m426808n059421n231708
2869.7C21383655m854590m054516l132522k353132j803190j470267j350731j392841
2886C00971866j491517j609206j771540j959860k138257k331615k572626k836287l127664
2904.3B81133294l522545m012913m520714n020141n449415n675852n587593n123824
2920.6B42220297m285723l202110k033949q29861L71963J524672K627373L617048M333481
2939B44343191M681349M662395M288584L645390K876013K094865J480997J294196J610815
2957.4B70977795K228797K951860L755182M600465N340368N893320O285161O541013
2973.7C08573961O612689O509065O332666O045371N587846N063921M520983L902197
$$ plain form
2990 353148699 356387883 358960927 360846132 362028867 362540066 362422079 361728013 360651344 359406650
3008.3 359406650 358066767 356701344 355397016 354139119 352809161 351219565 349254787 346973658
3024.7 346973658 344509125 342007786 339549065 337096035 334618807 332080573 329386473 326562732
3041 326562732 323727429 320897073 318046927 315168887 312268436 309374511 306481898 303594649 300779521
3059.3 300779521 298066378 295481980 293092370 290910453 288883656 286926150 284983128 283064932
3075.6 283064932 281230152 279487520 277767688 276097238 274565220 273160726 271819085 270501673
3092 270501673 269198000 267891198 266543269 265139759 263697118 262235254 260780126 259332359 257829785
3110.3 257829785 256233126 254582047 252926677 251249999 249495372 247670934 245815217 243931711
$$ packed form
2990C53148699L239184K573044J885205J182735N11199j17987o94066j076669j244694
3008.3C59406650j339883j365423j304328j257897j329958j589596j964778k281129
3024.7C46973658k464533k501339k458721k453030k477228k538234k694100k823741
3041C26562732k835303k830356k850146k878040k900451k893925k892613k887249k815128
3059.3C00779521k713143k584398k389610k181917k026797j957506j943022j918196
3075.6B83064932j834780j742632j719832j670450j532018j404494j341641j317412
3092B70501673j303673j306802j347929j403510j442641j461864j455128j447767j502574
3110.3B57829785j596659j651079j655370j676678j754627j824438j855717j883506
$$ plain form
3126.6 243931711 242019683 240078747 238111109 236113086 234062105 231998608 229977831 227968276
3143 227968276 225918010 223833263 221769392 219719902 217634037 215528578 213461861 211426646 209359467
3161.3 209359467 207270354 205220401 203208148 201195210 199172020 197160095 195177302 193199098
3177.6 193199098 191227943 189286485 187361896 185442418 183536008 181679428 179899037 178193763
3193.9 178193763 176528290 174834430 173114702 171464086 169925332 168461651 167030439 165580362
3210.3 165580362 164089799 162615165 161212265 159862354 158528239 157176644 155778348 154362962
3226.6 154362962 152970806 151579887 150155425 148674384 147159025 145659447 144141808 142563507
3242.9 142563507 140937030 139280304 137619048 135960162 134280071 132583961 130877480 129156902
$$ packed form
3126.6B43931711j912028j940936j967638j998023k050981k063497k020777k009555
3143B27968276k050266k084747k063871k049490k085865k105459k066717k035215k067179
3161.3B09359467k089113k049953k012253k012938k023190k011925j982793j978204
3177.6A93199098j971155j941458j924589j919478j906410j856580j780391j705274
3193.9A78193763j665473j693860j719728j650616j538754j463681j431212j450077
3210.3A65580362j490563j474634j402900j349911j334115j351595j398296j415386
3226.6A54362962j392156j390919j424462j481041j515359j499578j517639j578301
3242.9A42563507j626477j656726j661256j658886j680091j696110j706481j720578
$$ plain form
3259.2 129156902 127460197 125801414 124169856 122590289 121109702 119758524 118514143 117350109
3275.5 117350109 116257481 115239859 114338860 113553166 112856120 112265602 111774616 111351661 110995501
3293.9 110995501 110706136 110480368 110320956 110198654 110122956 110120006 110148102 110196888 110279299 110366702 110437967
3316.3 110437967 110525005 110685937 110904358 111125991 111315139 111455351 111585319 111739837 111911975 112060286
3336.7 112060286 112176128 112263873 112306885 112338729 112391442 112475909 112587780 112672746 112684712 112676181 112721898
3359.1 112721898 112811550 112890065 112923808 112911701 112872414 112833567 112833634 112874679 112921089 112980731 113058418 113140754
3383.6 113140754 113228232 113363251 113526069 113619715 113684103 113828018 114051983 114289314 114486620 114648648
3404 114648648 114844628 115089357 115379460 115716152 116083734 116467476 116836533 117232628 117712669 118274033
$$ packed form
3259.2A29156902j696705j658783j631558j579567j480587j351178j244381j164034
3275.5A17350109j092628j017622r00999p85694o97046n90518m90986m22955l56160
3293.9A10995501k89365k25768j59412j22302p5698k950K8096M8786Q2411Q7403P1265
3316.3A10437967Q7038J60932K18421K21633J89148J40212J29968J54518J72138J48311
3336.7A12060286J15842Q7745M3012L1844N2713Q4467J11871Q4966J1966q531M5717
3359.1A12721898Q9652P8515L3743j2107l9287l8847O7M1045M6410N9642P7687Q2336
3383.6A13140754Q7478J35019J62818R3646O4388J43915K23965K37331J97306J62028
3404A14648648J95980K44729K90103L36692L67582L83742L69057L96095M80041N61364
$$ plain form
3424.4 118274033 118876167 119501442 120145716 120847441 121650420 122438252 123078465 123669162 124392048 125265330
3444.8 125265330 126209825 127150133 128093913 129072383 130077347 131094679 132108450 133131847 134241238
3463.2 134241238 135496527 136841774 138118088 139224291 140305445 141533583 142945483 144422591
3479.5 144422591 145835191 147244066 148711577 150206178 151707456 153238744 154810861 156415388
3495.8 156415388 158036768 159703225 161393389 163016349 164646611 166411489 168250427 170117900
3512.1 170117900 171995386 173813075 175644830 177602261 179685339 181760088 183767125 185811818
3528.4 185811818 187954232 190157056 192474619 194913000 197298586 199664459 202148765 204724029
3544.7 204724029 207257718 209748968 212329656 215055570 217869595 220760524 223747492 226763546
$$ packed form
3424.4A18274033O02134O25275O44274P01725Q02979P87832O40213N90697P22886Q73282
3444.8A25265330R44495R40308R43780R78470J004964J017332J013771J023397J109391
3463.2A34241238J255289J345247J276314J106203J081154J228138J411900J477108
3479.5A44422591J412600J408875J467511J494601J501278J531288J572117J604527
3495.8A56415388J621380J666457J690164J622960J630262J764878J838938J867473
3512.1A70117900J877486J817689J831755J957431K083078K074749K007037K044693
3528.4A85811818K142414K202824K317563K438381K385586K365873K484306K575264
3544.7B04724029K533689K491250K580688K725914K814025K890929K986968L016054
$$ plain form
3561.1 226763546 229748219 232812434 236284912 240005180 243521497 246942282 250545263 254347086
3577.4 254347086 258288562 262329429 266367078 270407856 274663538 279107779 283425540 287771910
3593.7 287771910 292359173 297056824 301764190 306496501 311196685 315851510 320714056 325777292
3610 325777292 330828100 335894614 340881199 345955223 351410627 356760532 361705244 366483599 371766865
3628.4 371766865 377586782 382957816 388135046 393399656 398527622 403576881 408655614 413634539
3644.7 413634539 418496251 423679680 429217696 434284985 438921213 443867654 448880970 453506500
3661 453506500 457961053 462352544 466481805 470519304 474775463 478691399 482385486 486330986 490070283
3679.4 490070283 493581265 497075438 500465155 503692925 506736934 509627819 512466669 515217781
$$ packed form
3561.1B26763546K984673L064215L472478L720268L516317L420785L602981L801823
3577.4B54347086L941476M040867M037649M040778M255682M444241M317761M346370
3593.7B87771910M587263M697651M707366M732311M700184M654825M862546N063236
3610C25777292N050808N066514M986585N074024N455404N349905M944712M778355N283266
3628.4C71766865N819917N371034N177230N264610N127966N049259N078733M978925
3644.7D13634539M861712N183429N538016N067289M636228M946441N013316M625530
3661D53506500M454553M391491M129261M037499M256159L915936L694087L945500L739297
3679.4D90070283L510982L494173L389717L227770L044009K890885K838850K751112
$$ plain form
3695.7 515217781 517756820 520087004 522391558 524783969 527111530 529245138 531220138 533222079
3712 533222079 535376728 537425458 539273083 541020274 542684019 544217825 545736492 547485232 549327970
3730.3 549327970 551002264 552436113 553846240 555429578 556882143 557888925 558987617 560638964
3746.7 560638964 562025726 563058794 564340353 565769970 567025185 568173945 569426179 570695400
3763 570695400 571858406 572899580 573893070 575040936 576257527 577393353 578491688 579556108 580585063
3781.3 580585063 581543863 582443357 583374321 584415972 585512340 586451590 587272584 588141799 588828802
3799.7 588828802 589515209 590570867 591475785 592193902 593115270 594130993 594938755 595632374 596411586
3818 596411586 596952438 597540498 598434150 599335849 600188851 600868344 601479650 602218449 602844715 603316724
$$ packed form
3695.7E15217781K539039K330184K304554K392411K327561K133608J975000K001941
3712E33222079K154649K048730J847625J747191J663745J533806J518667J748740J842738
3730.3E49327970J674294J433849J410127J583338J452565J006782J098692J651347
3746.7E60638964J386762J033068J281559J429617J255215J148760J252234J269221
3763E70695400J163006J041174R93490J147866J216591J135826J098335J064420J028955
3781.3E80585063R58800Q99494R30964J041651J096368R39250Q20994Q69215O87003
3799.7E88828802O86407J055658R04918P18117R21368J015723Q07762O93619P79212
3818E96411586N40852N88060Q93652R01699Q53002O79493O11306P38799O26266M72009
$$ plain form
3838.4 603316724 603913367 604623556 605385125 606190622 606992662 607488453 607442260 607724428 608642578 609437704
3858.8 609437704 609954834 610354781 610918522 611503422 611797690 612178683 612763882 613387346 614009380 614474773
3879.2 614474773 614952266 615380883 615681946 616181910 616636336 616883099 617277920 617765427 618066669 618221641
3899.6 618221641 618369937 618602157 619021237 619451106 619751453 620061636 620354176 620498657 620623410 620867372
3920 620867372 621136785 621366262 621582985 621785343 621976733 622201979 622473955 622758687 623019993 623198986
3940.4 623198986 623355329 623581767 623790205 623989761 624266565 624552548 624768198 624912024 625089705 625358999
3960.8 625358999 625621438 625806153 625946462 626129448 626379967 626601815 626762331 626929343 627094865 627247751
3981.2 627247751 627427280 627618730 627768278 627902567 628097415 628339887 628602862 628859401
$$ packed form
3838.4F03316724N96643P10189P61569Q05497Q02040M95791m6193K82168R18150P95126
3858.8F09437704N17130L99947N63741N84900K94268L80993N85199O23464O22034M65393
3879.2F14474773M77493M28617L01063M99964M54426K46763L94821M87507L01242J54972
3899.6F18221641J48296K32220M19080M29869L00347L10183K92540J44481J24753K43962
3920F20867372K69413K29477K16723K02358J91390K25246K71976K84732K61306J78993
3940.4F23198986J56343K26438K08438J99556K76804K85983K15650J43826J77681K69294
3960.8F25358999K62439J84715J40309J82986K50519K21848J60516J67012J65522J52886
3981.2F27247751J79529J91450J49548J34289J94848K42472K62975K56539
$$ plain form
3997.5 628859401
$$ packed form
3997.5F28859401
##END=$$ End of the data block
