##TITLE=G14-51-SE $$ Begin of the data block
##JCAMP-DX=5.00 $$ ACD/SpecManager v 10.08
##SPECTROMETER/DATA SYSTEM=Alpha
##DATE=22 Oct 2013 10:53:20
##DATA TYPE=INFRARED SPECTRUM
##DATA CLASS=XYDATA
##ORIGIN=
##OWNER=
##NPOINTS=1765
##FIRSTX=399.75695801
##LASTX=3997.56933594
##MAXX=3997.56933594
##MINX=399.75695801
##MAXY=0.73756897
##MINY=0.10199073
##XFACTOR=1.0000000000
##YFACTOR=1.000000000000000e-9
##FIRSTY=0.34174290
##DELTAX=2.03957629
##XUNITS=1/CM
##YUNITS=ARBITRARY UNITS
##XYDATA=(X++(Y..Y))
399.8C41742903l728271k956062k152324p10875Q31545J210391L45290l56853o60747
$$ 341742903 338014632 335058570 332906246 332195371 333026916 334237307 334582597 334225744 333564997
418.1C33564997j072347j455695j910895k130419j783699j524269j741022j906753
$$ 333564997 332492650 331036955 329126060 326995641 325211942 323687673 321946651 320039898
434.4C20039898j396268k4587J558512K286583J861751J122475O80625L84868j47462
$$ 320039898 318643630 318619043 320177555 322464138 324325889 325448364 326128989 326513857 326366395
452.8C26366395r36985j626373j996189k268851k728015l093004l115356k644777k222687
$$ 326366395 325429410 323803037 321806848 319537997 316809982 313716978 310601622 307956845 305734158
471.1C05734158k448738k617985k169788j478046q92252o09398q30173j230985j365900
$$ 305734158 303285420 300667435 298497647 297019601 296127349 295517951 294687778 293456793 292090893
489.5B92090893j399398j754016k379596k730042k552598k382726k658456l121406
$$ 292090893 290691495 288937479 286557883 283827841 281275243 278892517 276234061 273112655
505.8B73112655l476441l361523k866060k699524k998680l019214k426326j767039
$$ 273112655 269636214 266274691 263408631 260709107 257710427 254691213 252264887 250497848
522.1B50497848j217395o56262k34053J75044Q84175J675621K344012K912104L008515
$$ 250497848 249280453 248624191 248390138 248565182 249449357 251124978 253468990 256381094 259389609
540.5B59389609K358288J318305M22180k92569q83311j106978j170039j501262j972020
$$ 259389609 261747897 263066202 263488382 263195813 262312502 261205524 260035485 258534223 256562203
558.8B56562203k297938k473533k614572k846316k902910k398297j309142Q8662J238108
$$ 256562203 254264265 251790732 249176160 246329844 243426934 241028637 239719495 239808157 241046265
577.2B41046265J980781K630413L286168L671020L359616K398312J371861O43342L50088
$$ 241046265 243027046 245657459 248943627 252614647 255974263 258372575 259744436 260387778 260737866
595.6B60737866K55823n9694l23355j69098K16782M55230L68327K12014L20792P29799
$$ 260737866 260993689 260933995 260610640 260441542 260658324 261113554 261481881 261693895 262014687 262744486
616B62744486J268030J673877J973778K432227K953917L131836K876342K470880K099365
$$ 262744486 264012516 265686393 267660171 270092398 273046315 276178151 279054493 281525373 283624738
634.3B83624738J898885J862765J723885J364529J066208R08941P93129O99968M34368
$$ 283624738 285523623 287386388 289110273 290474802 291541010 292449951 293243080 293943048 294377416
652.7B94377416P2718K7120K74867M03106L22491K14547M66853J317889J476198J258135
$$ 294377416 294450134 294477254 294752121 295155227 295477718 295692265 296159118 297477007 298953205 300211340
673.1C00211340J265049J402795J711607J865358J598209J102358P25895N58257K60323
$$ 300211340 301476389 302879184 304590791 306456149 308054358 309156716 309882611 310440868 310701191
691.4C10701191m40687j200020j483172j021534o4641P59720J201481J667172K350598
$$ 310701191 310260504 309060484 307577312 306555778 306491137 307250857 308452338 310119510 312470108
709.8C12470108L081948L782153M255980M500926M909098N487919N843550N781591
$$ 312470108 315552056 319334209 323590189 328091115 333000213 338488132 344331682 350113273
726.1C50113273N213499M521072M086196L616631K854914J886278J003534M78148K25425
$$ 350113273 355326772 359847844 363934040 367550671 370405585 372291863 373295397 373773545 373998970
744.4C73998970j66327p71642j328081j605004j709461j948982k265454k128422j181245
$$ 373998970 373832643 373061001 371732920 370127916 368418455 366469473 364204019 362075597 360894352
762.8C60894352K77192J828134L236383M543751N836308O884367P266223O826222N910307
$$ 360894352 361171544 362999678 366236061 370779812 376616120 383500487 390766710 397592932 403503239
781.2D03503239N042374M496873L979563L189266K404332K184064K648502L436208
$$ 403503239 408545613 413042486 417022049 420211315 422615647 424799711 427448213 430884421
797.5D30884421M013002M075229L894508L827512L669083K927542J782685Q78394M83006
$$ 430884421 434897423 438972652 442867160 446694672 450363755 453291297 455073982 455952376 456435382
815.8D56435382J99318n48392j738161k765626l364384l747076m046231m317999m472435
$$ 456435382 456634700 456086308 454348147 451582521 448218137 444471061 440424830 436106831 431634396
834.2D31634396m370987m097760l880113l742516l471434k807170j923740j359106
$$ 431634396 427263409 423165649 419285536 415543020 412071586 409264416 407340676 405981570
850.5D05981570j209348j236290j129597l84271J342475L788442O119757P684291Q502364
$$ 405981570 404772222 403535932 402406335 402022064 403364539 407152981 413272738 420957029 429459393
868.9D29459393Q481830P221759M864394K147258l54946k597809m646301o309480p220208
$$ 429459393 437941223 445162982 450027376 452174634 451819688 449221879 444575578 438266098 431045890
887.2D31045890p283628o891370o529987o369233o322265o382674o656199p234782
$$ 431045890 423762262 416870892 410340905 403971672 397649407 391266733 384610534 377375752
903.5C77375752q043051q738428r034098q978217q676649q079648p069021n574405
$$ 377375752 369332701 360594273 351560175 342581958 333905309 325825661 318756640 313182235
919.8C13182235l806502k268910j345247r64940p27504l48002L8564J23263m5658j81794
$$ 313182235 309375733 307106823 305761576 304796636 304069132 303721130 303759694 303882957 303837299 303655505
940.2C03655505n06192j788974m242629p084727r319008j0476261j0852873j0992453
$$ 303655505 303149313 301360339 297117710 290032983 280713975 270237714 259384841 248392388
956.6B48392388j1085018j1045218j0844528j0569618j0240510r789899r165525q283988
$$ 248392388 237307370 226262152 215417624 204848006 194607496 184817597 175652072 167368084
972.9A67368084p139981n900591m698098l568441k513587j606822r87187o89641o06328
$$ 167368084 160228103 154327512 149629414 146060973 143547386 141940564 140953377 140263736 139657408
991.2A39657408n42253l42414m8071J89781L29062L83556K68251n6580m64201q12754
$$ 139657408 139115155 138772741 138724670 138914451 139243513 139627069 139895320 139838740 139374539 138561785
1011.6A38561785j026213j089379j038849j002193j084223j231581j377225j447961
$$ 138561785 137535572 136446193 135407344 134405151 133320928 132089347 130712122 129264161
1027.9A29264161j394466j327723j370162j477144j516529j455620j414090j383148
$$ 129264161 127869695 126541972 125171810 123694666 122178137 120722517 119308427 117925279
1044.3A17925279j225449r21324n13345o9067L39091P06032J068853J428127J773789
$$ 117925279 116699830 115778506 115265161 115196094 115535185 116241217 117310070 118738197 120511986
1062.6A20511986J978204J759343R30860k45116j057230j024045k79084P49342J746461
$$ 120511986 122490190 124249533 125180393 124935277 123878047 122854002 122574918 123324260 125070721
1081A25070721K566829L136263L472313L651351L659367L471136L145933K692327K130047
$$ 125070721 127637550 130773813 134246126 137897477 141556844 145027980 148173913 150866240 152996287
1099.3A52996287J571253J195818J146197J396254J779735K143458K409681K492130
$$ 152996287 154567540 155763358 156909555 158305809 160085544 162229002 164638683 167130813
1115.6A67130813K330914K009675J680851J475960J503050J734063K069027K342358
$$ 167130813 169461727 171471402 173152253 174628213 176131263 177865326 179934353 182276711
1132A82276711K295032J837492J102641K82690l86640p38204q29145p97764o87167
$$ 182276711 184571743 186409235 187511876 187794566 187407926 186669722 185840577 185042813 184355646
1150.3A84355646m16889N3167O58587J329764K007619K678484L337934L940523M476845
$$ 184355646 183938757 183991924 184650511 185980275 187987894 190666378 194004312 197944835 202421680
1168.7B02421680N061403N799249O586134P225722P654533P840485P723361P349849
$$ 202421680 207483083 213282332 219868466 227094188 234748721 242589206 250312567 257662416
1185B57662416O814092O031811M867703L476888K113133R16660K0266n52029q95053
$$ 257662416 264476508 270508319 275376022 278852910 280966043 281882703 281902969 281350940 280455887
1203.3B80455887r86278p67022l56436j5676J04547N5253q4221l08901o62417j114308
$$ 280455887 279469609 278702587 278346151 278330475 278435022 278490275 278406054 278097153 277434736 276320428
1223.7B76320428j531959j815557j957328j940131j749307j446545j087397o04808
$$ 276320428 274788469 272972912 271015584 269075453 267326146 265879601 264792204 264187396
1240.1B64187396J5884O65903J266659J750260K123594K388001K519459K543687K488405
$$ 264187396 264203280 264869183 266135842 267886102 270009696 272397697 274917156 277460843 279949248
1258.4B79949248K404511K321213K283663K316534K342433K291173K124071J820683
$$ 279949248 282353759 284674972 286958635 289275169 291617602 293908775 296032846 297853529
1274.7B97853529J454592J154095J052588J150847J291036J302273J111120P65711
$$ 297853529 299308121 300462216 301514804 302665651 303956687 305258960 306370080 307135791
1291C07135791L12268k35676q81017j477897j844197j976699j990289j973360j880586
$$ 307135791 307448059 307212383 306331366 304853469 303009272 301032573 299042284 297068924 295188338
1309.4B95188338j638085j228809p41333k94298J252L6656k70366q98719j710117k467483
$$ 295188338 293550253 292321444 291580111 291285813 291287065 291323721 291053355 290154636 288444519 285977036
1329.8B85977036k897531k887368k512425j983762j479447j080543q07911o91593p60138
$$ 285977036 283079505 280192137 277679712 275695950 274216503 273135960 272328049 271636456 270876318
1348.1B70876318j024246j391679j701772j908213k108753k507627l152460l702074
$$ 270876318 269852072 268460393 266758621 264850408 262741655 260234028 257081568 253379494
1364.5B53379494l873959l698305l135517k757251k921835l156423l298998l460705
$$ 253379494 249505535 245807230 242671713 239914462 236992627 233836204 230537206 227076501
1380.8B27076501l463388l073484k262726j182690m07353j69680j49816l3721K08333
$$ 227076501 223613113 220539629 218276903 217094213 216686860 216517180 216367364 216333643 216541976
1399.1B16541976N26815Q46059J170590J399636J524985J641095J696974J751646K010420
$$ 216541976 217068791 217914850 219085440 220485076 222010061 223651156 225348130 227099776 229110196
1417.5B29110196K528191K620190K487332K357647J956895J464814Q77186K66806j81497
$$ 229110196 231638387 234258577 236745909 239103556 241060451 242525265 243402451 243669257 243487760
1435.9B43487760k39893J08376M83259O65382O85140O28874M43593K26691M03255J455307
$$ 243487760 243247867 243356243 243839502 244504884 245190024 245818898 246262491 246489182 246892437 248347744
1456.2B48347744K843723K992421K884001L373742M039973M766464O471098R223074
$$ 248347744 251191467 254183888 257067889 260441631 264481604 269248068 275719166 284942240
1472.6B84942240R997189Q410453O664515M943013L237009J428783m16696k429903
$$ 284942240 294939429 303349882 310014397 314957410 318194419 319623202 319206506 316776603
1488.9C16776603m232436m920334n636721o847024o977320o354690o087482p529378
$$ 316776603 312544167 307623833 301987112 295140088 288162768 281808078 275720596 268191218
1505.2B68191218j0446399r506375p846921p527441o492213m653215k851590k287627
$$ 268191218 257744819 248238444 240391523 232864082 226371869 221718654 218867064 216579437
1521.5B16579437k391830k441808k573312k333969k124175k095729j629159j137808
$$ 216579437 214187607 211745799 209172487 206838518 204714343 202618614 200989455 199851647
1537.8A99851647q98063k72229N16310J179278J868382K663419L316104L663242L742620
$$ 199851647 198953584 198681355 199197665 200376943 202245325 204908744 208224848 211888090 215630710
1556.2B15630710M704267N633816L977880L116101L030315K862155K725721K075091
$$ 215630710 220334977 225968793 229946673 233062774 236093089 238955244 241680965 243756056
1572.5B43756056J551121J445324J066878O15835L17633R4623j38134l80665p52866
$$ 243756056 245307177 246752501 247819379 248435214 248752847 248847470 248709336 248328671 247575805
1590.9B47575805j191095j728386k312734k921909l610000m303232m986555n739107
$$ 247575805 246384710 244656324 242343590 239421681 235811681 231508449 226521894 220782787
1607.2B20782787o604866p122218p206455p994682r415179q667857q258238r425610
$$ 220782787 214177921 207055703 199849248 191854566 182439387 173771530 165513292 156087682
1623.5A56087682r289816q486867q009762p022977o386481o372355m568018k332509
$$ 156087682 146797866 138310999 130301237 123278260 116891779 110519424 105951406 103618897
1639.8A03618897j165166m63001J53705P35730Q62509J194455K116158K264552K278894
$$ 103618897 102453731 101990730 102144435 102880165 103742674 104937129 107053287 109317839 111596733
1658.2A11596733K940908L912442M625179M606157N272106O383463O239713O629169
$$ 111596733 114537641 118450083 123075262 127681419 132953525 139336988 145576701 152205870
1674.5A52205870P481560P247105P044122Q251205J0977342J0832906R931222J1255026
$$ 152205870 159687430 166934535 173978657 182229862 193207204 204040110 213971332 225226358
1690.8B25226358J2144729J4929146J7853319J8684417K1131873J8057526J5105933
$$ 225226358 237371087 252300233 270153552 288837969 309969842 328027368 343133301
1705.1C43133301J5017777J3083428J1127264R777277Q888871Q809805P893920O141305
$$ 343133301 358151078 371234506 382361770 392139047 401027918 409837723 417731643 423872948
1721.4D23872948N289435M852265M207999L755867L384829L640800L887564L399492
$$ 423872948 429162383 434014648 438222647 441978514 445363343 449004143 452891707 456291199
1737.7D56291199L688037M524499N218387N988270O854773Q107066R092211Q738459
$$ 456291199 459979236 464503735 469722122 475710392 482565165 490672231 499764442 508502901
1754E08502901Q588135Q637190Q147239Q229971P879854P117509O748617O262839O212115
$$ 508502901 517091036 525728226 533875465 542105436 549985290 557102799 563851416 570114255 576326370
1772.4E76326370O067217N243361M633486M262626L964484L869533L767670L307521
$$ 576326370 582393587 587636948 592270434 596533060 600497544 604367077 608134747 611442268
1788.7F11442268K837896K959848L151238K955019K650499K465010K424836K451003
$$ 611442268 614280164 617240012 620391250 623346269 625996768 628461778 630886614 633337617
1805F33337617K494275K370954K127945J985610K097309K246201K144158J795589J593471
$$ 633337617 635831892 638202846 640330791 642316401 644413710 646659911 648804069 650599658 652193129
1823.4F52193129J775384J899660J810491J684189J509964J454771J571476J520455
$$ 652193129 653968513 655868173 657678664 659362853 660872817 662327588 663899064 665419519
1839.7F65419519J199484J047432J285255J387954J281261J144231R91463R65715J051187
$$ 665419519 666619003 667666435 668951690 670339644 671620905 672765136 673756599 674722314 675773501
1858F75773501J133562J061141Q68082O99222P59125J048565J105428R15467P88451
$$ 675773501 676907063 677968204 678836286 679535508 680294633 681343198 682448626 683364093 684152544
1876.4F84152544Q30948R50754J028120R84669Q38399P42197Q56340R80973Q95500
$$ 684152544 684983492 685934246 686962366 687947035 688785434 689527631 690383971 691364944 692260444
1894.7F92260444P35164O36101O97255Q04007P50005N42820M14192N37157P04289O38067
$$ 692260444 692995608 693631709 694328964 695132971 695882976 696425796 696839988 697377145 698081434 698719501
1915.1F98719501M32551L80636M66287O35147P25984N23031K78115L17872N21541N45442
$$ 698719501 699152052 699532688 699998975 700634122 701360106 701883137 702161252 702479124 703000665 703546107
1935.5G03546107M02450K34366J74343L60609N63502N01335L38256L14891M26769N26131
$$ 703546107 703948557 704182923 704357266 704717875 705281377 705782712 706120968 706435859 706862628 707388759
1955.9G07388759M97579M07815L32415L24488L98695M91143M37557K78295K71499L99828
$$ 707388759 707886338 708294153 708626568 708951056 709349751 709840894 710278451 710556746 710828245 711228073
1976.3G11228073M54187L40760J95443J60516K60114L56675K96175J44661Q2910J81913
$$ 711228073 711682260 712023020 712218463 712378979 712639093 712995768 713291943 713436604 713519514 713701427
1996.7G13701427L10898K68757M5896j07587o4850O3420M2438j68979l36647k82884
$$ 713701427 714012325 714281082 714326978 714219391 714154541 714217961 714260399 714091420 713754773 713471889
2017.1G13471889j30832j51574l19720m40240m04953k84553k36690l38018m37319l66211
$$ 713471889 713341057 713189483 712869763 712429523 712024570 711740017 711503327 711165309 710727990 710361779
2037.5G10361779k25306j82688k46525k73049j85072n3883m649k2769l0279Q523J01209
$$ 710361779 710136473 709953785 709707260 709434211 709249139 709195256 709190607 709167838 709137559 709146082 709247291
2060G09247291J79589J82390J38044J18971J32978J59085J40667R8705J04547J37806
$$ 709247291 709426880 709609270 709747314 709866285 709999263 710158348 710299015 710397720 710502267 710640073
2080.3G10640073J30236R6619J24812J50502J19686J10090J55985K18213K50935K20418
$$ 710640073 710770309 710866928 710991740 711142242 711261928 711372018 711528003 711746216 711997151 712217569
2100.7G12217569J74404J86741K51472K70367J80780Q2493Q8990J88828K26557J19805
$$ 712217569 712391973 712578714 712830186 713100553 713281333 713363826 713452816 713641644 713868201 713988006
2121.1G13988006J1981N8114J77324K17199J45912L4512L6478J68979K55286J89186
$$ 713988006 713999987 714058101 714235425 714452624 714598536 714633048 714669526 714838505 715093791 715282977
2141.5G15282977Q3267O2168J42336K35915K16484J42157J63496K83181M13955M84824
$$ 715282977 715366244 715428412 715570748 715806663 716023147 716165304 716328800 716611981 717025936 717510760
2161.9G17510760M29451L44873L99530N56409O66618O49751N58197N23925N93781O63341
$$ 717510760 717940211 718285084 718684614 719241023 719907641 720557392 721115589 721639514 722233295 722896636
2182.3G22896636O39677N41985M64201M93407O07431O31273M97341L92556M31597N60999
$$ 722896636 723536313 724078298 724542499 725035906 725643337 726274610 726771951 727164507 727596104 728157103
2202.7G28157103O21915M98652L52919L93987N58376O45519N53965L46244K45869L76701
$$ 728157103 728779018 729277670 729630589 730024576 730582952 731228471 731782436 732128680 732374549 732751250
2223.1G32751250N27263M33683J90258J09375K58326L94106L27826J59621P3433J61648
$$ 732751250 733278513 733712196 733902454 734011829 734270155 734664261 734992087 735151708 735225141 735386789
2243.5G35386789L17037K83122O9141m2140L9399J80721K30849J08063k0564M2618
$$ 735386789 735703826 735986948 736056089 736013949 736053348 736234069 736464918 736572981 736552417 736595035
2263.9G36595035J99258K54333J58191J5855P510J37627J79767K1398j60694j41620
$$ 736595035 736794293 737048626 737206817 737222672 737230182 737367809 737547576 737568974 737408280 737266660
2284.3G37266660m053N4359l5584k06709k71320j84238q5056j18196k62856l64006
$$ 737266660 737262607 737316966 737281382 737074673 736803353 736619115 736534059 736415863 736153007 735789001
2304.7G35789001l34859k31087k05040l22819m35352m32372m38869m69744m45962m63188
$$ 735789001 735454142 735223055 735018015 734695196 734259844 733827472 733388603 732918859 732472897 732009709
2325.1G32009709m95315l85701k85805m13715o07133n91398m09245k82109k83837k69950
$$ 732009709 731514394 731128693 730842888 730429173 729822040 729230642 728821397 728539288 728255451 727985501
2345.5G27985501k18570l67582o11603p38084p78199p95602o92487m54962k79308k84672
$$ 727985501 727766931 727399349 726787746 726049662 725271463 724475861 723783374 723328412 723049104 722764432
2365.9G22764432l50356k06172N2392Q7321n6207j78874k14517j61349j39654k86639
$$ 722764432 722414076 722207904 722260296 722347617 722291410 722112536 721898019 721736670 721597016 721310377
2386.3G21310377n12242o26624n88238n47409o14703p36713q00610p39097o66440p27177
$$ 721310377 720798135 720171511 719583273 719035864 718421161 717684448 716883838 716144741 715478301 714751124
2406.7G14751124q54551r33946r37044q54254q23140r55284j115799j122713j001596
$$ 714751124 713896573 712962627 712025583 711171329 710348189 709392905 708277106 707154393 706152797
2425G06152797r56059j024306j116275j157999j083672r79424j036525j214325j275659
$$ 706152797 705196738 704172432 703056157 701898158 700814486 699835062 698798537 697584212 696308553
2443.4F96308553j166820j028776j043022j173020j218676j151979j052797r99331
$$ 696308553 695141733 694112957 693069935 691896915 690678239 689526260 688473463 687474132
2459.7F87474132j058996j158238j161396j053155r59277j019478j148164j159727
$$ 687474132 686415136 685256898 684095502 683042347 682083070 681063592 679915428 678755701
2476F78755701j058042r81689j010478j091957j093983r76980q85367r23396j018941
$$ 678755701 677697659 676715970 675705492 674613535 673519552 672542572 671657205 670733809 669714868
2494.4F69714868j027703r47535q85248q80480r27091r59158r22203q50260q31247
$$ 669714868 668687165 667739630 666854382 665973902 665046811 664087653 663165450 662315190 661483943
2512.7F61483943r17375j012265r89557r02474q74877r41455j051247j105547j063168
$$ 661483943 660566568 659554303 658564746 657662272 656787395 655845940 654794693 653689146 652625978
2531.1F52625978r88483j010478j137733j192272j120329j055241j067102j114606
$$ 652625978 651637495 650627017 649489284 648297012 647176683 646121442 645054340 643939734
2547.4F43939734j127899j075983j001835r88305j049459j092791j067877j001179
$$ 643939734 642811835 641735852 640734017 639745712 638696253 637603462 636535585 635534406
2563.7F35534406r68695j012623j055062j043499j003265j004279j051128j070559
$$ 635534406 634565711 633553088 632498026 631454527 630451262 629446983 628395855 627325296
2580F27325296j063764j042306r97782j004934j067221j078606j042306r86755r66013
$$ 627325296 626261532 625219226 624221444 623216510 622149289 621070683 620028377 619041622 618075609
2598.4F18075609j055240j153112j183510j185655j211167j294076j372635j414657
$$ 618075609 617020369 615867257 614683747 613498092 612286925 610992849 609620214 608205557
2614.7F08205557j439273j456559j541794j655221j676738j654625j678586j752734
$$ 608205557 606766284 605309725 603767931 602112710 600435972 598781347 597102761 595350027
2631E95350027j824975j829743j786113j753271j752853j801074j837611j795053j747012
$$ 595350027 593525052 591695309 589909196 588155925 586403072 584601998 582764387 580969334 579222322
2649.4E79222322j748980j770615j769602j746476j739025j736641j733184j729667
$$ 579222322 577473342 575702727 573933125 572186649 570447624 568710983 566977799 565248132
2665.7E65248132j698137j645922j585901j559675j595914j610696j535714j439870
$$ 565248132 563549995 561904073 560318172 558758497 557162583 555551887 554016173 552576303
2682E52576303j432299j499534j532793j491308j441002j472652j577616j637220j636148
$$ 552576303 551144004 549644470 548111677 546620369 545179367 543706715 542129099 540491879 538855731
2700.4E38855731j637458j664162j734138j796603j798987j767337j756251j778305
$$ 538855731 537218273 535554111 533819973 532023370 530224383 528457046 526700795 524922490
2716.7E24922490j799285j782775j725674j668870j608968j557350j547337j522541
$$ 524922490 523123205 521340430 519614756 517945886 516336918 514779568 513232231 511709690
2733E11709690j459658j436472j460195j455307j407563j374305j387834j401961j377493
$$ 511709690 510250032 508813560 507353365 505898058 504490495 503116190 501728356 500326395 498948902
2751.4D98948902j325786j285047j299947j352102j373171j348675j325696j333446
$$ 498948902 497623116 496338069 495038122 493686020 492312849 490964174 489638478 488305032
2767.7D88305032j392483j481623j524597j528055j561135j619816j685470j758128
$$ 488305032 486912549 485430926 483906329 482378274 480817139 479197323 477511853 475753725
2784D75753725j829297j897245j939118j966149k046525k158851k193838k180726k231210
$$ 475753725 473924428 472027183 470088065 468121916 466075391 463916540 461722702 459541976 457310766
2802.3D57310766k350330k483935k544730k536625k585709k700746k783567k820790
$$ 457310766 454960436 452476501 449931771 447395146 444809437 442108691 439325124 436504334
2818.7D36504334k889544l039002l191322l262162l335357l512472l762722m042298
$$ 436504334 433614790 430575788 427384466 424122304 420786947 417274475 413511753 409469455
2835D09469455m359066m756302n361974o226718p143349p793039p879019p215500n875915
$$ 409469455 405110389 400354087 394992113 388765395 381622046 373829007 365949988 358734488 352858573
2853.3C52858573m279464l043562k556473k797693l524542m408658n101919n317390
$$ 352858573 348579109 345535547 342979074 340181381 336656839 332248181 327146262 321828872
2869.7C21828872m933029m086256l117502k322197j791090j501530j385928j394331
$$ 321828872 316895843 312809587 309692085 307369888 305578798 304077268 302691340 301297009
2886C01297009j508385j647770j770944j901448k071887k330512k614528k851069l131061
$$ 301297009 299788624 298140854 296369910 294468462 292396575 290066063 287451535 284600466 281469405
2904.3B81469405l520221l997683m536242n061715n490393n699396n565718n086332
$$ 281469405 277949184 273951501 269415259 264353544 258863151 253163755 247598037 242511705
2920.6B42511705m289449l208264j997263q16434L36751J486018K599925L615499M379675
$$ 242511705 238222256 235013992 233016729 232200295 232537046 234023064 236622989 240238488 244618163
2939B44618163M727989M649714M264384L650755K869338K088308J525938J343072J593947
$$ 244618163 249346152 253995866 258260250 261911005 264780343 266868651 268394589 269737661 271331608
2957.4B71331608K199024K993465L817051M619986N337835N864858O254614O539791
$$ 271331608 273530632 276524097 280341148 284961134 290298969 296163827 302418441 308958232
2973.7C08958232O647140O578654O378114O066621N655616N143911M541308L889769
$$ 308958232 315605372 322184026 328562140 334628761 340284377 345428288 349969596 353859365
2990C53859365L239423K588898J895755J197070N40316j01059o81639j080453j275152
$$ 353859365 357098788 359687686 361583441 362780511 363320827 363219768 362538129 361457676 360182524
3008.3C60182524j345963j344949j283794j255751j354694j580030j931637k296895
$$ 360182524 358836561 357491612 356207818 354952067 353597373 352017343 350085706 347788811
3024.7C47788811k473772k487659k474517k455801k465754k549470k678603k787828
$$ 347788811 345315039 342827380 340352863 337897062 335431308 332881838 330203235 327415407
3041C27415407k829701k817005k837092k912372k927184k883375k882182k890200k828717
$$ 327415407 324585706 321768701 318931609 316019237 313092053 310208678 307326496 304436296 301607579
3059.3C01607579k703995k557426k412260k243012k056569j957744j949311j913487
$$ 301607579 298903584 296346158 293933898 291690886 289634317 287676573 285727262 283813775
3075.6B83813775j818270j729399j673579j621902j541615j449674j383334j332343
$$ 283813775 281995505 280266106 278592527 276970625 275429010 273979336 272596002 271263659
3092B71263659j295775j282305j313448j378446j423002j448840j474410j509309j565665
$$ 271263659 269967884 268685579 267372131 265993685 264570683 263121843 261647433 260138124 258572459
3110.3B58572459j629799j663566j667291j697957j757086j804843j843050j877591
$$ 258572459 256942660 255279094 253611803 251913846 250156760 248351917 246508867 244631276
3126.6B44631276j901225j933172j979798k014801k037585k033576k017930k049312
$$ 244631276 242730051 240796879 238817081 236802280 234764695 232731119 230713189 228663877
3143B28663877k099395k106890k088398k082825k075150k061278k068028k076998k050653
$$ 228663877 226564482 224457592 222369194 220286369 218211219 216149941 214081913 212004915 209954262
3161.3B09954262k021820k033904k073049k084777k039447k001241k002314j981795
$$ 209954262 207932442 205898538 203825489 201740712 199701265 197700024 195697710 193715915
3177.6A93715915j936942j917869j906261j898631j894400j848578j776919j721785
$$ 193715915 191778973 189861104 187954843 186056212 184161812 182313234 180536315 178814530
3193.9A78814530j712590j735032j708314j610979j529664j507118j488134j454741
$$ 178814530 177101940 175366908 173658594 172047615 170517951 169010833 167522699 166067958
3210.3A66067958j464591j470446j414597j382724j388520j373052j370937j414671
$$ 166067958 164603367 163132921 161718324 160335600 158947080 157574028 156203091 154788420
3226.6A54788420j426474j396984j402378j449599j500637j541272j576110j601965
$$ 154788420 153361946 151964962 150562584 149112985 147612348 146071076 144494966 142893001
3242.9A42893001j625433j611635j597434j677976j770362j748055j682431j704305
$$ 142893001 141267568 139655933 138058499 136380523 134610161 132862106 131179675 129475370
3259.2A29475370j750007j702920j615360j550213j477994j392022j291416j164258
$$ 129475370 127725363 126022443 124407083 122856870 121378876 119986854 118695438 117531180
3275.5A17531180j058973j001790r41634q34383o74136n27934m70183m43258l56458
$$ 117531180 116472207 115470417 114528783 113694400 113020264 112492330 112022147 111578889 111222431
3293.9A11222431k73526k14092j11528o7495r6693r2253n1238L8370J29544J24335
$$ 111222431 110948905 110734813 110623285 110555790 110459097 110366844 110315606 110353976 110483520 110607855
3314.3A10607855R3557J17734J57125J72645J40354R2052J02200J74418K27116K25417
$$ 110607855 110701412 110819146 110976271 111148916 111289270 111381322 111483522 111657940 111885056 112110473
3334.7A12110473J95839J44474P9401M2505L9161N5991P8559P1570M5337K555j7814
$$ 112110473 112306312 112450786 112530187 112572692 112611853 112667844 112746403 112817973 112863310 112865865 112848051
3357.1A12848051K4639P6257P3731M0792K4929R157k3358l7521L278M8213N4106M4130
$$ 112848051 112872690 112948947 113022678 113063470 113088399 113097556 113074198 113036677 113039955 113088168 113142274 113186404
3381.6A13186404O0208J15119J98268K08340R5964L3319Q2142J62959K61635K98955
$$ 113186404 113246612 113361731 113559999 113768339 113864303 113897622 113979764 114142723 114404358 114703313
3402A14703313K15224J63928K02432K59214L15062L75033M03985L92772M00968M48406
$$ 114703313 114918537 115082465 115284897 115544111 115859173 116234206 116638191 117030963 117431931 117880337
3422.4A17880337N53474O47433O79247O67594P07038P92377P32600O17192O54056P40871
$$ 117880337 118433811 119081244 119760491 120428085 121135123 121927500 122660100 123277292 123931348 124672219
3442.8A24672219Q06362R18507R68099R35793R30100R94906J085475J110077J074970
$$ 124672219 125478581 126397088 127365187 128300980 129231080 130225986 131311461 132421538 133496508
3461.1A33496508J107499J251101J327307J194417J027808J095324J280308J397222
$$ 133496508 134604007 135855108 137182415 138376832 139404640 140499964 141780272 143177494
3477.4A43177494J424849J411751J436249J493424J535237J568958J597121J577586
$$ 143177494 144602343 146014094 147450343 148943767 150479004 152047962 153645083 155222669
3493.8A55222669J580224J614704J678646J737535J688093J617223J687214J811743
$$ 155222669 156802893 158417597 160096243 161833778 163521871 165139094 166826308 168638051
3510.1A68638051J902192J933173J853451J841798J954004K087877K104178K008423
$$ 168638051 170540243 172473416 174326867 176168665 178122669 180210546 182314724 184323147
3526.4A84323147K021179K145707K237946K336502K415940K374843K374709K470284
$$ 184323147 186344326 188490033 190727979 193064481 195480421 197855264 200229973 202700257
3542.7B02700257K572403K587497K569631K624526K702296K775773K874166K988756
$$ 202700257 205272660 207860157 210429788 213054314 215756610 218532383 221406549 224395305
3559B24395305L060654L040328L100947L484890L720373L550395L466710L615171L782183
$$ 224395305 227455959 230496287 233597234 237082124 240802497 244352892 247819602 251434773 255216956
3577.4B55216956L929436M071445M085272M068554M263967M458874M340560M331648
$$ 255216956 259146392 263217837 267303109 271371663 275635630 280094504 284435064 288766712
3593.7B88766712M561931M745483M794300M785538M736304M705280M878998N025953
$$ 288766712 293328643 298074126 302868426 307653964 312390268 317095548 321974546 327000499
3610C27000499N048811N106449M998893N067497N455673N330086M940152M784524N207897
$$ 327000499 332049310 337155759 342154652 347222149 352677822 358007908 362948060 367732584 372940481
3628.4C72940481N789846N461126N204052N203426N126536N136460N133957M959732
$$ 372940481 378730327 384191453 389395505 394598931 399725467 404861927 409995884 414955616
3644.7D14955616M809827N142659N549669N113661M654139M902006M980594M668593
$$ 414955616 419765443 424908102 430457771 435571432 440225571 445127577 450108171 454776764
3661D54776764M541069M438192M056990L918022M239231L923297L650159L978640L848254
$$ 454776764 459317833 463756025 467813015 471731037 475970268 479893565 483543724 487522364 491370618
3679.4D91370618L595889L507078L282308L064692L004134K948701K844572K729595
$$ 491370618 494966507 498473585 501755893 504820585 507824719 510773420 513617992 516347587
3695.7E16347587K566993K375782K305984K369762K310574K095044J896798J946330
$$ 516347587 518914580 521290362 523596346 525966108 528276682 530371726 532268524 534214854
3712E34214854K179981K142131J940310J772702J649558J532614J557529J774967J771867
$$ 534214854 536394835 538536966 540477276 542249978 543899536 545432150 546989679 548764646 550536513
3730.3E50536513J550079J349270J373351J621186J567841J084328J041770J521408
$$ 550536513 552086592 553435862 554809213 556430399 557998240 559082568 560124338 561645746
3746.7E61645746J301289J072824J382768J473188J262367J134098J273572J339436
$$ 561645746 562947035 564019859 565402627 566875815 568138182 569272280 570545852 571885288
3763E71885288J191795J042008R88483J142920J254856J140595J002490R91643J095295
$$ 571885288 573077083 574119091 575107574 576250494 577505350 578645945 579648435 580640078 581735373
3781.3E81735373J034379R01460R49562J075208J081288Q78990P47382Q34584O79195
$$ 581735373 582769752 583671212 584620774 585695982 586777270 587656260 588403642 589238226 589917421
3799.7E89917421O53386J015664Q96811Q13246J076758J061141P27356O11305P41065
$$ 589917421 590570807 591586471 592483282 593296528 594373286 595434427 596161783 596773088 597514153
3818E97514153M95731N82040R55105R34362Q42571O91116O52492P56800N58555L60907
$$ 597514153 598009884 598591924 599547029 600481391 601323962 602015078 602667570 603424370 603982925 604343832
3838.4F04343832N36084P19547Q44896Q93414Q04722L91722j71602L23355J061857
$$ 604343832 604879916 605599463 606444359 607337773 608142495 608534217 608362615 608685970 609747827
3856.8F09747827Q69393N17726L77894N48005N96404L06964L35693N21541O61015P10011
$$ 609747827 610617220 611134946 611512840 612060845 612657249 612964213 613299906 613821447 614482462 615192473
3877.2F15192473M44829L94226L99112L26157N52475M72188K37823M30107N32925L10123
$$ 615192473 615637302 616031528 616430640 616756797 617309272 617781460 618019283 618449390 618982315 619292438
3897.6F19292438J30117P7128J50919M18842N29468M25875L68238K52843P3194J33813
$$ 619292438 619422555 619499683 619650602 620069444 620598912 621024787 621393025 621645868 621719062 621852875
3918F21852875L06070K32637J25706K04444K45154J74403K05993L09229L28303K90215
$$ 621852875 622158945 622391582 622517288 622721732 622966886 623141289 623347282 623656511 623984814 624275029
3938.4F24275029J92642J54078K32816K17199J92285K87830K90752J75238J15335J78873
$$ 624275029 624467671 624621749 624854565 625071764 625264049 625551879 625842631 626017869 626133204 626312077
3958.8F26312077K55525K43366K07364J70589J66416J94907J87636J89543J84416J38283
$$ 626312077 626567602 626810968 627018332 627188921 627355337 627550244 627737880 627927423 628111839 628250122
3979.2F28250122J59502K22981J96517J21057J46091K54094K63155K04861K22862
$$ 628250122 628409624 628632605 628829122 628950179 629096270 629350364 629613519 629818380 630041242
3997.5F30041242
$$ 630041242
##END=$$ End of the data block
