##TITLE=G14-51-SE $$ Begin of the data block
##JCAMP-DX=5.00 $$ ACD/SpecManager v 10.08
##SPECTROMETER/DATA SYSTEM=Alpha
##DATE=22 Oct 2013 10:53:20
##DATA TYPE=INFRARED SPECTRUM
##DATA CLASS=XYDATA
##ORIGIN=
##OWNER=
##NPOINTS=1765
##FIRSTX=399.75695801
##LASTX=3997.56933594
##MAXX=3997.56933594
##MINX=399.75695801
##MAXY=0.73840427
##MINY=0.10239107
##XFACTOR=1.0000000000
##YFACTOR=1.000000000000000e-9
##FIRSTY=0.34454066
##DELTAX=2.03957629
##XUNITS=1/CM
##YUNITS=ARBITRARY UNITS
##XYDATA=(X++(Y..Y))
399.8C44540656l665060l189951k166450n75185N24699N14657M9293M7386Q9138o86943
420.2C35482240j698971k329260k316863j846551j803935k098501j849621r18806K46972
438.5C20866704J293570J709819J475244J256258J016020M47721k92868r77844j660645
456.9C25133979k140999k139002k424478l042609l245234k867013k463311k462179
473.2C04349154k433955k100617j535714r81390p74920r29207j220405j304924j354456
491.5B91713566j716793k220124k593428k609610k588481k792776l057092l355950
507.9B70779312l270716k905071k856820k996952k969503k603203j882255j122773
524.2B50172019n85109j65299K69920Q62137J636177K388984K810359K733856K303779
$$ plain form
399.8 344540656 340875596 337685645 335519195 334944010 335468709 335983366 336032659 336080045 336169183 335482240
420.2 335482240 333783269 331454009 329137146 327290595 325486660 323388159 321538538 320619732 320866704
438.5 320866704 322160274 323870093 325345337 326601595 327617615 328065336 327772468 326794624 325133979
456.9 325133979 322992980 320853978 318429500 315386891 312141657 309274644 306811333 304349154
473.2 304349154 301915199 299814582 298278868 297297478 296522558 295593351 294372946 293068022 291713566
491.5 291713566 289996773 287776649 285183221 282573611 279985130 277192354 274135262 270779312
507.9 270779312 267508596 264603525 261746705 258749753 255780250 253177047 251294792 250172019
524.2 250172019 249586910 249421611 249691531 250553668 252189845 254578829 257389188 260123044 262426823
542.5B62426823J562417N37455l56823p74712r70631j259268j673817k159268k475649
560.9B54856527k565682k639532k822936k839565k209172j059085J00538J170099K100438
579.2B44091630K714127L195733L543884L326684K424806J362056O81132L98010J70857
597.6B61908919j51664l52920j77621K32607M88072M63665L16352L25977N96762J173854
618B64824003J751721K062619K480805K937465L082335K892524K498955K092779J880169
636.3B86503375J893699J779884J326740R46253Q60036Q52882P05839L68684J14024
654.7B95351416J36703L29107M50671L47167K00182M40240J229584J437545J363993
673.1C01286608J469642J522958J640082J778245J601815J137882P64489N52267K30134
$$ plain form
542.5 262426823 263989240 264526695 264169872 263395160 262424529 261165261 259491444 257332176 254856527
560.9 254856527 252290845 249651313 246828377 243988812 241779640 240720555 240821093 241991192 244091630
579.2 244091630 246805757 250001490 253545374 256872058 259296864 260658920 261340052 261738062 261908919
597.6 261908919 261757255 261404335 261226714 261459321 261947393 262411058 262727410 263053387 263650149 264824003
618 264824003 266575724 268638343 271119148 274056613 277138948 280031472 282530427 284623206 286503375
636.3 286503375 288397074 290176958 291503698 292449951 293309987 294162869 294868708 295237392 295351416
654.7 295351416 295488119 295817226 296267897 296615064 296815246 297255486 298485070 299922615 301286608
673.1 301286608 302756250 304279208 305919290 307697535 309299350 310437232 311201721 311753988 311984122
691.4C11984122m51833j246721j574099j120597j43856P87676J330495J744329K328456
709.8C13637972L057480L800243M222959M391819M875690N550236N877584N816698
726.1C51230681N280256M525483M080236L712505K906561J805007R66728N28753K38001
744.4C75274211k30163q50380j369953j613766j744508k039880k296656k074540j162827
762.8C61891538K33412J789510L296047M659027N875707O905049P315516O778479N798072
781.2D04542357N017251M501968L918707L127128K394885K239913K779156L502369
797.5D32023734L905922L980160L966003L911198L619849K859712J786917Q89033M65870
815.8D57408398J19746o29067j705319k737164l416360l756344m001737m337042m539401
$$ plain form
691.4 311984122 311532289 310285568 308711469 307590872 307447016 308234692 309565187 311309516 313637972
709.8 313637972 316695452 320495695 324718654 329110473 333986163 339536399 345413983 351230681
726.1 351230681 356510937 361036420 365116656 368829161 371735722 373540729 374507457 375036210 375274211
744.4 375274211 375044048 374193668 372823715 371209949 369465441 367425561 365128905 363054365 361891538
762.8 361891538 362124950 363914460 367210507 371869534 377745241 384650290 391965806 398744285 404542357
781.2 404542357 409559608 414061576 417980283 421107411 423502296 425742209 428521365 432023734
797.5 432023734 435929656 439909816 443875819 447787017 451406866 454266578 456053495 456942528 457408398
815.8 457408398 457528144 456899077 455193758 452456594 449040234 445283890 441282153 436945111 432405710
834.2D32405710m364997m085481l957152l804654l436834k753645j919598j349478
850.5D06733871j215756j289964j142353l79264J353204L821313O121785P711231Q535594
868.9D30249661Q432240P187873M923790K182544m17710k694905m733949o354422p214963
887.2D31560159p265300o856590o495715o416499o430924o415218o623447p228106
903.5C77828360q058429q790076r106129q971870q600414q051962p097870n582809
919.8C13568801l802568k280980j334101r24945p05481l73691k2322Q9467m2886j95593
940.2C03975701n24461j764476m217386p098884r321689j0464192j0882825j1041209
956.6B48660579j1048823j0930136j0784611j0599002j0297642r850338r199932q279055
$$ plain form
834.2 432405710 428040713 423955232 419998080 416193426 412756592 410002947 408083349 406733871
850.5 406733871 405518115 404228151 403085798 402706534 404059738 407881051 414002836 421714067 430249661
868.9 430249661 438681901 445869774 450793564 452976108 452558398 449863493 445129544 438775122 431560159
887.2 431560159 424294859 417438269 410942554 404526055 398095131 391679913 385056466 377828360
903.5 377828360 369769931 360979855 351873726 342901856 334301442 326249480 319151610 313568801
919.8 313568801 309766233 307485253 306151152 305226207 304520726 304147035 304124713 304214180 304171294 303975701
940.2 303975701 303451240 301686764 297469378 290370494 281048805 270584613 259701788 248660579
956.6 248660579 237611756 226681620 215897009 205298007 195000365 185150027 175950095 167671040
972.9A67671040p130951n884305m667654l549099k525717j634270r91285o64771n66840
991.2A40056148n22077l61830q1882J72988L35455L90395K50861o5773m38258q19117
1011.6A38916910j057566j061588r88334j003206j129285j281365j374737j383722
1027.9A29637107j353413j341998j394928j479529j523099j498253j444689j362913
1044.3A18238285j190178r12979n27576r6604L10488O93589J061142J420163J760505
1062.6A20756835J954302J756482R71280j94460j036078j031004k98090P19763J734354
1081A25333384K592951L162384L474742L617331L622055L504798L187955K662643K100036
1099.3A53258279J600206J252353J189187J406759J766369K125561K382547K452269
$$ plain form
972.9 167671040 160540089 154655784 149988130 146439031 143913314 142279044 141287759 140622988 140056148
991.2 140056148 139534071 139172241 139090359 139263347 139598802 139989197 140240058 140174285 139736027 138916910
1011.6 138916910 137859344 136797756 135809422 134806216 133676931 132395566 131020829 129637107
1027.9 129637107 128283694 126941696 125546768 124067239 122544140 121045887 119601198 118238285
1044.3 118238285 117048107 116135128 115607552 115510948 115821436 116515025 117576167 118996330 120756835
1062.6 120756835 122711137 124467619 125438899 125244439 124208361 123177357 122879267 123599030 125333384
1081 125333384 127926335 131088719 134563461 138180792 141802847 145307645 148495600 151158243 153258279
1099.3 153258279 154858485 156110838 157300025 158706784 160473153 162598714 164981261 167433530
1115.6A67433530K318427K037644J707077J485378J501426J717210K054408K347693
1132A82602793K307549J841351J086265K70725l61890p21335q47727q03128o55383
1150.3A84719220l90932L3617O27249J326263K022177K689883L331855L914908M434869
1168.7B02709109N026415N795583O602212P245005P649138P800624P689104P346421
1185B57863611O823480O031841M869908L475786K088576Q88944n37n66810q80659r35524
1205.4B79658616p20054l39568j4067Q3626J0818j13756l03208o29694j082390j538724
1225.8B75011599j829266j932681j939923j809001j467406j022548n48124K1338O52075
1244.1B65136063J245946J741290K117365K380223K521961K535403K479285K407551
$$ plain form
1115.6 167433530 169751957 171789601 173496678 174982056 176483482 178200692 180255100 182602793
1132 182602793 184910342 186751693 187837958 188108683 187746793 187025458 186177731 185374603 184719220
1150.3 184719220 184328288 184361905 184989154 186315417 188337594 191027477 194359332 198274240 202709109
1168.7 202709109 207735524 213531107 220133319 227378324 235027462 242828086 250517190 257863611
1185 257863611 264687091 270718932 275588840 279064626 281153202 282042146 282041609 281474799 280594140 279658616
1205.4 279658616 278938562 278598994 278584927 278668553 278679371 278565615 278262407 277632713 276550323 275011599
1225.8 275011599 273182333 271249652 269309729 267500728 266033322 265010774 264462650 264483988 265136063
1244.1 265136063 266382009 268123299 270240664 272620887 275142848 277678251 280157536 282565087
1260.4B82565087K333641K309889K339303K354235K297133K120525J785218J412422
1276.8B99517453J176893J105249J154662J252889J270503J115054P89761L29614k29716
1295.1C07482362q81821j481295j844555j975387j981765j948029j855522j635164
1311.4B93878824j235009p32779k93464k4110J4603k74151r03040j720846k458602
1329.8B86251426k870381k869815k511680j996547j484126j065701p95335o91264p79510
1348.1B71187067j056910j414567j721501j922101k098262k478421l147811l745585
1364.5B53601909l893167l666982l129095k788946k924562l124997l284812l476202
1380.8B27313146l482610l062725k233580j178786m11034j56909j49667l9682K24218
$$ plain form
1260.4 282565087 284898728 287208617 289547920 291902155 294199288 296319813 298105031 299517453
1276.8 299517453 300694346 301799595 302954257 304207146 305477649 306592703 307382464 307712078 307482362
1295.1 307482362 306600541 305119246 303274691 301299304 299317539 297369510 295513988 293878824
1311.4 293878824 292643815 291911036 291617572 291593462 291608065 291333914 290430874 288710028 286251426
1329.8 286251426 283381045 280511230 277999550 276003003 274518877 273453176 272657841 271966577 271187067
1348.1 271187067 270130157 268715590 266994089 265071988 262973726 260495305 257347494 253601909
1364.5 253601909 249708742 246041760 242912665 240123719 237199157 234074160 230789348 227313146
1380.8 227313146 223830536 220767811 218534231 217355445 216944411 216787502 216637835 216598153 216822371
1399.1B16822371N45800Q68529J197561J397372J495152J625017J704842J750200J997725
1417.5B29404569K547890K645179K462521K331451J963004J456112Q64998K82362j74642
1435.9B43783444k52440Q8989M55529O61313P03365O45563M65646K41340L89292J417011
1456.2B48599052K800256K935350K840668L391892M079819M766613O454408R225458
1472.6B85093516R998292Q393764O641984M906744L200680J423538m08113k454758
1488.9C16795647m272222m926891n630880o856203o985933o364047o105900p512897
1505.2B68140674j0357827r440869p845894p537678o483748m633025k831891k253726
1521.5B16756016k348036k416417k548649k296702k090141k098828j645595j099497
$$ plain form
1399.1 216822371 217368171 218236700 219434261 220831633 222326785 223951802 225656644 227406844 229404569
1417.5 229404569 231952459 234597638 237060159 239391610 241354614 242810726 243675724 243958086 243783444
1435.9 243783444 243531004 243619993 244075522 244736835 245440200 246085763 246551409 246792749 247182041 248599052
1456.2 248599052 251399308 254334658 257175326 260567218 264647037 269413650 275868058 285093516
1472.6 285093516 295091808 303485572 310127556 315034300 318234980 319658518 319250405 316795647
1488.9 316795647 312523425 307596534 301965654 295109451 288123518 281759471 275653571 268140674
1505.2 268140674 257782847 248341978 240496084 232958406 226474658 221841633 219009742 216756016
1521.5 216756016 214407980 211991563 209442914 207146212 205056071 202957243 201311648 200212151
1537.8B00212151q36790k44811N54934J219392J875967K636939L280386L670738L810256
1556.2B16179162M765258N615338L928840L069774L011390K883703K752095K089158
1572.5B44294718J550406J425177J045942N90563K74763O2868j38313l86834p73758
1590.9B47945532j192957j706675k285048k905011l600419m287898m957319n704730
1607.2B21305475o586671p111639p197276q011311r463295q703947q263797r414181
1623.5A56553358r282306q502379q038834p029667o382548o404742m602753k328284
1639.8A03981845j145869m44904J51217P05011Q63381J243457K119660K210885K248533
1658.2A11933216K937682L917881M620053M607968N318239O424829O221921O598621
$$ plain form
1537.8 200212151 199375361 199130550 199685484 200904876 202780843 205417782 208698168 212368906 216179162
1556.2 216179162 220944420 226559758 230488598 233558372 236569762 239453465 242205560 244294718
1572.5 244294718 245845124 247270301 248316243 248906806 249181569 249244437 249106124 248719290 247945532
1590.9 247945532 246752575 245045900 242760852 239855841 236255422 231967524 227010205 221305475
1607.2 221305475 214718804 207607165 200409889 192398578 182935283 174231336 165967539 156553358
1623.5 156553358 147271052 138768673 130729839 123700172 117317624 110912882 106310129 103981845
1639.8 103981845 102835976 102391072 102542289 103247300 104110681 105354138 107473798 109684683 111933216
1658.2 111933216 114870898 118788779 123408832 128016800 133335039 139759868 145981789 152580410
1674.5A52580410P452727P239922P077531Q280411J0967895J0817990R911001J1214375
1690.8B25542262J2114123J4929503J7842591J8616080K1064013J8076480J5178740
1705.1C43363792J5080988J3116837J1140108R775579Q895576Q841455P932961O172299
1721.4D24319595N310446M856438M201650L757626L397018L638535L870011L391921
1737.7D56743240L701121M559755N235166N981475O856084Q109241R090841Q741141
1754E09018064Q585810Q631647Q138776Q231103P905066P134736O730735O205976O182492
1772.4E76764405O121635N299509M644274M256666L971458L892898L792286L309131
1788.7F12052262K807796K934992L162146K977729K656459K440930K404988K483904
$$ plain form
1674.5 152580410 160033137 167273059 174350590 182631001 193598896 204416886 214327887 225542262
1690.8 225542262 237656385 252585888 270428479 289044559 310108572 328185052 343363792
1705.1 343363792 358444780 371561617 382701725 392477304 401372880 410214335 418147296 424319595
1721.4 424319595 429630041 434486479 438688129 442445755 445842773 449481308 453351319 456743240
1737.7 456743240 460444361 465004116 470239282 476220757 483076841 491186082 500276923 509018064
1754 509018064 517603874 526235521 534374297 542605400 550510466 557645202 564375937 570581913 576764405
1772.4 576764405 582886040 588185549 592829823 597086489 601057947 604950845 608743131 612052262
1788.7 612052262 614860058 617795050 620957196 623934925 626591384 629032314 631437302 633921206
1805F33921206K524912K337933K104700K017319K107084K212405K119779J803995J628458
1823.4F52777791J808226J883984J766920J682937J543343J474321J571715J513421
1839.7F66022658J188636J027286J282811J407147J282871J139402J006544R98914
1856F75356269J056015J085878J039743Q93414P03097P13229J003325J133263R87291
1874.4F83971524Q18789Q11100R46343J045466R74178Q05140P33017Q90971J024365
1892.7F92020893R12070P25747O08742O66976P98642P72655N56410L98457N27501P22349
1913.1F98710442O52909M27246L77834M63605O17444P24972N41448K93553L31283N29825
1933.5G03670561N51999L94523K08378J68264L70264N66065N01454L23653L02494M50075
$$ plain form
1805 633921206 636446118 638784051 640888751 642906070 645013154 647225559 649345338 651149333 652777791
1823.4 652777791 654586017 656470001 658236921 659919858 661463201 662937522 664509237 666022658
1839.7 666022658 667211294 668238580 669521391 670928538 672211409 673350811 674357355 675356269
1856 675356269 676412284 677498162 678537905 679431319 680134416 680847645 681850970 682984233 683971524
1874.4 683971524 684790313 685601413 686547756 687593222 688567400 689372540 690105557 690996528 692020893
1892.7 692020893 692932963 693658710 694267452 694934428 695733070 696505725 697062135 697460592 697988093 698710442
1913.1 698710442 699363351 699790597 700168431 700632036 701249480 701974452 702515900 702809453 703140736 703670561
1933.5 703670561 704222560 704617083 704825461 704993725 705363989 705930054 706431508 706755161 707057655 707507730
1953.9G07507730N55098M96506L95298L37422L37362M12822M96567M16338K70605K88785
1974.3G11514533M02689M49955L50833K05457J58489K39313L10838K61843J54257J24693
1994.7G14172900K22563L20197K54094L6776q4996k2948P1407K1696j71304l33667
2015.1G14486718k99156j47223j56701l34799m61399m03047k70903k17259l00825m13477
2035.5G11481929l84808k60949j84357j97649k45273k30074j02460K622J2159j6510
2055.9G09874630J3471J31309J87635J37389J06811J36495J56164J57416J23203R9599
2076.3G11124122J23918J31726J10686J14024J66178J77860J20401Q3924J29342K21550
2096.7G12503731K76923K27154J61111J96755K71201K65241J62422Q5950J22011K10226
$$ plain form
1953.9 707507730 708062828 708559334 708954632 709292054 709629416 710042238 710538805 710955143 711225748 711514533
1974.3 711514533 711917222 712367177 712718010 712923467 713081956 713321269 713632107 713893950 714048207 714172900
1994.7 714172900 714395463 714715660 714969754 715006530 714921534 714898586 714969993 714991689 714820385 714486718
2015.1 714486718 714187562 714040339 713883638 713548839 713087440 712684393 712413490 712196231 711895406 711481929
2035.5 711481929 711097121 710836172 710651815 710454166 710208893 709978819 709876359 709878981 709891140 709874630
2055.9 709874630 709888101 710019410 710207045 710344434 710451245 710587740 710743904 710901320 711024523 711124122
2076.3 711124122 711248040 711379766 711490452 711604476 711770654 711948514 712068915 712152839 712282181 712503731
2096.7 712503731 712780654 713007808 713168919 713365674 713636875 713902116 714064538 714150488 714272499 714482725
2117.1G14482725K05636Q9407J251N1737J77026K26259J50025N3883Q1777J85132K35319
2139.5G15940177J74284O7354N3942J51992K47836K38478J66655J66714K72572L84807
2159.9G17864811M47393M34339L88265M24563N43833O55413O55055N55873N17249N88357
2180.3G23075151O58215O44743N39243M64380N27561O22093O09219M86911L82542M24326
2200.7G28434384N74767O45996N26189L56555L68894N41627O34253N27620L24190K48611
2221.1G33183086L84509N28217M60207K34902J09077K23279L67224L01361J20819N9187
2241.5G35971868K13444L75510K88903M6909n3346N3585J88946K21551J04010k6107
2261.9G37385273L5703K04742K50876J22190k921M7505J67370J69098K4438j38044
$$ plain form
2117.1 714482725 714688361 714777768 714779019 714830756 715007782 715234041 715384066 715437949 715519726 715704858 715940177
2139.5 715940177 716114461 716181815 716235757 716387749 716635585 716874063 717040718 717207432 717480004 717864811
2159.9 717864811 718312204 718746543 719134808 719559371 720103204 720758617 721413672 721969545 722486794 723075151
2180.3 723075151 723733366 724378109 724917352 725381732 725909293 726531386 727140605 727627516 728010058 728434384
2200.7 728434384 729009151 729655147 730181336 730537891 730906785 731448412 732082665 732610285 732934475 733183086
2221.1 733183086 733567595 734095812 734556019 734790921 734899998 735123277 735490501 735791862 735912681 735971868
2241.5 735971868 736185312 736560822 736849725 736896634 736843288 736896873 737085819 737307370 737411380 737385273
2261.9 737385273 737420976 737625718 737876594 737998784 737995863 738043368 738210738 738379836 738404274 738266230
2282.3G38266230j43469l4630M4882k6941k01285k38359j41919q9109j54554k93255
2302.7G36987591l75033l18169k00391j78933l26514m73321m47094l78490l83735m47869
2323.1G33458042n34952n23209l61920l03924m65571o02901n70119m08471k80737k92659
2343.5G29113579k75731k15352l63409n91040p01904p71642q18193o91652m69625l10362
2363.8G23904669k48849k95818k42472o3836J0490n1796j47164j85311j49488j41740
2384.2G22388685k90573n10871o30319o04809n48422o03974p36117q16882p73251o65069
2404.6G16208398o78301q47816r79364r62257q58248q12232r06110j062512j132667
2423G07968891j053632r57608r91344j130820j208245j115561r77456j006186j181186
$$ plain form
2282.3 738266230 738122761 738088131 738133013 738106072 737904787 737666428 737524509 737435400 737280846 736987591
2302.7 736987591 736612558 736294389 736093998 735915065 735588551 735115230 734668136 734289646 733905911 733458042
2323.1 733458042 732923090 732399881 732037961 731734037 731268466 730665565 730095446 729686975 729406238 729113579
2343.5 729113579 728837848 728622496 728259087 727668047 726966143 726194501 725376308 724684656 724215031 723904669
2363.8 723904669 723655820 723360002 723117530 723053694 723064184 723012388 722865224 722679913 722530425 722388685
2384.2 722388685 722098112 721587241 720956922 720352113 719803691 719199717 718463600 717646718 716873467 716208398
2404.6 716208398 715530097 714682281 713702917 712740660 711882412 711070180 710164070 709101558 707968891
2423 707968891 706915259 705957651 704966307 703835487 702627242 701511681 700534225 699528039 698346853
2441.3F98346853j270890j179814j048267j060546j175642j206517j118541j020670
2457.7F89265966r97781j084984j187980j149833j027286r79722j043856j138329j151443
2476F79504752j052141r68754j016081j097977j080215r75966r09567r56059j031339
2494.4F70416653j012266r32276q70526q56936r22858r79066r21667q34524q38519
2512.7F62248015r19580r92239r79125q92878q54492r36091j059294j110672j078070
2531.1F53425574j027584j055479j157760j183331j094223j022636j042366j102984
2547.4F44739211j113177j057267r96113r92238j067341j130461j085580r86933r57907
2565.8F35352194j022756j076221j053036j000702r79006j014412j078546j070201
$$ plain form
2441.3 698346853 697075963 695896149 694847882 693787336 692611694 691405177 690286636 689265966
2457.7 689265966 688268185 687183201 685995221 684845388 683818102 682838380 681794524 680656195 679504752
2476 679504752 678452611 677483857 676467776 675369799 674289584 673313618 672404051 671447992 670416653
2494.4 670416653 669404387 668472111 667601585 666744649 665821791 664842725 663921058 663086534 662248015
2512.7 662248015 661328435 660336196 659357071 658464193 657609701 656673610 655614316 654503644 653425574
2531.1 653425574 652397990 651342511 650184751 649001420 647907197 646884561 645842195 644739211
2547.4 644739211 643626034 642568767 641572654 640580416 639513075 638382614 637297034 636310101 635352194
2565.8 635352194 634329438 633253217 632200181 631199479 630220473 629206061 628127515 627057314
2582.1F27057314j010001r99033j028955j062513j066684j025558r81390j002670j089453
2600.4F17791057j143217j137495j161397j231134j304805j374245j433074j463056
2616.8F07542634j463294j508236j599193j649558j666248j696169j743615j797855
2633.1E94418466j828432j809239j766444j759350j812160j848996j808345j741052
2649.4E80044448j725733j780271j805127j755238j727581j726746j721561j732290
2665.7E66069901j702845j629830j571476j575470j607835j569033j510262j489759
2682E53413391j478612j494050j514972j464486j408875j478195j615465j664221j636624
2700.4E39657891j639128j663923j699507j751543j780807j771749j764893j790762
$$ plain form
2582.1 627057314 626047313 625048280 624019325 622956812 621890128 620864570 619883180 618880510 617791057
2600.4 617791057 616647840 615510345 614348948 613117814 611813009 610438764 609005690 607542634
2616.8 607542634 606079340 604571104 602971911 601322353 599656105 597959936 596216321 594418466
2633.1 594418466 592590034 590780795 589014351 587255001 585442841 583593845 581785500 580044448
2649.4 580044448 578318715 576538444 574733317 572978079 571250498 569523752 567802191 566069901
2665.7 566069901 564367056 562737226 561165750 559590280 557982445 556413412 554903150 553413391
2682 553413391 551934779 550440729 548925757 547461271 546052396 544574201 542958736 541294515 539657891
2700.4 539657891 538018763 536354840 534655333 532903790 531122983 529351234 527586341 525795579
2716.7E25795579j826942j817226j729072j638114j610696j593292j537562j493453
2733E12549222j492024j490116j457632j406550j372755j371026j393914j389682j362056
2751.4D99813467j361459j330316j283944j315564j366615j351863j314521j324624
2767.7D89164561j392782j470565j517326j541078j562447j621097j706213j764923
2784D76588130j816928j868517j908540j973063k063453k135068k174736k210915k269446
2802.3D58167464k350629k450466k523899k526105k575904k728432k813071k822667
2818.7D37376291k898694l040045l178179l271908l358543l520757l750831m023492
2835D10333842m369020m809469n419553o243467p110924p761418p909239p274091n899280
$$ plain form
2716.7 525795579 523968637 522151411 520422339 518784225 517173529 515580237 514042675 512549222
2733 512549222 511057198 509567082 508109450 506702900 505330145 503959119 502565205 501175523 499813467
2751.4 499813467 498452008 497121692 495837748 494522184 493155569 491803706 490489185 489164561
2767.7 489164561 487771779 486301214 484783888 483242810 481680363 480059266 478353053 476588130
2784 476588130 474771202 472902685 470994145 469021082 466957629 464822561 462647825 460436910 458167464
2802.3 458167464 455816835 453366369 450842470 448316365 445740461 443012029 440198958 437376291
2818.7 437376291 434477597 431437552 428259373 424987465 421628922 418108165 414357334 410333842
2835 410333842 405964822 401155353 395735800 389492333 382381409 374619991 366710752 359436661 353537381
2853.3C53537381m282743l052026k571553k831459l576547m442066n089402n287320
2869.7C22404265m930287m112363l134936k321541j779855j471430j359582j404315
2886C01889956j532197j639813j754850j929969k131253k355636k571761k808392l154725
2904.3B82011360l574550m033327m540801n041898n459517n680084n594075n125657
2920.6B42961451m293724l225804k031579q19654L67075J527340K619400L590942M340663
2939B45036110M740373M699647M269600L628164K892495K132535J552671J380503J644969
2957.4B71977067K231479K993852L800273M600793N341053N920112O329000O590605
2973.7C09784234O666481O586880O420105O105185N610257N069077M554630L996968
$$ plain form
2853.3 353537381 349254638 346202612 343631059 340799600 337223053 332780987 327691585 322404265
2869.7 322404265 317473978 313361615 310226679 307905138 306125283 304653853 303294271 301889956
2886 301889956 300357759 298717946 296963096 295033127 292901874 290546238 287974477 285166085 282011360
2904.3 282011360 278436810 274403483 269862682 264820784 259361267 253681183 248087108 242961451
2920.6 242961451 238667727 235441923 233410344 232590690 232957765 234485105 237104505 240695447 245036110
2939 245036110 249776483 254476130 258745730 262373894 265266389 267398924 268951595 270332098 271977067
2957.4 271977067 274208546 277202398 281002671 285603464 290944517 296864629 303193629 309784234
2973.7 309784234 316450715 323037595 329457700 335562885 341173142 346242219 350796849 354793817
2990C54793817L355771K644569J899093J186967N31674r6471o87569j104265j269192
3008.3C61254394j309067j310825j269251j253754j359016j604766j942962k262294
3024.7C48942459k441109k464652k436071k449841k500444k570480k691090k799601
3041C28589171k797663k781272k873510k964348k941280k879948k865433k881527k829850
3059.3C02774340k687454k540946k426863k267689k065181j959116j935809j902938
3075.6B84988344j834363j735896j678020j636237j542717j451671j374751j319587
3092B72415102j325340j338273j350730j388610j413792j429647j461477j498818j549423
3110.3B59658992j615524j666158j667083j671374j752436j838714j866191j879454
$$ plain form
2990 354793817 358149588 360794157 362693250 363880217 364411891 364315420 363627851 362523586 361254394
3008.3 361254394 359945327 358634502 357365251 356111497 354752481 353147715 351204753 348942459
3024.7 348942459 346501350 344036698 341600627 339150786 336650342 334079862 331388772 328589171
3041 328589171 325791508 323010236 320136726 317172378 314231098 311351150 308485717 305604190 302774340
3059.3 302774340 300086886 297545940 295119077 292851388 290786207 288827091 286891282 284988344
3075.6 284988344 283153981 281418085 279740065 278103828 276561111 275109440 273734689 272415102
3092 272415102 271089762 269751489 268400759 267012149 265598357 264168710 262707233 261208415 259658992
3110.3 259658992 258043468 256377310 254710227 253038853 251286417 249447703 247581512 245702058
3126.6B45702058j906603j948312j988516k013966k045080k046243k029866k080529
3143B29642943k123565k075389k031118k045601k073124k109960k115876k081543k079203
3161.3B10907564k086729k054751k040655k057358k039805k021656k023473j986548
3177.6A94596589j931072j910075j903326j901209j897603j854137j802534j763194
3193.9A79633439j707346j661852j660421j656071j604095j531034j479581j466737
3210.3A66866302j487687j479611j430809j408607j388982j359313j369283j396000
3226.6A55546010j399711j415581j430928j437992j473725j512036j554042j583904
3242.9A43738091j607060j671657j729489j735315j730084j727700j721427j729444
$$ plain form
3126.6 245702058 243795455 241847143 239858627 237844661 235799581 233753338 231723472 229642943
3143 229642943 227519378 225443989 223412871 221367270 219294146 217184186 215068310 212986767 210907564
3161.3 210907564 208820835 206766084 204725429 202668071 200628266 198606610 196583137 194596589
3177.6 194596589 192665517 190755442 188852116 186950907 185053304 183199167 181396633 179633439
3193.9 179633439 177926093 176264241 174603820 172947749 171343654 169812620 168333039 166866302
3210.3 166866302 165378615 163899004 162468195 161059588 159670606 158311293 156942010 155546010
3226.6 155546010 154146299 152730718 151299790 149861798 148388073 146876037 145321995 143738091
3242.9 143738091 142131031 140459374 138729885 136994570 135264486 133536786 131815359 130085915
3259.2A30085915j704558j635671j602456j575656j485095j374058j275323j184024
3275.5A18249074j097203r92141r13084q59953p31402n83603m98534m08902l25569
3293.9A11838683k85439k12729j07571p2524j03094r4414k0250M4815P6182O9775O4127
3316.3A11197561J35228J99765J81116J57058J41174J31488J83247K10248J79998J52447
3336.7A12869330J00262N1879N5119N1595K8968O5476J01425M8860J207K2412N6512
3359.1A13453045R5726R1105K4386q821r425k5385k4877J2539M8772P1093N6334L4101
3383.6A13818593P1861J75581K39491J52424L9108N3704J66289K80828K56605J13890
3404A15368374J37694K94037L30068L15882L73684L90813L46750L87430M73626N32389
$$ plain form
3259.2 130085915 128381357 126745686 125143230 123567574 122082479 120708421 119433098 118249074
3275.5 118249074 117151871 116159730 115246646 114386693 113655291 113071688 112573154 112164252 111838683
3293.9 111838683 111553244 111340515 111232944 111160420 111057326 110962912 110942662 110987477 111063659 111133434 111197561
3316.3 111197561 111332789 111532554 111713670 111870728 112011902 112143390 112326637 112536885 112716883 112869330
3336.7 112869330 112969592 113021471 113076590 113128185 113157153 113222629 113324054 113372914 113374121 113396533 113453045
3359.1 113453045 113548771 113639876 113664262 113655441 113646016 113620631 113595754 113608293 113657065 113728158 113784492 113818593
3383.6 113818593 113890454 114066035 114305526 114457950 114497058 114550762 114717051 114997879 115254484 115368374
3404 115368374 115506068 115800105 116130173 116446055 116819739 117210552 117557302 117944732 118418358 118950747
3424.4A18950747O14077P01070O85073O89492P84948P49074O42546P07276Q47138R03383
3444.8A26274824R14827Q82447Q88720R73687J027509J056716J086861J071885J115829
3463.2A35293305J243785J300096J233414J096577J089424J254424J431406J473754
3479.5A45416185J389936J379013J476407J544058J587004J612142J581817J608089
3495.8A57594651J661435J686066J698971J659721J645669J725048J781747J852140
3512.1A71305448J931757J882910J864985J968667K114430K142101K041907K068087
3528.4A87320292K204224K226755K274588K378345K355903K397373K536536K614245
3544.7B06308261K599462K596379K656430K754405K837852K872020K930998L021017
$$ plain form
3424.4 118950747 119564824 120265894 120950967 121640459 122425407 123174481 123817027 124524303 125371441 126274824
3444.8 126274824 127189651 128072098 128960818 129934505 130962014 132018730 133105591 134177476 135293305
3463.2 135293305 136537090 137837186 139070600 140167177 141256601 142511025 143942431 145416185
3479.5 145416185 146806121 148185134 149661541 151205599 152792603 154404745 155986562 157594651
3495.8 157594651 159256086 160942152 162641123 164300844 165946513 167671561 169453308 171305448
3512.1 171305448 173237205 175120115 176985100 178953767 181068197 183210298 185252205 187320292
3528.4 187320292 189524516 191751271 194025859 196404204 198760107 201157480 203694016 206308261
3544.7 206308261 208907723 211504102 214160532 216914937 219752789 222624809 225555807 228576824
3561.1B28576824L056511L120318L473506L737807L601328L501400L647029L857136
3577.4B56571859L999084M060954M034549M055083M298389M511476M381418M364460
3593.7B90277272M584790M717111M743249M810214M818916M708171M806131N006820
3610C28472674N071282N143106N072266N104154N449236N368441M980266M796356N268127
3628.4C74725908N855322N432814N158961N190462N121112N142808N122870M907221
3644.7D16657478M768967N159498N566388N105853M654467M883945M954666M648209
3661D56399471M480034M366398M075199M023015M289896L867775L576279L938645L805309
3679.4D92822021L554017L522783L350705L126860L029167K931834K784669K679110
$$ plain form
3561.1 228576824 231633335 234753653 238227159 241964966 245566294 249067694 252714723 256571859
3577.4 256571859 260570943 264631897 268666446 272721529 277019918 281531394 285912812 290277272
3593.7 290277272 294862062 299579173 304322422 309132636 313951552 318659723 323465854 328472674
3610 328472674 333543956 338687062 343759328 348863482 354312718 359681159 364661425 369457781 374725908
3628.4 374725908 380581230 386014044 391173005 396363467 401484579 406627387 411750257 416657478
3644.7 416657478 421426445 426585943 432152331 437258184 441912651 446796596 451751262 456399471
3661 456399471 460879505 465245903 469321102 473344117 477634013 481501788 485078067 489016712 492822021
3679.4 492822021 496376038 499898821 503249526 506376386 509405553 512337387 515122056 517801166
3695.7E17801166K576530K399683K290904K342343K295435K078771J894892K001405
3712E35681129K212464K078474J885354J799465J683771J495123J459599J734435J828969
3730.3E51858783J592934J360595J438975J673341J530707R79602R28343J515686J351834
3748.7E64230800J059472J407802J594961J353323J159430J257956J286924J170099
3765E74520767J064360R85563J104414J218677J151502J058459J019597J046479R68993
3783.4E84138811Q88466R79245J104951J106560Q96097P17520P78377O49989O70612
3801.7E91930628J051128R08971Q14318J064062J035095O94751N52178P06076N43416
3820.1E99300623O61910J001894R49919Q10385O21200O13927P44105N61476M10378
$$ plain form
3695.7 517801166 520377696 522777379 525068283 527410626 529706061 531784832 533679724 535681129
3712 535681129 537893593 539972067 541857421 543656886 545340657 546835780 548295379 550029814 551858783
3730.3 551858783 553451717 554812312 556251287 557924628 559455335 560434937 561363280 562878966 564230800
3748.7 564230800 565290272 566698074 568293035 569646358 570805788 572063744 573350668 574520767
3765 574520767 575585127 576570690 577675104 578893781 580045283 581103742 582123339 583169818 584138811
3783.4 584138811 585027277 586006522 587111473 588218033 589114130 589831650 590610027 591260016 591930628
3801.7 591930628 592981756 593890727 594705045 595769107 596804202 597498953 598051131 598757207 599300623
3820.1 599300623 599962533 600964427 601914346 602724731 603345931 603959858 604703963 605265439 605675817
3838.4F05675817N82575O96361P75576R00149R08494M72129k43902J89304J079976
3856.8F11036479R30727N32627M11868O20365O27041K93970L45826N35369O33538O37591
3877.2F16605401L81887M06504M62472L65138N19335M11690K09391M38928N66125L17753
3897.6F20684624O4909K9862J96159M42386M91559M24743M30345L09587Q4162J10864
3918F23269200K76506K32280J40070J89662K51592K39372K37644K82585K85745K34306
3938.4F25638962J61111J51873K57373L07798L01480K80440J80721J28210J73569K37047
3958.8F27818584K32816J78516J75059J98185K17080K04444J41144J42694K22325K06530
3979.2F29737377J44303J43051J33515J38700K27689L18766K89738K08020J96100
$$ plain form
3838.4 605675817 606258392 606954753 607730329 608630478 609538972 610011101 609767199 609956503 611036479
3856.8 611036479 611967206 612499833 612911701 613532066 614159107 614453077 614798903 615334272 615967810 616605401
3877.2 616605401 616987288 617393792 617856264 618221402 618740737 619152427 619361818 619800746 620366871 620684624
3897.6 620684624 620749533 620779395 620975554 621417940 621909499 622334242 622764587 623074174 623158336 623269200
3918 623269200 623545706 623777986 623918056 624107718 624359310 624598682 624836326 625118911 625404656 625638962
3938.4 625638962 625800073 625951946 626209319 626517117 626818597 627099037 627279758 627407968 627581537 627818584
3958.8 627818584 628051400 628229916 628404975 628603160 628820240 629024684 629165828 629308522 629530847 629737377
3979.2 629737377 629881680 630024731 630158246 630296946 630524635 630843401 631133139 631341159 631537259
3997.5F31537259
$$ plain form
3997.5 631537259
##END=$$ End of the data block
