##TITLE=G14-51-CE $$ Begin of the data block
##JCAMP-DX=5.00 $$ ACD/SpecManager v 10.08
##SPECTROMETER/DATA SYSTEM=Alpha
##DATE=22 Oct 2013 11:25:32
##DATA TYPE=INFRARED SPECTRUM
##DATA CLASS=XYDATA
##ORIGIN=
##OWNER=
##NPOINTS=1765
##FIRSTX=399.75695801
##LASTX=3997.56933594
##MAXX=3997.56933594
##MINX=399.75695801
##MAXY=0.80528438
##MINY=0.23346731
##XFACTOR=1.0000000000
##YFACTOR=1.000000000000000e-9
##FIRSTY=0.49571523
##DELTAX=2.03957629
##XUNITS=1/CM
##YUNITS=ARBITRARY UNITS
##XYDATA=(X++(Y..Y))
399.8D95715231m628629l327727p82192L38137k95490m12523R22113J730055L43740
$$ 495715231 491086602 487758875 486976683 487314820 487019330 486606807 487528920 489258975 489602715
418.1D89602715k222181k765089j526892o08265j061649k201229k502918j367390J7911
$$ 489602715 487380534 484615445 483088553 482480288 481418639 479217410 476714492 475347102 475365013
436.5D75365013K23100J02967R67652K159148K171546P86066n63353p26223l93778
$$ 475365013 475588113 475691080 476658732 478817880 480989426 481775492 481212139 480485916 480092138
454.8D80092138q95858k004653k558231k417267j989633k069562k602846k844184k524823
$$ 480092138 479196280 477191627 474633396 472216129 470226496 468156934 465554088 462709904 460185081
473.2D60185081j694113j333267j674264j540989p61271k79873o91623j595407j912296
$$ 460185081 458490968 457157701 455483437 453942448 453181177 452901304 452209681 450614274 448701978
491.5D48701978j553744j502246k010584k586275k845049k617091k566010l048926
$$ 448701978 447148234 445645988 443635404 441049129 438204080 435586989 433020979 429972053
507.9D29972053l303051l082961k658010k510845k713293k563656j864433r86218m49062
$$ 429972053 426669002 423586041 420928031 418417186 415703893 413140237 411275804 410289586 409840524
526.2D09840524l45200o944Q89659J872033K445996K599150K519071K282172J639575
$$ 409840524 409495324 409488380 410378039 412250072 414696068 417295218 419814289 422096461 423736036
544.6D23736036M47780o49542j043737j011550j119048j596510k055645k129287k125978
$$ 423736036 424183816 423534274 422490537 421478987 420359939 418763429 416707784 414578497 412452519
562.9D12452519k345860k718419k795845k104789q89451K04653J008511J787543K675503
$$ 412452519 410106659 407388240 404592395 402487606 401598155 401802808 402811319 404598862 407274365
581.3D07274365L503174L734320L090442K006173J185983Q67814O35445J32620l05652
$$ 407274365 410777539 414511859 417602301 419608474 420794457 421662271 422297716 422430336 422124684
599.6D22124684j96099K77161M99338K44886J5557K45124P32511J036704J089006J268953
$$ 422124684 421928585 422205746 422705084 422949970 422965527 423210651 423943162 424979866 426068872 427337825
620D27337825J925648K882838L388732L054232K444863K256602K429635K400487J832992
$$ 427337825 429263473 432146311 435535043 438589275 441034138 443290740 445720375 448120862 449953854
638.4D49953854J244247J322210J702666J584441R56893L73810L49641P06434O82742
$$ 449953854 451198101 452520311 454222977 455807418 456764311 457138121 457487762 458194196 458876938
656.7D58876938J91688q3417K03252O51717J067490J201093P90954R90480J677692
$$ 458876938 459068626 458985209 459188461 459840178 460907668 462108761 462899715 463890195 465567887
675.1D65567887K077281J780659J268983J162172J287877J138955O08176k5391n14776
$$ 465567887 467645168 469425827 470694810 471856982 473144859 474283814 474891990 474866599 474351823
693.5D74351823p81685q56310p67946m18902L55930J330554K015710K285361K506167
$$ 474351823 473570138 472713828 471945882 471526980 471882910 473213464 475229174 477514535 480020702
711.8D80020702L013015L717452M277617M485279M549831M792512N044877M858077
$$ 480020702 483033717 486751169 491028786 495514065 500063896 504856408 509901285 514759362
728.1E14759362M291415L573120K855479K398193K028465J408935O38604J23620j02758
$$ 514759362 519050777 522623897 525479376 527877569 529906034 531314969 531953573 532077193 531974435
746.5E31974435l00229o19292j070440j472711j611829j575470j403451q28326K26081
$$ 531974435 531674206 531054914 529984474 528511763 526899934 525324464 523921013 523092687 523318768
764.8E23318768J564919K936245M125356M984617N552292N792678N561113M982293
$$ 523318768 524883687 527819932 531945288 536929905 542482197 548274875 553835988 558818281
781.2E58818281M277229L587067L012240K562940K198994K133131K428592K785861
$$ 558818281 563095510 566682577 569694817 572257757 574456751 576589882 579018474 581804335
797.5E81804335L078818L296853L338217L235042K901912K228439J491427R24051N90503
$$ 581804335 584883153 588180006 591518223 594753265 597655177 599883616 601375043 602299094 602889597
815.8F02889597K28703m97043j317560j868785k327680k825261l245770l454447l320575
$$ 602889597 603118300 602621257 601303697 599434912 597107232 594281971 591036201 587581754 584261179
834.2E84261179l088653l094733l302872l284156k792716k097726j519800j274108
$$ 584261179 581172526 578077793 574774921 571490765 568698049 566600323 565080523 563806415
850.5E63806415j259745j044809n44966P6354J146018K973319N082011O678641P230758
$$ 563806415 562546670 561501861 560956895 561033249 562179267 565152586 570234597 576913238 584143996
868.9E84143996O611109N223751L658712K067387J86741k028405m066944n314470n632937
$$ 584143996 590755105 595978856 599637568 601704955 601891696 599863291 595796347 590481877 584848940
887.2E84848940n530536n616307n807281n613088n096019m870891n348146o292403
$$ 584848940 579318404 573702097 567894816 562281728 557185709 552314818 546966672 540674269
903.5E40674269p040918p283270p385552p694900p947326p535696o240844m542679
$$ 540674269 533633351 526350081 518964529 511269629 503322303 495786607 489545763 485003084
919.8D85003084l122389k230764j598269r43899l79055j63407l02255m69565l37482
$$ 485003084 481880695 479649931 478051662 477107763 476728708 476565301 476263046 475793481 475455999
938.2D75455999j14172n42254k199262m768997p175804q792668r888470j0746271j1217832
$$ 475455999 475341827 474799573 472600311 467831314 460655510 451862842 441974372 431228101 420010269
956.6D20010269j1209339j1004389j0956287j1090189j1097908j0634512r687692q603245
$$ 420010269 408800930 397796541 386840254 375750065 364652157 354017645 344329953 335726708
972.9C35726708p596552o502241n159229l727496k552062j876295j599997j388133
$$ 335726708 328130156 321627915 316468686 312741190 310189128 308312833 306712836 305324703
989.2C05324703j072347q05139p10577o19590l02404J83403M71503K39282m21941j075029
$$ 305324703 304252356 303447217 302736640 302117050 301814646 301998049 302469552 302708834 302286893 301211864
1009.6C01211864j423270j490742j489669j585007j718491j763493j740664j815230
$$ 301211864 299788594 298297852 296808183 295223176 293504685 291741192 290000528 288185298
1025.9B88185298k015620k149940k101659j993329k003401k133250k217919k154738
$$ 288185298 286169678 284019738 281918079 279924750 277921349 275788099 273570180 271415442
1042.2B71415442j943022j641899j327187r45598l76344L50476J013279J480132J821339
$$ 271415442 269472420 267830521 266503334 265557736 265181392 265531868 266545147 268025279 269846618
1060.6B69846618K169222K500921K428592J467734j73241j414478j387149k92033J102716
$$ 269846618 272015840 274516761 276945353 278413087 278239846 276825368 275438219 275146186 276248902
1078.9B76248902K346337L344148M058719M487872M644394M518688M173815L719628
$$ 276248902 278595239 281939387 285998106 290485978 295130372 299649060 303822875 307542503
1095.2C07542503L183007K546430J881152J397610J320094J671523K160638K529442
$$ 307542503 310725510 313271940 315153092 316550702 317870796 319542319 321702957 324232399
1111.6C24232399K741963K795339K696603K465993K157540J885235J822740K084523
$$ 324232399 326974362 329769701 332466304 334932297 337089837 338975072 340797812 342882335
1127.9C42882335K571017K928644K803952K209097J395672N59181j26898n40584p51376
$$ 342882335 345453352 348381996 351185948 353395045 354790717 355349898 355223000 354682416 353931040
1146.2C53931040q27373o90639l38196R3549O26296J355112K206146L090948L872305
$$ 353931040 353103667 352413028 352074832 352168381 352794677 354149789 356355935 359446883 363319188
1164.6C63319188M386366M750103N276113O051064O828219P333219P533341P586360
$$ 363319188 367705554 372455657 377731770 383782834 390611053 397944272 405477613 413063973
1180.9D13063973P567913P345825O764561N780727M550278L324389K190650J111805
$$ 413063973 420631886 427977711 434742272 440522999 445073277 448397666 450588316 451700121
1197.2D51700121J14680n89878q10504o37203l69191k03848q1271J09881K73615J77681
$$ 451700121 451814801 451224923 450414419 449777216 449408025 449204177 449122906 449232787 449506402 449684083
1217.6D49684083k42710p74413j170725j381874j535564j783342k011269j914292j430452
$$ 449684083 449441373 448666960 447496235 446114361 444578797 442795455 440784186 438869894 437439442
1236D37439442q77381m95433j30505M39823J194209J877010K217620K235353K267569
$$ 437439442 436562061 436066628 435936123 436375946 437570155 439447165 441664785 443900138 446167707
1254.3D46167707K481342K674460K573192K241224K070517K251029K546757K505005
$$ 446167707 448649049 451323509 453896701 456137925 458208442 460459471 463006228 465511233
1270.6D65511233K030134J521021J324326J340866J290470J119346J038044J176894
$$ 465511233 467541367 469062388 470386714 471727580 473018050 474137396 475175440 476352334
1287D76352334J283497J015573L30180m24027r15945j169264j425058j798004k085208
$$ 476352334 477635831 478651404 478981584 478557557 477641612 476472348 475047290 473249286 471164078
1305.3D71164078k016545j656055j340717j176358r34302m17680J72079L96102j4841
$$ 471164078 469147533 467491478 466150761 464974403 464040101 463622421 463794500 464190602 464175761
1323.7D64175761q43585j586050k034783k320439k499491k408623j985252j364410
$$ 464175761 463332176 461746126 459711343 457390904 454891413 452482790 450497538 449133128
1340D49133128q32617o33300p26968q85278j036256j258105j581133j932323k157688
$$ 449133128 448300511 447667211 446940243 446054965 445018709 443760604 442179471 440247148 438089460
1358.3D38089460k391428k929687l603071l970146l881425l248066k793193l058671
$$ 438089460 435698032 432768345 429165274 425195128 421313703 418065637 415272444 412213773
1374.7D12213773l456384l664047l795952l717243l238499k424002j377642m96358
$$ 412213773 408757389 405093342 401297390 397580147 394341648 391917646 390540004 390043646
1391C90043646j55926j92254j68950M1604M46946R38415J308650J460195J541018J670063
$$ 390043646 389887720 389695466 389526516 389568120 390015066 390953481 392262131 393722326 395263344 396933407
1411.4C96933407J762777J860023K105653K493650K564937K525389K431452K010584
$$ 396933407 398696184 400556207 402661860 405155510 407720447 410245836 412677288 414687872
1427.7D14687872J429021Q13544K89053k14368m14104K1190M93437O58482O41793N60612
$$ 414687872 416116893 416930437 417219490 417005122 416591018 416612208 417105645 417764127 418405920 418966532
1448.1D18966532M01616K62886N07862J436740K562940K801925K886086L331304L891438
$$ 418966532 419368148 419631034 420138896 421575636 424138576 426940501 429826587 433157891 437049329
1466.4D37049329M769713O644130R277552R753645P996201O298453M792481L316105
$$ 437049329 441819042 448463172 457740724 467494369 475490570 481789023 486581504 489897609
1482.8D89897609J662850j23948k097815l756434m248857m927308o391793o773830
$$ 489897609 491560459 491436511 489338696 485582262 481333405 476406097 470014304 463240474
1499.1D63240474o057322n598902p114530j0606885j0043889q289129p884413o850689
$$ 463240474 457183152 451584250 444469720 433862835 423818946 415529817 407645404 400794715
1515.4D00794715n061835l226698k666563k799749k884537l146440k860903k542735
$$ 400794715 395732880 392506182 389839619 387039870 384155333 381008893 378147990 375605255
1531.7C75605255k566069j946747j229346j273364r03040K60651J206815J984775K782017
$$ 375605255 373039186 371092439 369863093 368589729 367686689 367947340 369154155 371138930 373920947
1550.1C73920947L517896M123330M436314N211056N545109L966898L403962L407806
$$ 373920947 377438843 381562173 385998487 391209543 396754652 400721550 404125512 407533318
1566.4D07533318L116250K699971K071738J739890J529246R90391M99606J12772r8437
$$ 407533318 410649568 413349539 415421277 417161167 418690413 419680804 420180410 420293182 420194745
1584.7D20194745k90304o41108j225769j827151k376169k868325l485500m352510n213440
$$ 420194745 419904441 419263333 418037564 416210413 413834244 410965919 407480419 403127909 397914469
1603.1C97914469n887329o575108p565766q255721q344054r254604j1041940j0196149
$$ 397914469 392027140 385452032 377886266 369630545 361286491 352031887 340989947 330793798
1619.4C30793798r745091j1431426j1573374j0819882j0406703r139925q417786q856475
$$ 330793798 321048707 309617281 298043907 287224025 276817322 267677397 259259611 250403136
1635.7B50403136o680310l443435j670613n29185M01824J200319J546993K104760L129512
$$ 250403136 243722826 240279391 238608778 238079593 238481417 239681736 241228729 243333489 246463001
1654.1B46463001L286928L543257M558921N880803O792843O783516P601857Q813083
$$ 246463001 249749929 253293186 257852107 263732910 270525753 277309269 284911126 293724209
1670.4B93724209Q403629Q722395R609938R235888Q979947J0227590J2966097J2445599
$$ 293724209 302127838 310850233 320460171 329696059 338676006 348903596 361869693 374315292
1686.7C74315292J1274784J2561828J3373554J6006827J8474341J8358320J9541800
$$ 374315292 385590076 398151904 411525458 427532285 446006626 464364946 483906746
1701D83906746J6178489J3241052J2847901J0940611R174228Q050680P361472P153987
$$ 483906746 500085235 513326287 526174188 537114799 546289027 554339707 561701179 568855166
1717.3E68855166O139279M682958L976345L621042L159940K810180K426684K258301
$$ 568855166 574994445 579677403 583653748 587274790 590434730 593244910 595671594 597929895
1733.6E97929895K233028K257824K671480L205777L791153M675448N776405O957293
$$ 597929895 600162923 602420747 605092227 608298004 612089157 616764605 622541010 629498303
1749.9F29498303P578432P123352P024169P161915O764769O523133N904555N288541
$$ 629498303 637076735 644200087 651224256 658386171 665150940 671674073 677578628 682867169
1766.3F82867169N158067M927278M649281M123450L474473L295243L266990K967597
$$ 682867169 688025236 692952514 697601795 701725245 705199718 708494961 711761951 714729548
1782.6G14729548K562403K347350K324522K283931K187252J938224J784324J836836
$$ 714729548 717291951 719639301 721963823 724247754 726435006 728373230 730157554 731994390
1798.9G31994390J919449J797140J562118J461983J513839J625597J564324J378834
$$ 731994390 733913839 735710979 737273097 738735080 740248919 741874516 743438840 744817674
1815.2G44817674J259148J323879J412451J380563J237929J083910J098454J212597
$$ 744817674 746076822 747400701 748813152 750193715 751431644 752515554 753614008 754826605
1831.5G54826605J175583R41038Q10683R07242J017868R49860P86901O92546O99818
$$ 754826605 756002188 756943226 757753909 758661151 759679019 760628879 761415780 762108326 762808144
1849.9G62808144P86066Q03769O98268N85854N99444O85752P30395O19292M58896M72665
$$ 762808144 763594210 764397979 765096247 765682101 766281545 766967297 767697692 768316984 768775880 769248545
1870.3G69248545N95868O52671N95092N34714N44607O10769O66440O59644N57363M46081
$$ 769248545 769844413 770497084 771092176 771626890 772171497 772782266 773448706 774108350 774665713 775111794
1890.7G75111794M89295N81861N45024M16458L59833M01736M79996M77254L56972K55347
$$ 775111794 775601089 776182950 776727974 777144432 777504265 777906001 778385997 778863251 779220223 779475570
1911.1G79475570K67267L43740L84211L73066K92897K23875K91348L68774L01718K09034
$$ 779475570 779742837 780086577 780470788 780843854 781136751 781360626 781651974 782020748 782322466 782531500
1931.5G82531500J90258K08557K52068K45690J80483J56522K25603K79308K71916K46346
$$ 782531500 782721758 782930315 783182383 783428073 783608556 783765078 783990681 784269989 784541905 784788251
1951.9G84788251J95503K06769K96950L39746K59638J53423J42336K37822K89917K09212
$$ 784788251 784983754 785190523 785487473 785827219 786086857 786240280 786382616 786620438 786910355 787119567
1972.3G87119567J14859R1373J53900K44617K43783J17242L8624J04904J88053J55568
$$ 787119567 787234426 787325799 787479699 787724316 787968099 788085341 788123965 788228869 788416922 788572490
1992.6G88572490L6597l099R1255J78873J11580n1021j64569j09255J8716j550j82688
$$ 788572490 788609087 788605988 788697243 788876116 788987696 788936675 788772106 788662851 788681567 788680017 788497329
2015.1G88497329l27766k76923j20461p5162k37644m04059l59297j72675j01507k19822
$$ 788497329 788169563 787892640 787772179 787697017 787459373 787055314 786696017 786523342 786421835 786202013
2035.5G86202013l47435l15547j24276j2517j24514k63452j98603Q106J36078M6730
$$ 786202013 785854578 785539031 785414755 785402238 785277724 785014272 784815669 784823775 784959853 785006583
2055.9G85006583j08719o9797J33037K47360J44720k3127n4061J07527K46882J69516
$$ 785006583 784897864 784828067 784961104 785208464 785353184 785330057 785275996 785383523 785630405 785799921
2076.3G85799921p809n5730Q2791K39491K09034J3411n6923R7216K65002K56300J11580
$$ 785799921 785792112 785736382 785819173 786058664 786267698 786281109 786224186 786321402 786586404 786842704 786954284
2098.7G86954284K9504J27137K85506K72095P1526n9486N2512K32935K29061N1558
$$ 786954284 786983788 787110925 787396431 787668526 787740052 787680566 787733078 787966013 788195074 788246632
2119.1G88246632l8267O4135J96934K05397P5460l4630M0173K21193K51174Q3804o1333
$$ 788246632 788208365 788272500 788469434 788674831 788750291 788715661 788755834 788977027 789228201 789312005 789250672
2141.5G89250672n067J64688K40147J68324O1691Q1658K16603K95699K42293J65343
$$ 789250672 789245605 789410293 789650440 789818764 789880455 789962113 790178716 790474415 790716708 790882051
2161.9G90882051K18451L81708M61877L98635L11673L17872M29988N16891M63069L12447
$$ 790882051 791100502 791482210 791944087 792342722 792654395 792972267 793402255 793919146 794382215 794694662
2182.3G94694662K67804L96967N04553M30048K62141K33173L88205N10872M24981K62320
$$ 794694662 794962466 795359433 795863986 796294034 796556175 796789348 797177553 797688425 798113406 798375726
2202.7G98375726K30789L25382M26650M24742L04461K11358K83122L92139L64423K43246
$$ 798375726 798606515 798931897 799358547 799783289 800087750 800299108 800582230 800974369 801338792 801582038
2223.1H01582038J74225K16007K83122K53081J40071R4593J61409K33650K03789J08778
$$ 801582038 801756263 801972270 802255392 802508473 802648544 802743137 802904546 803138196 803341985 803450763
2243.5H03450763N9128R4056J69039J86920J08659K2412O9916J84774K09213J33335
$$ 803450763 803509891 803603947 803772986 803959906 804068565 804090977 804160893 804345667 804554880 804688215
2263.9H04688215K9266J3769R9599J50919Q7738R716J6987O1512P2181M1008j5735
$$ 804688215 804717481 804731250 804830849 804981768 805069506 805079222 805096209 805157721 805229902 805270910 805255175
2286.3H05255175k6048K4558L0696k4855n2929j2934K8848K7955j073j6451j1980l398
$$ 805255175 805229127 805253685 805284381 805259526 805206597 805193663 805222511 805250466 805249393 805232942 805220962 805217564
2310.8H05217564K8074L6657k563k4498j2874m6909p8023n1617k9922o3062k03073
$$ 805217564 805245638 805282295 805279732 805255234 805242360 805195451 805117428 805065811 805035889 804972827 804769754
2333.3H04769754l34680l25858k60592k68876l84808n61595m84347j64628Q5532J70827
$$ 804769754 804435074 804109216 803848624 803579748 803194940 802633345 802148998 801984370 802069902 802240729
2353.6H02240729K19286J42336j99259m97400o41942o63281n93185n38528o03020p16150
$$ 802240729 802460015 802602351 802403092 801905692 801263750 800600469 800007284 799468756 798865736 798149586
2374G98149586p04766n78343m79341m49538m32849m11332l71814l41475l71396m27306
$$ 798149586 797444820 796866477 796387136 795937598 795504749 795093417 794721603 794380128 794008732 793581426
2394.4G93581426m32670m16279m47929m82976m93169n12958n18977m94480n38051o42300
$$ 793581426 793148756 792732477 792284548 791801572 791308403 790795445 790276468 789781988 789243937 788601637
2414.8G88601637o75500o24656n83351o29783p30753p67588p01189o50406o88314p56741
$$ 788601637 787926137 787301481 786718130 786088347 785357594 784590006 783888817 783238411 782550097 781793356
2435.2G81793356p77960p20918o54519o79910p78556q31723p83265p14719p13587p35998
$$ 781793356 781015396 780294478 779639959 778960049 778181493 777349770 776566505 775851786 775138199 774402201
2455.6G74402201p56442p42317o69121o75917p89166q12411o73175n74946o44565p75337
$$ 774402201 773645759 772903442 772234321 771558404 770769238 769956827 769283652 768708706 768064141 767288804
2476G67288804q32260p41481o04988o20067p53343q09729p12991n53608m99665o05405
$$ 767288804 766456544 765715063 765110075 764490008 763736665 762926936 762213945 761660337 761160672 760555267
2496.4G60555267p27832p03454n75900n36501o25313p19607o77883n32210m97639o19948
$$ 760555267 759827435 759123981 758548081 758011580 757386267 756666660 755988777 755456567 754958928 754338980
2516.8G54338980p44105p48872o16551n14567o15060q00192q50261p15553n88358o73950
$$ 754338980 753594875 752846003 752229452 751714885 751099825 750299633 749449372 748733819 748145461 747471511
2537.2G47471511q44597q55446p16150o32227p09056q45910q65161p10130n71608o34074
$$ 747471511 746626914 745771468 745055318 744423091 743714035 742868125 742002964 741292834 740721226 740087152
2557.6G40087152q04961q58724p32601o02901o35207p71224q28147p30276o07789o34014
$$ 740087152 739282191 738423467 737690866 737087965 736452758 735681534 734853387 734123111 733515322 732881308
2578G32881308p82311q50380p52330o35862o48618p64012q35657p31468n71967o13510
$$ 732881308 732098997 731248617 730496287 729860425 729211807 728447795 727612138 726880670 726308703 725695193
2598.4G25695193q04484r03845q44657p56562p83265r20832j040280j036644r57429
$$ 725695193 724890709 723986864 723142207 722385645 721602380 720681548 719641268 718604624 717647195
2616.8G17647195r56237j090587j238763j245677j141310j136899j271546j374543
$$ 717647195 716690958 715600371 714361608 713115931 711974621 710837722 709566176 708191633
2633.1G08191633j352131j233876j156807j224100j342774j364291j270949j193524
$$ 708191633 706839502 705605626 704448819 703224719 701881945 700517654 699246705 698053181
2649.4F98053181j264334j398026j385570j242042j175165j229286j275718j267374
$$ 698053181 696788847 695390821 694005251 692763209 691588044 690358758 689083040 687815666
2665.7F87815666j191795j113593j166702j274824j266300j138568j047314j073956
$$ 687815666 686623871 685510278 684343576 683068752 681802452 680663884 679616570 678542614
2682F78542614j123607j125872j072944r92774j019478j160682j243650j206518j156628
$$ 678542614 677419007 676293135 675220191 674227417 673207939 672047257 670803607 669597089 668440461
2700.4F68440461j195609j272381j320719j325250j283944j267731j326859j398385
$$ 668440461 667244852 665972471 664651752 663326502 662042558 660774827 659447968 658049583
2716.7F58049583j370549j273334j242339j277388j283228j229763j143098j088977
$$ 658049583 656679034 655405700 654163361 652885973 651602745 650372982 649229884 648140907
2733F48140907j106381j134873j117527j075089j033068j025259j076639j088619j011908
$$ 648140907 647034526 645899653 644782126 643707037 642673969 641648710 640572071 639483452 638471544
2751.4F38471544r69589j015186j081646j085043j024544j026690j098752j118541
$$ 638471544 637501955 636486769 635405123 634320080 633295536 632268846 631170094 630051553
2767.7F30051553j100003j099289j127660j188338j262784j323342j343489j356244
$$ 630051553 628951550 627852261 626724601 625536263 624273479 622950137 621606648 620250404
2784F20250404j418471j498998j545369j598597j677334j739323j758159j772642j821875
$$ 620250404 618831933 617332935 615787566 614188969 612511635 610772312 609014153 607241511 605419636
2802.3F05419636j879335j968443k055943k085447k136887k227187k288878k341628
$$ 605419636 603540301 601571858 599515915 597430468 595293581 593066394 590777516 588435888
2818.7E88435888k435505k540708k629280k736330k875507l037333l235698l496885
$$ 588435888 586000383 583459675 580830395 578094065 575218558 572181225 568945527 565448642
2835E65448642l844440m308641m967153n853951o838620p607996p746399p029772n596220
$$ 565448642 561604202 557295561 552328408 546474457 539635837 532027841 524281442 517251670 511655450
2853.3E11655450l859103k359271j569331j676619k440691l399044m172236m491180
$$ 511655450 507796347 505437076 503867745 502191126 499750435 496351391 492179155 487687975
2869.7D87687975m210532l495752k714068k064884j579463j309932j270562j373231
$$ 487687975 483477443 479981691 477267623 475202739 473623276 472313344 471042782 469669551
2886D69669551j524806j662255j792192j986593k233952k475679k714843k979606l329128
$$ 469669551 468144745 466482490 464690298 462703705 460469753 457994074 455279231 452299625 448970497
2904.3D48970497l802061m345000m921675n540341o130427o488323o417543n854190
$$ 448970497 445168436 440823436 435901761 430361420 424230993 417742670 411325127 405470937
2920.6D05470937m821449l459007k000868n73963Q14408K150059L355831M331261N014837
$$ 405470937 400649488 397190481 395189613 394615650 395430058 397580117 400935948 405267209 410282046
2939D10282046N319416N197674M697561L867954K877027K024859J462132J233578J435697
$$ 410282046 415601462 420799136 425496697 429364651 432241678 434266537 435728669 436962247 438397944
2957.4D38397944K043903K878368L754794M562497N252868N802006O188333O382912
$$ 438397944 440441847 443320215 447075009 451637506 456890374 462692380 468880713 475263625
2973.7D75263625O380976O228417N951822N542218N081773M609227M052520L441274
$$ 475263625 481644601 487873018 493824840 499367058 504448831 509058058 513110578 516551852
2990E16551852K833307K197981J523256Q37505J91152l77893q56996j159489j257479
$$ 516551852 519385159 521583140 523106396 523943901 524135053 523757160 522900164 521740675 520483196
3008.3E20483196j229823j117349r72151r16004j039029j294195j615286j929522k105772
$$ 520483196 519253373 518136024 517163873 516247869 515208840 513914645 512299359 510369837 508264065
3026.7E08264065k144456k167165k186180k206713k306044k426445k492637k560049
$$ 508264065 506119609 503952444 501766264 499559551 497253507 494827062 492334425 489774376
3043D89774376k627700k656401k656251k667188k714366k717823k674729k645582k562820
$$ 489774376 487146676 484490275 481834024 479166836 476452470 473734647 471059918 468414336 465851516
3061.4D65851516k416909k274215k109826j956195j894056j847089j768410j706421
$$ 465851516 463434607 461160392 459050566 457094371 455200315 453353226 451584816 449878395
3077.7D49878395j677514j655310j588017j496404j422197j383364j374364j353323
$$ 449878395 448200881 446545571 444957554 443461150 442038953 440655589 439281225 437927902
3094D37927902j303286j269638j326084j423359j484275j517981j527042j545697j580119
$$ 437927902 436624616 435354978 434028894 432605535 431121260 429603279 428076237 426530540 424950421
3112.4D24950421j614571j668781j744896j857996j946598j938135j941293k026051
$$ 424950421 423335850 421667069 419922173 418064177 416117579 414179444 412238151 410212100
3128.7D10212100k087057k100498k132803k152622k134948k162785k197116k190590
$$ 410212100 408125043 406024545 403891742 401739120 399604172 397441387 395244271 393053681
3145C93053681k242536k302468k290427k277523k312422k340585k332479k336621k353013
$$ 393053681 390811145 388508677 386218250 383940727 381628305 379287720 376955241 374618620 372265607
3163.4C72265607k361864k347976k301663k304643k362728k368719k327502k287358
$$ 372265607 369903743 367555767 365254104 362949461 360586733 358218014 355890512 353603154
3179.7C53603154k276212k292603k276033k233297k219230k220660k204061k178758
$$ 353603154 351326942 349034339 346758306 344525009 342305779 340085119 337881058 335702300
3196C35702300k136379k053976j961828j922518j952410j978069j925737j879006j889289
$$ 335702300 333565921 331511945 329550117 327627599 325675189 323697120 321771383 319892377 318003088
3214.3C18003088j873165j824051j778901j780540j825481j839847j838475j849950
$$ 318003088 316129923 314305872 312526971 310746431 308920950 307081103 305242628 303392678
3230.7C03392678j857221j934260k051770k073884k046079k064556k149910k246528
$$ 303392678 301535457 299601197 297549427 295475543 293429464 291364908 289214998 286968470
3247B86968470k296806k313614k326339k326429k308399k316325k325118k286166k223283
$$ 286968470 284671664 282358050 280031711 277705282 275396883 273080558 270755440 268469274 266245991
3265.3B66245991k150506k042323j926184j826882j687467j532406j424432j319051
$$ 266245991 264095485 262053162 260126978 258300096 256612629 255080223 253655791 252336740
3281.6B52336740j192301j050502r21473q42839p47130o18815n27978m69715l99500
$$ 252336740 251144439 250093937 249172464 248329625 247582495 246963680 246435702 245965987 245566487
3300B45566487l01793k27079k28777k40654j90929j36315j27584j30430j10343o3747
$$ 245566487 245264694 245037615 244808838 244568184 244377255 244240940 244113356 243982926 243872583 243808836
3320.4B43808836n3033j07065j46032j18956o9543p0423j13458j68264k00405k01762
$$ 243808836 243755803 243648738 243502706 243383750 243314207 243243784 243130326 242962062 242761657 242559895
3340.8B42559895k44901l27080l57375l35127l40357l81887m14595m12584l93107l87982
$$ 242559895 242314994 241987914 241630539 241295412 240955055 240573168 240158573 239745989 239352882 238964900
3361.2B38964900l93614l72916l64870m37513n22658m80056l63603l57107m08813l80024
$$ 238964900 238571286 238198370 237833500 237395987 236873329 236393273 236029670 235672563 235263750 234883726
3381.6B34883726k65450j79037j28269n0813r1061k44275k53960p4178P2941m187j40816
$$ 234883726 234618276 234439239 234310970 234260157 234169096 233924821 233670861 233596683 233669624 233665437 233524621
3404B33524621n7310Q1375J23307J57207J95474K26482K77281L38704L82259M97356
$$ 233524621 233467311 233548686 233671993 233829200 234024674 234251156 234528437 234867141 235249400 235746756
3424.4B35746756O54549P32883P26328Q13752R87426R45150P68945P71865R40398J080721
$$ 235746756 236401305 237134188 237860516 238674268 239661694 240606844 241375789 242147654 243088052 244168773
3444.8B44168773J113788J104727J152128J231655J343459J478047J519531J439780
$$ 244168773 245282561 246387288 247539416 248771071 250114530 251592577 253112108 254551888
3461.1B54551888J430243J608282J779556J686067J405149J379937J649946J917988
$$ 254551888 255982131 257590413 259369969 261056036 262461185 263841122 265491068 267409056
3477.4B67409056J995653J863093J802593J934826J995355J959145J994223K046108
$$ 267409056 269404709 271267802 273070395 275005221 277000576 278959721 280953944 283000052
3493.8B83000052K099127K128690K146065K141059K039879K013147K166450K288997
$$ 283000052 285099179 287227869 289373934 291514993 293554872 295568019 297734469 300023466
3510.1C00023466K334029K373129K330929K300471K408952K594500K609343K456426
$$ 300023466 302357495 304730624 307061553 309362024 311770976 314365476 316974819 319431245
3526.4C19431245K412856K522290K652615K797127K864808K781570K850800L077597
$$ 319431245 321844101 324366391 327019006 329816133 332680941 335462511 338313311 341390908
3542.7C41390908L125190K926261K844780L025055L205568L239423L250450L369748
$$ 341390908 344516098 347442359 350287139 353312194 356517762 359757185 363007635 366377383
3559C66377383L493906L530144L587365L788054L876984L782422L800541L960907M098356
$$ 366377383 369871289 373401433 376988798 380776852 384653836 388436258 392236799 396197706 400296062
3577.4D00296062M247666M406869M425645M376233M424363M526347M489720M501939
$$ 400296062 404543728 408950597 413376242 417752475 422176838 426703185 431192905 435694844
3593.7D35694844M653990M784703M817098M816950M762560M648715M733354M862994
$$ 435694844 440348834 445133537 449950635 454767585 459530145 464178860 468912214 473775208
3610D73775208M874438M938841M909247M938215N121678M933894M617512M543543M845083
$$ 473775208 478649646 483588487 488497734 493435949 498557627 503491521 508109033 512652576 517497659
3628.4E17497659N124807M781425M577994M600704M561126M517854M449248M327118
$$ 517497659 522622466 527403891 531981885 536582589 541143715 545661569 550110817 554437935
3644.7E54437935M263163M424453M482925M065990L789485M053592M182399L874480
$$ 554437935 558701098 563125551 567608476 571674466 575463951 579517543 583699942 587574422
3661E87574422L618896L558874L427983L303826L370106L174722K903044K931118K906502
$$ 587574422 591193318 594752192 598180175 601484001 604854107 608028829 610931873 613862991 616769493
3679.4F16769493K824425K840758K828657K718926K464056K245307K213299K181828
$$ 616769493 619593918 622434676 625263333 627982259 630446315 632691622 634904921 637086749
3695.7F37086749K069175J918733J790703J762628J803458J767814J578510J396477
$$ 637086749 639155924 641074657 642865360 644627988 646431446 648199260 649777770 651174247
3712F51174247J482666J513064J402139J374305J378417J253009J135826J321017J460910
$$ 651174247 652656913 654169977 655572116 656946421 658324838 659577847 660713673 662034690 663495600
3730.3F63495600J291394J039803R63808J064419J077533Q28505P20203J114010J117289
$$ 663495600 664786994 665826797 666790605 667855024 668932557 669761062 670481265 671595275 672712564
3748.7F72712564P38919Q27015J176119J156747Q64386P50959Q59201Q88467Q46505
$$ 672712564 673451483 674278498 675454617 676611364 677475750 678226709 679085910 679974377 680820882
3767.1F80820882Q03471Q03888Q53836Q72135Q61407P69019O60539O19530O21677O99639
$$ 680820882 681624353 682428241 683282077 684154212 685015619 685784638 686445177 687064707 687686384 688386023
3787.5F88386023P96974Q38876P56859N84245N57780N45919M98891O84857O52731N18203
$$ 688386023 689182997 690021873 690778732 691362977 691920757 692466676 692965567 693650424 694303155 694821358
3807.8F94821358P01070Q33630O66022M40419N28276N14567L69310M88818N86867O22809
$$ 694821358 695522428 696356058 697022080 697462499 697990775 698505342 698874652 699363470 699950337 700573146
3828.2G00573146N59509M75168N98431N35071K52426L32474N07236M90308N18262O05524
$$ 700573146 701132655 701607823 702206254 702741325 702993751 703326225 703833461 704323769 704842031 705447555
3848.6G05447555M61161q7977j01208O44087P82431N22613M05371M27068L10838Q6546
$$ 705447555 705908716 705820739 705719531 706363618 707146049 707668662 708074033 708501101 708811939 708898485
3869G08898485J36912L37064M30763N09977M35650L62516L90649K60412K03789K40206
$$ 708898485 709035397 709372461 709803224 710313201 710748851 711111367 711502016 711762428 711966217 712206423
3889.4G12206423J92046K90335L89456K43962R9719J15037J19447J55747K49863K80380
$$ 712206423 712398469 712688804 713078260 713322222 713421941 713536978 713656425 713812172 714062035 714342415
3909.8G14342415K81990K47061J06692L0160J82510K92122K02716J47700J92583J81734
$$ 714342415 714624405 714871466 714978158 715008318 715190828 715482950 715685666 715833366 716025949 716207683
3930.2G16207683J39833J45971J69039J77562J38641J13725J69099J83523J37865J22905
$$ 716207683 716347516 716493487 716662526 716840088 716978729 717092454 717261553 717445076 717582941 717705846
3950.6G17705846J35898J77145J84477J80423J92881J35898Q0407J06215J48833J52350
$$ 717705846 717841744 718018889 718203366 718383789 718576670 718712568 718792975 718899190 719048023 719200373
3971G19200373J30891J15157J29342J38700J37031J65880J74760J58132J49011J19865
$$ 719200373 719331264 719446421 719575763 719714463 719851494 720017374 720192134 720350266 720499277 720619142
3991.4G20619142Q9943J12653J49548
$$ 720619142 720709085 720821738 720971286
3997.5G20971286
$$ 720971286
##END=$$ End of the data block
