##TITLE=G14-51-CE $$ Begin of the data block
##JCAMP-DX=5.00 $$ ACD/SpecManager v 10.08
##SPECTROMETER/DATA SYSTEM=Alpha
##DATE=22 Oct 2013 11:25:32
##DATA TYPE=INFRARED SPECTRUM
##DATA CLASS=XYDATA
##ORIGIN=
##OWNER=
##NPOINTS=1765
##FIRSTX=399.75695801
##LASTX=3997.56933594
##MAXX=3997.56933594
##MINX=399.75695801
##MAXY=0.80633718
##MINY=0.23366572
##XFACTOR=1.0000000000
##YFACTOR=1.000000000000000e-9
##FIRSTY=0.49520943
##DELTAX=2.03957629
##XUNITS=1/CM
##YUNITS=ARBITRARY UNITS
##XYDATA=(X++(Y..Y))
399.8D95209426m164487k777458q30114J48207N8473j31876K97755P96944K11388j360446
420.2D87457812k090246j477807p68245j284271k406269k234161q35151J60754K33739
438.5D76756155J93030P76857J778215K111733J082987m25279j021624p11471q26120
456.9D79714483j956105k802104k499431j789511j710265k365798l042341k823174
473.2D60725754j751899j162887j396417j375407p42346m00514p66218j477033j905888
491.5D49747145j730472j600951j970529k433926k767772k815932k716481k905935
507.9D30805147l139168l149063k926498k763272k857446k628476j767188q07315l85076
526.2D10381645l33071L9160R04203J914084K475679K454132K320945K186268J649946
$$ plain form
399.8 495209426 491044939 488267481 487437367 487585574 487644047 487512171 487809926 488606870 488818258 487457812
420.2 487457812 485367566 483889759 483121514 481837243 479430974 477196813 476361662 476522416 476756155
438.5 476756155 476949185 477726042 479504257 481615990 482698977 482273698 481252074 480540603 479714483
456.9 479714483 477758378 474956274 472456843 470667332 468957067 466591269 463548928 460725754
473.2 460725754 458973855 457810968 456414551 455039144 454296798 453896284 453130066 451653033 449747145
491.5 449747145 448016673 446415722 444445193 442011267 439243495 436427563 433711082 430805147
507.9 430805147 427665979 424516916 421590418 418827146 415969700 413341224 411574036 410766721 410381645
526.2 410381645 410048574 410087734 410991937 412906021 415381700 417835832 420156777 422343045 423992991
544.6D23992991O03229m10139r03279r99123j104086j534939k101720k274185k099514
562.9D13169235k212465k772689k943843k121657p64132L52263J027406J721501K569765
581.3D08025384L324777L587603L062100K090513J245737Q05229O25939K93105j95235
599.6D22865152k79426J72376N09113L63678J04994J91539O66231J053989J073420
618D26721066J196653J883179K863586L384292L054500K507805K417207K557904K495080
636.3D49081272J943469J228750J123458J561224J632124J078189N07057M02391O76006
654.7D59233940P23153K64972j63286J9282O25163J260132J284986O39588R13888J695693
675.1D66497511K112299J800150J278489J206786J342445J172424O18845q9973o17027
$$ plain form
544.6 423992991 424596220 424186081 423282802 422283679 421179593 419644654 417542934 415268749 413169235
562.9 413169235 410956770 408184081 405240238 403118581 402354449 402706712 403734118 405455619 408025384
581.3 408025384 411350161 414937764 417999864 420090377 421336114 422141343 422767282 423060387 422865152
599.6 422865152 422585726 422758102 423267215 423630893 423735887 423927426 424593657 425647646 426721066
618 426721066 427917719 429800898 432664484 436048776 439103276 441611081 444028288 446586192 449081272
636.3 449081272 451024741 452253491 453376949 454938173 456570297 457648486 458155543 458557934 459233940
654.7 459233940 459957093 460222065 460058779 460078061 460703224 461963356 463248342 463887930 464801818 466497511
675.1 466497511 468609810 470409960 471688449 472895235 474237680 475410104 476028949 475938976 475321949
693.5D75321949q23498r25273r22233m98384L96997J386821K072960K379239K594679
711.8D80983257L040493L690094M221797M463940M596115M783868M943073M764319
728.1E15486956M224956L575623K925217K458513K062559J404404O45698J34587j64271
746.5E32754242l87132o90281j103401j447499j587629j514078j226425o93798J42753
764.8E24246752J393199K836406M097641N036890N630136N830646N585312M929841
781.2E59586823M133165L515184L065645K631426K188862K077996K439023K869606
797.5E82507730L161132L356159L344953L132820K815842K266467J544416R35256N48065
815.8F03612840J31607n14805j281679j914024k331078k787948l273308l475070l382743
$$ plain form
693.5 475321949 474498451 473573178 472650945 472152561 472549558 473936379 476009339 478388578 480983257
711.8 480983257 484023750 487713844 491935641 496399581 500995696 505779564 510722637 515486956
728.1 515486956 519711912 523287535 526212752 528671265 530733824 532138228 532783926 532918513 532754242
746.5 532754242 532367110 531676829 530573428 529125929 527538300 526024222 524797797 524103999 524246752
764.8 524246752 525639951 528476357 532573998 537610888 543241024 549071670 554656982 559586823
781.2 559586823 563719988 567235172 570300817 572932243 575121105 577199101 579638124 582507730
797.5 582507730 585668862 589025021 592369974 595502794 598318636 600585103 602129519 603064775 603612840
815.8 603612840 603744447 603229642 601947963 600033939 597702861 594914913 591641605 588166535 584783792
834.2E84783792l228485l209770l355264l292561k730906j935005j389683j334190
850.5E64307928j384675j040042m72367J03295J114249K882958M994035O668150P249594
868.9E84423125O600082N213022L651202K056539J93178k055764m157007n376160n624175
887.2E84924042n496561n588353n807281n628585n083859m867137n411625o376743
903.5E40663898p074773p268131p358849p659614p879615p458985o206483m582017
919.8D85175431l211498k279044j595318r64284l98874j56492k99126m45664l00914
938.2D75524217j06007n61863k238244m805058p188946q776188r846985j0724813j1245191
956.6D20030922j1251271j1029631j0954648j1053056j1036575j0595291r722442q678615
$$ plain form
834.2 584783792 581555307 578345537 574990273 571697712 568966806 567031801 565642118 564307928
850.5 564307928 562923253 561883211 561410844 561514139 562628388 565511346 570505381 577173531 584423125
868.9 584423125 591023207 596236229 599887431 601943970 602137148 600081384 595924377 590548217 584924042
887.2 584924042 579427481 573839128 568031847 562403262 557319403 552452266 547040641 540663898
903.5 540663898 533589125 526320994 518962145 511302531 503422916 495963931 489757448 485175431
919.8 485175431 481963933 479684889 478089571 477125287 476726413 476569921 476270795 475825131 475524217
938.2 475524217 475418210 474856347 472618103 467813045 460624099 451847911 442000926 431276113 420030922
956.6 420030922 408779651 397750020 386795372 375742316 364705741 354110450 344388008 335709393
972.9C35709393p634163o505012n154729l716141k549738j878381j576781j342446
989.2C05352002j052528q20726o93262n76526l07918J51903M72426K69175l81351j036644
1009.6C01376551j407057j516580j554638j644075j727552j730293j706600j809597
1025.9B88280159k024591k147287k100617k004653j998901k128571k254963k168298
1042.2B71452278j885325j600534j362443r85622l53843L63380R89079J489133J865804
1060.6B69971907K209276K501726K376437J389474k02685j365602j333744k80768J092822
1078.9B76358843K304822L275156M040003M528999M692018M532993M142702L696233
1095.2C07571769L195494K564252J860648J355439J328171J709580K179086K538532
$$ plain form
972.9 335709393 328075230 321570218 316415489 312699348 310149610 308271229 306694448 305352002
989.2 305352002 304299474 303478748 302785486 302208960 301901042 302052945 302525371 302794546 302413195 301376551
1009.6 301376551 299969494 298452914 296898276 295254201 293526649 291796356 290089756 288280159
1025.9 288280159 286255568 284108281 282007664 280003011 278004110 275875539 273620576 271452278
1042.2 271452278 269566953 267966419 266603976 265618354 265264511 265627891 266616970 268106103 269971907
1060.6 269971907 272181183 274682909 277059346 278448820 278246135 276880533 275546789 275266021 276358843
1078.9 276358843 278663665 281938821 285978824 290507823 295199841 299732834 303875536 307571769
1095.2 307571769 310767263 313331515 315192163 316547602 317875773 319585353 321764439 324302971
1111.6C24302971K740980K785205K727271K552747K200008J836806J754821K040088
1127.9C42940897K580434K983451K821773K175212J377046N69701j36465n67555p36624
1146.2C54007870p95275p10100l69340J21772O83159J383990K212882L079265L848553
1164.6C63462776M373550M729152N217910N981803O810516P365763P562459P583826
1180.9D13087755P539660P322043O751687N761951M541725L346115K217621J117676
1197.2D51686233J12951n93662q27223o56545l62307j79440r0957P6324K57433J80423
1217.6D49603230k25574p64251j157045j336992j495629j789630k037048j915694j411438
1236D37469929q51362m70102j22130M35203J204789J877576K182841K226561K297044
$$ plain form
1111.6 324302971 327043951 329829156 332556427 335109174 337309182 339145988 340900809 342940897
1127.9 342940897 345521331 348504782 351326555 353501767 354878813 355448514 355312049 354744494 354007870
1146.2 354007870 353212595 352502495 352133155 352254927 352938086 354322076 356534958 359614223 363462776
1164.6 363462776 367836326 372565478 377783388 383765191 390575707 397941470 405503929 413087755
1180.9 413087755 420627415 427949458 434701145 440463096 445004821 448350936 450568557 451686233
1197.2 451686233 451799184 451205522 450378299 449721754 449359447 449180007 449089050 449165374 449422807 449603230
1217.6 449603230 449377656 448613405 447456360 446119368 444623739 442834109 440797061 438881367 437469929
1236 437469929 436618567 436148465 436026335 436461538 437666327 439543903 441726744 443953305 446250349
1254.3D46250349K490670K651453K547592K224505K071678K269000K539367K487450
1270.6D65532064K055824J560927J340776J350791J281827J083196J008868J164496
1287D76378769J281261J024217L59863l80993q98421j187474j449763j804948k071798
1305.3D71250713j998216j660883j352132j155972r04054m07278J65552L80396j7106
1323.7D64301020q26269j585752k061397k333552k482831k397359k008259j387507
1340D49218094q18282o12527p45237r36866j065463j234918j551658j935661k173454
1358.3D38144028k399355k935946l613263l984154l899425l267854k801508l031343
1374.7D12211180l413379l645719l807306l723711l196388k369374j379669n42402
$$ plain form
1254.3 446250349 448741019 451392472 453940064 456164569 458236247 460505247 463044614 465532064
1270.6 465532064 467587888 469148815 470489591 471840382 473122209 474205405 475214273 476378769
1287 476378769 477660030 478684247 479044110 478663117 477764696 476577222 475127459 473322511 471250713
1305.3 471250713 469252497 467591614 466239482 465083510 464179456 463772178 463937730 464318126 464301020
1323.7 464301020 463474751 461888999 459827602 457494050 455011219 452613860 450605601 449218094
1340 449218094 448399812 447787285 447042048 446105182 445039719 443804801 442253143 440317482 438144028
1358.3 438144028 435744673 432808727 429195464 425211310 421311885 418044031 415242523 412211180
1374.7 412211180 408797801 405152082 401344776 397621065 394424677 392055303 390675634 390133232
1391C90133232j90914j91986j67191M0263M72784R59366J300335J464695J576990J697540
1411.4C97095114J762509J851917K100020K500624K582103K528995K419144J996040
1427.7D14836466J420677Q24869L21746j97709m41074o229M86493O63221O50525N66185
1448.1D19125170M03851K52366M85748J411647K570539K848417K910286L319651L865033
1466.4D37192708M733742O602168R243160R741813Q007348O312579M780799L272474
1482.8D89886791J603692j94400k158165l761143m233956m940718o411434o781339
1499.1D63009328o063581n604774p140666j0627061r988070q238017p879615o863862
1515.4D00603682n064100l209055k638280k741903k804279l076911k838850k555371
$$ plain form
1391 390133232 389942318 389750332 389583141 389623404 390096188 391055554 392355889 393820584 395397574 397095114
1411.4 397095114 398857623 400709540 402809560 405310184 407892287 410421282 412840426 414836466
1427.7 414836466 416257143 417082012 417403758 417206049 416764975 416758746 417245239 417908460 418558985 419125170
1448.1 419125170 419529021 419781387 420267135 421678782 424249321 427097738 430008024 433327675 437192708
1466.4 437192708 441926450 448528618 457771778 467513591 475520939 481833518 486614317 489886791
1482.8 489886791 491490483 491296083 489137918 485376775 481142819 476202101 469790667 463009328
1499.1 463009328 456945747 451340973 444200307 433573246 423585176 415347159 407467544 400603682
1515.4 400603682 395539582 392330527 389692247 386950344 384146065 381069154 378230304 375674933
1531.7C75674933k534210j894951j253069j306593q52615L13163J255631K027661K802849
1550.1C74232799L527969M124731M429042N215168N588144L991425L402502L396332
1566.4D07908112L085971K688974K078503J706004J491607R86903M86821R2179j04159
1584.7D20420915k69622o19381j224846j817822k364874k888501l524959m383564n215347
1603.1C98111999n873203o571830p545411q202046q303374r259880j1051834j0183811
1619.4C31120610r759575j1473060j1592924j0805130j0384947r140849q450508q898974
1635.7B50614643o692782l427952j642317n04449M20138J229674J552522K049535L091947
1654.1B46690959L311336L547609M532814N856841O790102O782323P602960Q833587
$$ plain form
1531.7 375674933 373140723 371245772 369992703 368686110 367833495 368146658 369402289 371429950 374232799
1550.1 374232799 377760768 381885499 386314541 391529709 397117853 401109278 404511780 407908112
1566.4 407908112 410994083 413683057 415761560 417467564 418959171 419946074 420432895 420525074 420420915
1584.7 420420915 420151293 419531912 418307066 416489244 414124370 411235869 407710910 403327346 398111999
1603.1 398111999 392238796 385666966 378121555 369919509 361616135 352356255 341304421 331120610
1619.4 331120610 321361035 309887975 298295051 287489921 277104974 267964125 259513617 250614643
1635.7 250614643 243921861 240493909 238851592 238347143 238767281 239996955 241549477 243599012 246690959
1654.1 246690959 250002295 253549904 258082718 263939559 270729661 277511984 285114944 293948531
1670.4B93948531Q434355Q756251R635448R218574Q940577J0186911J2912184J2447923
1686.7C74480754J1301398J2532980J3329625J5978068J8426716J8296272J9504279
1701D83850092J6197592J3302862J2909115J0982930R213567Q077264P352710P131040
1717.3E69017172O160200M731655M018724L650426L167928K815366K423524K225638
1733.6E98210633K229929K263605K659321L240764L842056M678786N747199O915271
1749.9F29787564P572890P180392P072389P154584O725669O491542N898893N277336
1766.3F83161259N121171M901290M659712M140556L487468L326833L297091K968728
1782.6G15064108K567292K362907K318501K261698K170205J943529J791537J815319
$$ plain form
1670.4 293948531 302382886 311139137 320774585 329993159 338933736 349120647 362032831 374480754
1686.7 374480754 385782152 398315132 411644757 427622825 446049541 464345813 483850092
1701 483850092 500047684 513350546 526259661 537242591 546456158 554533422 561886132 569017172
1717.3 569017172 575177372 579909027 583927751 587578177 590746105 593561471 595984995 598210633
1733.6 598210633 600440562 602704167 605363488 608604252 612446308 617125094 622872293 629787564
1749.9 629787564 637360454 644540846 651613235 658767819 665493488 671985030 677883923 683161259
1766.3 683161259 688282430 693183720 697843432 701983988 705471456 708798289 712095380 715064108
1782.6 715064108 717631400 719994307 722312808 724574506 726744711 728688240 730479777 732295096
1798.9G32295096J909554J830816J582802J458525J517534J623929J548946J372933
1815.2G45140135J283825J363754J430750J351595J187980J068473J111150J217901
1831.5G55155563J172185R45807Q28743R22560R98974R17137P91252P12990P16448
1849.9G63161659P89523P88510O98745O00636O09339O94751P28846O14286M47273M49061
1870.3G69582629N92172O70433O03974N19872N40078O31272O74129O40333N41389M68373
1890.7G75464654N16951N71609N31613M37320M00841M33564M72903M32313L21925K59399
1911.1G79843092K91765L46899L45230L33726L00944K62261L03149L48031L03388K19762
1931.5G82898247J68920J99914K98977K90215J72674J26720J97589K75076K95639K62379
$$ plain form
1798.9 732295096 734204650 736035466 737618268 739076793 740594327 742218256 743767202 745140135
1815.2 745140135 746423960 747787714 749218464 750570059 751758039 752826512 753937662 755155563
1831.5 755155563 756327748 757273555 758102298 759024858 760023832 760940969 761732221 762445211 763161659
1849.9 763161659 763951182 764739692 765438437 766039073 766648412 767343163 768072009 768686295 769133568 769582629
1870.3 769582629 770174801 770845234 771449208 771969080 772509158 773140430 773814559 774454892 774996281 775464654
1890.7 775464654 775981605 776553214 777084827 777522147 777922988 778356552 778829455 779261768 779583693 779843092
1911.1 779843092 780134857 780481756 780826986 781160712 781461656 781723917 782027066 782375097 782678485 782898247
1931.5 782898247 783067167 783267081 783566058 783856273 784028947 784155667 784353256 784628332 784923971 785186350
1951.9G85186350J96934J86861K61366L15607K49326J67608J84655K77818L13520K07543
1972.3G87547588R0659R0122J73033K33232K15710J13845N3107J16945K08974J91211
1992.6G89034426N2512k6405O5625J93000J24573p2896j65284q6784J5378j4186j71483
2015.1G88948476l11196k82764j38700p9393k27750l97742l60071j74463q8751j93000
2035.5G86694646l30091k94447j15037n2630j60695k78890k23279P630J64091P2897
2055.9G85484195r2387o4850J30176K39194J36971j8179l9876J18733K48849J58966
2076.3G86301792j8537m6313R7036K22743J81675K3186k3604J10388K53618K50042
2096.7G87352026J23083M0889J18673K52366K40385Q4043k2054O3062K31862K57432
$$ plain form
1951.9 785186350 785383284 785570145 785831511 786147118 786396444 786564052 786748707 787026525 787340045 787547588
1972.3 787547588 787638247 787728369 787901402 788134634 788350344 788464189 788517296 788634241 788843215 789034426
1992.6 789034426 789086938 789060533 789126158 789319158 789443731 789370835 789205551 789118767 789134145 789119959 788948476
2015.1 788948476 788637280 788354516 788215816 788136423 787908673 787510931 787150860 786976397 786887646 786694646
2035.5 786694646 786364555 786070108 785955071 785902441 785741746 785462856 785239577 785247207 785411298 785484195
2055.9 785484195 785391808 785326958 785457134 785696328 785833299 785815120 785775244 785893977 786142826 786301792
2076.3 786301792 786283255 786236942 786333978 786556721 786738396 786761582 786737978 786848366 787101984 787352026
2096.7 787352026 787475109 787515998 787634671 787887037 788127422 788211465 788189411 788252473 788484335 788741767
2117.1G88741767R3460m7266R418J67429K08020P9513l1948M7445K27392K48253P5281
2139.5G89818764p3493p033J95920K82467J74165K9742N7996K27928L19719K54810
2159.9G91280985J69337K31743L98933M40777L47495K90334L34084M54664N23568M48107
2180.3G94920027L11792K85804M11869N14090M33504K64049K45809L95835M92930M00841
2200.7G98676550K44737K18749L28958M43101M41969L19242K22027K76685L75450L49700
2221.1H01897168K34544J70052K14100L08156K85745J36614P2062J44720K29657K02894
2241.5H03895712R4056M8459J12712K04682K02835Q4281l159P7307J99199J94609R0361
2263.9H05201054K9921Q1837J37687J26004P6235M0233M2736M8816L2783R477p450
$$ plain form
2117.1 788741767 788835227 788787961 788797379 788964808 789172828 789252341 789220393 789267838 789495230 789743483 789818764
2139.5 789818764 789745271 789738238 789934158 790216625 790390790 790420532 790478528 790706456 791026175 791280985
2159.9 791280985 791450322 791682065 792080998 792521775 792869270 793159604 793493688 793948352 794471920 794920027
2180.3 794920027 795231819 795517623 795929492 796443582 796877086 797141135 797386944 797782779 798275709 798676550
2200.7 798676550 798921287 799140036 799468994 799912095 800354064 800673306 800895333 801172018 801547468 801897168
2221.1 801897168 802131712 802301764 802515864 802824020 803109765 803246379 803318441 803463161 803692818 803895712
2241.5 803895712 803989768 804038227 804150939 804355621 804558456 804642737 804639578 804716885 804916084 805110693 805201054
2263.9 805201054 805230975 805312812 805450499 805576503 805652738 805692971 805735707 805784523 805817306 805826783 805819333
2286.3H05819333P569L8386L3974L100j6153n782P272J8418L5882O7055Q6189N7041
2310.8H06152284J013l0696K1100Q5890P6831L0756k3484m2916j1802q4936k51889
2333.3H05922151l11971k83182k29060j81556l17693o50644o18696k03312J45435K74539
2353.6H03546011K85984K07424j21117n40554p45476p06017o42478o32406o80387p66754
2374G99204230p74443o94215n90563m96268m57347m50015l91364l28064l51727m35352
2394.4G94234872m60684m28439m44889m83751n01692n23150n25594n02050n32091o27219
2414.8G89205313o70016o06716n74410o61909p61509p54476o70850o44684o81937p22646
2435.2G82456160p65980p63654p07031p01010p62820p99239p67648p13229p15256p59780
$$ plain form
2286.3 805819333 805826902 805865288 805899262 805902362 805886209 805880427 805887699 805906117 805941999 806009054 806095243 806152284
2310.8 806152284 806153297 806122601 806143701 806229591 806306422 806337178 806313694 806270778 806258976 806174040 805922151
2333.3 805922151 805610180 805326998 805097938 804916382 804598689 803948045 803329349 803126037 803271472 803546011
2353.6 803546011 803831995 804039419 803918302 803377748 802632272 801926255 801283777 800651371 799970984 799204230
2374 799204230 798429787 797735572 797145009 796648741 796191394 795741379 795350015 795021951 794670224 794234872
2394.4 794234872 793774188 793345749 792900860 792417109 791915417 791392267 790866673 790364623 789832532 789205313
2414.8 789205313 788535297 787928581 787354171 786692262 785930753 785176277 784505427 783860743 783178806 782456160
2435.2 782456160 781690180 780926526 780219495 779518485 778755665 777956426 777188778 776475549 775760293 775000513
2455.6G75000513p64311p05778o53029o73652p68482q36969p47084o06060o02722p21217
2476G67921209q16703p68363o41823o16371p09296p65562o96897n74112n42283o31273
2496.4G61158526p14958o79195n74052n58913o55174p26283o51776n00858m77910o17266
2516.8G55002141p55250p31051n81742n31077o53863p88987p99000o88195o12319p12454
2537.2G48148203q63671q54969p13647o29604o94513q30710q56698p10070n86152o49214
2557.6G40758955q21530q71837p06971n59747o31214p90000q18789p08580o14523o67155
2578G33568609q07882q64863p67469o28531o15120p27475q32796p76827n97358n70953
2598.4G26379335p66337r38475q97169p58112p59244r16540j063109j067042r57787
$$ plain form
2455.6 775000513 774236202 773530424 772877395 772203743 771435261 770598292 769851208 769245148 768642426 767921209
2476 767921209 767104506 766336143 765694320 765077949 764368653 763603091 762906194 762332082 761789799 761158526
2496.4 761158526 760443568 759764373 759190321 758631408 757976234 757249951 756598175 756097317 755619407 755002141
2516.8 755002141 754246891 753515840 752934098 752403021 751749158 750960171 750161171 749472976 748860657 748148203
2537.2 748148203 747284532 746429563 745715916 745086312 744391799 743561089 742704391 741994321 741408169 740758955
2557.6 740758955 739937425 739065588 738358617 737798870 737167656 736377656 735558867 734850287 734235764 733568609
2578 733568609 732760727 731895864 731128395 730499864 729884744 729157269 728324473 727547646 726950288 726379335
2598.4 726379335 725612998 724674523 723777354 723019242 722259998 721343458 720280349 719213307 718255520
2616.8G18255520r50992j128078j245677j173914j079857j129985j301169j412452
2633.1G08833396j350879j208008j155555j257658j368582j322389j221060j219452
2649.4F98729813j305282j378000j341641j245618j200258j211584j257062j298070
2665.7F88492298j241565j134336j135289j223386j231670j119256j047790j086831
2682F79272175j131654j129508j078963j022101j062393j161456j194298j169443j163900
2700.4F69158459j218915j282215j308799j307309j288593j295805j338482j374542
2716.7F58743799j366794j309574j251519j241028j259446j237154j158059j087904
2733F48832321j102447j155377j132607j074612j031578j016319j056194j060546j001834
$$ plain form
2616.8 718255520 717304528 716176450 714930773 713756859 712677002 711547017 710245848 708833396
2633.1 708833396 707482517 706274509 705118954 703861296 702492714 701170325 699949265 698729813
2649.4 698729813 697424531 696046531 694704890 693459272 692259014 691047430 689790368 688492298
2665.7 688492298 687250733 686116397 684981108 683757722 682526052 681406796 680359006 679272175
2682 679272175 678140521 677011013 675932050 674909949 673847556 672686100 671491802 670322359 669158459
2700.4 669158459 667939544 666657329 665348530 664041221 662752628 661456823 660118341 658743799
2716.7 658743799 657377005 656067431 654815912 653574884 652315438 651078284 649920225 648832321
2733 648832321 647729874 646574497 645441890 644367278 643335700 642319381 641263187 640202641 639200807
2751.4F39200807r95815j055718j074791j041352j016677j024186j054466j075864
2767.7F30861938j098514j141667j182258j212001j258850j310945j340270j380980
2784F20936453j449108j500070j531005j592040j662016j697957j728297j786649j845300
2802.3F06144011j891255j962006k034963k078414k149343k258122k305210k307355
2818.7E89157343k402842k558649k664983k777100k909660l033280l225744l508389
2835E66076696l843963m290939m967868n862534o835699p612586p785261p105052n636037
2853.3E12136757l816008k297402j553058j704157k497077l455460m186511m458397
2869.7D88168687m193008l535927k741694k024442j515180j266807j268000j419425
$$ plain form
2751.4 639200807 638204992 637149274 636074483 635033131 634016454 632992268 631937802 630861938
2767.7 630861938 629763424 628621757 627439499 626227498 624968648 623657703 622317433 620936453
2784 620936453 619487345 617987275 616456270 614864230 613202214 611504257 609775960 607989311 606144011
2802.3 606144011 604252756 602290750 600255787 598177373 596028030 593769908 591464698 589157343
2818.7 589157343 586754501 584195852 581530869 578753769 575844109 572810829 569585085 566076696
2835 566076696 562232733 557941794 552973926 547111392 540275693 532663107 524877846 517772794 512136757
2853.3 512136757 508320749 506023347 504470289 502766132 500269055 496813595 492627084 488168687
2869.7 488168687 483975679 480439752 477698058 475673616 474158436 472891629 471623629 470204204
2886D70204204j565724j644761j770079k005666k263457k506405k742410k980262l302335
2904.3D49423105l766120m343003m967868n586684o137282o470829o415307n863190
2920.6D05872822m831672l479183k011329n76376Q08864K146751L363490M362554N037188
2939D10693109N327076N225032M697621L826618K891243K079397J453281J209199J458287
2957.4D38860863K061934K882600L772288M578322N262614N809724O194383O402075
2973.7D75824803O409109O258130N991399N585998N100608M598975M050673L454506
2990E17274201K848208K219438J551032Q76606K24531l65615q26657j128614j275837
3008.3E21397293j246393j084507r50038r57012j081348j286447j586675j904726k086997
$$ plain form
2886 470204204 468638480 466993719 465223640 463217974 460954517 458448112 455705702 452725440 449423105
2904.3 449423105 445656985 441313982 436346114 430759430 424622148 418151319 411736012 405872822
2920.6 405872822 401041150 397561967 395550638 394974262 395783126 397929877 401293367 405655921 410693109
2939 410693109 416020185 421245217 425942838 429769456 432660699 434740096 436193377 437402576 438860863
2957.4 438860863 440922797 443805397 447577685 452156007 457418621 463228345 469422728 475824803
2973.7 475824803 482233912 488492042 494483441 500069439 505170047 509769022 513819695 517274201
2990 517274201 520122409 522341847 523892879 524769485 524994016 524628401 523801744 522673130 521397293
3008.3 521397293 520150900 519066393 518116355 517159343 516077995 514791548 513204873 511300147 509213150
3026.7E09213150k119303k124608k154112k198875k289533k410978k502233k558947
3043D90854561k610325k655149k670258k684027k723813k725125k682626k642631k558440
3061.4D66902167k408773k264619k142936k014816j906276j839607j788617j717686
3077.7D50818837j672030j688450j639009j476437j362234j364201j369030j322031
3094D38925415j281708j284003j361073j478880j510889j471042j476854j557023j642853
3112.4D25861090j677900j681775j709521j796067j898050j948029j982689k043575
3128.7D11123484k059102k054751k113103k167434k160460k164542k218217k255321
3145C93930554k256304k251714k256841k300500k351463k344638k318830k337873k370834
$$ plain form
3026.7 509213150 507093847 504969239 502815127 500616252 498326719 495915741 493413508 490854561
3043 490854561 488244236 485589087 482918829 480234802 477510989 474785864 472103238 469460607 466902167
3061.4 466902167 464493394 462228775 460085839 458071023 456164747 454325140 452536523 450818837
3077.7 450818837 449146807 447458357 445819348 444342911 442980677 441616476 440247446 438925415
3094 438925415 437643707 436359704 434998631 433519751 432008862 430537820 429060966 427503943 425861090
3112.4 425861090 424183190 422501415 420791894 418995827 417097777 415149748 413167059 411123484
3128.7 411123484 409064382 407009631 404896528 402729094 400568634 398404092 396185875 393930554
3145 393930554 391674250 389422536 387165695 384865195 382513732 380169094 377850264 375512391 373141557
3163.4C73141557k351344k336681k374798k396941k395183k366483k305746k253681
3179.7C54360700k253950k295643k300173k248496k197862k197325k223283k204478
3196C36439490k131998k057135k002538j965165j926183j891613j866609j859039j882166
3214.3C18857044j870066j828849j810611j817613j860768j862973j807183j830310
3230.7C04168671j909077j969874k038926k075970k087623k117455k163499k222091
3247B87584156k250314k245903k292573k366305k380222k368510k341717k253682k182602
3265.3B66902328k164990k074301j930505j835466j726985j583695j455069j310378
3281.6B52820939j173794j061500r28118q27089p67172o59644n32702m62815l91156
$$ plain form
3163.4 373141557 370790213 368453532 366078734 363681793 361286610 358920127 356614381 354360700
3179.7 354360700 352106750 349811107 347510934 345262438 343064576 340867251 338643968 336439490
3196 336439490 334307492 332250357 330247819 328282654 326356471 324464858 322598249 320739210 318857044
3214.3 318857044 316986978 315158129 313347518 311529905 309669137 307806164 305998981 304168671
3230.7 304168671 302259594 300289720 298250794 296174824 294087201 291969746 289806247 287584156
3247 287584156 285333842 283087939 280795366 278429061 276048839 273680329 271338612 269084930 266902328
3265.3 266902328 264737338 262663037 260732532 258897066 257170081 255586386 254131317 252820939
3281.6 252820939 251647145 250585645 249657527 248830438 248063266 247403622 246870920 246408105 246016949
3300B46016949l01882k54497k48298k34753j81988j56745j52827q7335j6138l8207
3320.4B44344279j22234j57505j51888j60739j33618p7665j05649j98007k22072k19494
3340.8B42795408k74644l31506l36930l26052l44157l76582m08367l94493l27066l24025
3361.2B39351586m08844m30479l78847m06012n12377n36665m53398l72112l38748l61204
3381.6B35152900l31849k07185q0452l7983j35809k39775k21297q5592Q1286L0711
3402B33924955j58056j01179Q5160J48833J50486J78323K42680K95341K94536L44560
3422.4B35405639N28991P06375P72461P49350Q17075R52735R09657P61896P30455Q54805
3442.8B43189439J052842J193329J195252J189769J243189J333296J452833J517475
$$ plain form
3300 246016949 245715067 245460570 245212272 244977519 244795531 244638786 244485959 244398624 244382486 244344279
3320.4 244344279 244222045 244064540 243912652 243751913 243618295 243540630 243434981 243236974 243014902 242795408
3340.8 242795408 242520764 242189258 241852328 241526276 241182119 240805537 240397170 240002677 239675611 239351586
3361.2 239351586 238942742 238512263 238133416 237727404 237215027 236678362 236224964 235852852 235514104 235152900
3381.6 235152900 234821051 234613866 234533414 234495431 234359622 234119847 233898550 233812958 233894244 233924955
3402 233924955 233766899 233665720 233750880 233899713 234050199 234228522 234471202 234766543 235061079 235405639
3422.4 235405639 235934630 236641005 237413466 238162816 238979891 239932626 240842283 241604179 242334634 243189439
3442.8 243189439 244242281 245435610 246630862 247820631 249063820 250397116 251849949 253367424
3459.1B53367424J448989J421750J633793J845121J701325J369894J390904J686126
3475.4B65865326J908511J984566J864583J761973J876175J979232J976400K026618
3491.7B81243384K085596K113819K113611K129584K184004K123952K029061K143592
3508B98166603K301097K348184K364070K325326K314687K423137K591819K585411K438962
3526.4C19859296K468824K616048K688855K797365K858371K779156K872974L079503
3542.7C42020392L126830K989412K894610L001660L176421L251731L285468L406763
3559C67153287L523886L497362L452659L712326L977061L884792L818959L993839M159152
3577.4D01173323M259825M389048M422903M378646M458607M603713M536659M527450
$$ plain form
3459.1 253367424 254816413 256238163 257871956 259717077 261418402 262788296 264179200 265865326
3475.4 265865326 267773837 269758403 271622986 273384959 275261134 277240366 279216766 281243384
3491.7 281243384 283328980 285442799 287556410 289685994 291869998 293993950 296023011 298166603
3508 298166603 300467700 302815884 305179954 307505280 309819967 312243104 314834923 317420334 319859296
3526.4 319859296 322328120 324944168 327633023 330430388 333288759 336067915 338940889 342020392
3542.7 342020392 345147222 348136634 351031244 354032904 357209325 360461056 363746524 367153287
3559 367153287 370677173 374174535 377627194 381339520 385316581 389201373 393020332 397014171 401173323
3577.4 401173323 405433148 409822196 414245099 418623745 423082352 427686065 432222724 436750174
3593.7D36750174M709810M836499M817993M804790M794299M643858M624307M796594
3610D74778324M932523N024344M966259M942626N106061M971803M674851M549146M773319
3628.4E18719256N039632M758716M611254M651129M593015M554212M503011M339159
3644.7E55769384M211783M352272M436195M107773L886342M070401M127324L854930
3661E88816404L600359L488243L357708L292859L410459L188431K849757K923668L005207
3679.4F17933095K906382K845108K808392K677202K379954K219141K252042K199173
3695.7F38220489K074838J926064J784504J789987J860797J747370J456201J269937
3712F52130187J462817J620412J536250J415193J320362J198530J113772J249433J346588
$$ plain form
3593.7 436750174 441459984 446296483 451114476 455919266 460713565 465357423 469981730 474778324
3610 474778324 479710847 484735191 489701450 494644076 499750137 504721940 509396791 513945937 518719256
3628.4 518719256 523758888 528517604 533128858 537779987 542373002 546927214 551430225 555769384
3644.7 555769384 559981167 564333439 568769634 572877407 576763749 580834150 584961474 588816404
3661 588816404 592416763 595905006 599262714 602555573 605966032 609154463 612004220 614927888 617933095
3679.4 617933095 620839477 623684585 626492977 629170179 631550133 633769274 636021316 638220489
3695.7 638220489 640295327 642221391 644005895 645795882 647656679 649404049 650860250 652130187
3712 652130187 653593004 655213416 656749666 658164859 659485221 660683751 661797523 663046956 664393544
3730.3F64393544J221717J035571J014888J150429J129985Q26001O98328J134277J144707
3748.7F73749447P23243Q10802J175522J142502Q52704P78497Q80479Q81911Q43227
3767.1F81838334P89523P95722Q67724Q96692Q74281P63536O92069O52492N82040O73413
3787.5F89425826Q67903Q87513P02143N66781O11424N17369L82900O01232O48856N90026
3807.8F95801973P81894Q55148O27339L98397N00977M71831L72171N41270O09040O38247
3828.2G01598287O08086N12243O00457N09798J99676K77340M84109N00918N23030N85497
3848.6G06399441L84092j80483o8068P19487Q21650N36919L57151L54767L52561K15114
3869G09892631J81019L12567M56988N47708M32074L21030K85506J87874K68281L09408
$$ plain form
3730.3 664393544 665615261 666650832 667665720 668816149 669946134 670772135 671470463 672604740 673749447
3748.7 673749447 674472690 675283492 676459014 677601516 678454220 679232717 680113196 680995107 681838334
3767.1 681838334 682627857 683423579 684291303 685187995 686062276 686825812 687517881 688170373 688752413 689425826
3787.5 689425826 690293729 691181242 691883385 692450166 693061590 693578959 693961859 694563091 695211947 695801973
3807.8 695801973 696583867 697439015 698066354 698464751 698965728 699437559 699809730 700351000 700960040 701598287
3828.2 701598287 702206373 702718616 703319073 703828871 704028547 704305887 704789996 705290914 705813944 706399441
3848.6 706399441 706783533 706603050 706534982 707254469 708076119 708613038 708970189 709324956 709677517 709892631
3869 709892631 710073650 710386217 710843205 711390913 711822987 712144017 712429523 712617397 712885678 713195086
3889.4G13195086J82032K75135M03047K54094M9353M4882J66416K60354K76744K35677
3909.8G15342820K44438K82586J72198M1365J30594K40803K18034J59502J29521J67608
3930.2G17129469K13683J54733J01269J77323K38300J83582J28508J10387J13309J58727
3950.6G18709290J84596J77919J58132J52051J66655J36196J23978J69158J93596J68621
3971G20340192J02282Q8870J30475J15931J05441J27554J26183J32858J32621J24633
3991.4G21527040J51873J93119K03490
3997.5G22075522
$$ plain form
3889.4 713195086 713377118 713652253 714055300 714309394 714358747 714403629 714570045 714830399 715107143 715342820
3909.8 715342820 715587258 715869844 716042042 716083407 716214001 716454804 716672838 716832340 716961861 717129469
3930.2 717129469 717343152 717497885 717599154 717776477 718014777 718198359 718326867 718437254 718550563 718709290
3950.6 718709290 718893886 719071805 719229937 719381988 719548643 719684839 719808817 719977975 720171571 720340192
3971 720340192 720442474 720531344 720661819 720777750 720883191 721010745 721136928 721269786 721402407 721527040
3991.4 721527040 721678913 721872032 722075522
3997.5 722075522
##END=$$ End of the data block
