##TITLE=G14-51-CE $$ Begin of the data block
##JCAMP-DX=5.00 $$ ACD/SpecManager v 10.08
##SPECTROMETER/DATA SYSTEM=Alpha
##DATE=22 Oct 2013 11:25:32
##DATA TYPE=INFRARED SPECTRUM
##DATA CLASS=XYDATA
##ORIGIN=
##OWNER=
##NPOINTS=1765
##FIRSTX=399.75695801
##LASTX=3997.56933594
##MAXX=3997.56933594
##MINX=399.75695801
##MAXY=0.80690646
##MINY=0.23403443
##XFACTOR=1.0000000000
##YFACTOR=1.000000000000000e-9
##FIRSTY=0.49547023
##DELTAX=2.03957629
##XUNITS=1/CM
##YUNITS=ARBITRARY UNITS
##XYDATA=(X++(Y..Y))
399.8D95470226m209310l005534r85116J36733P599o9230N44190Q31097k08914j901775
$$ 495470226 491260916 488255382 487270266 487406999 487414598 487345368 487889558 488720655 488511741 486609966
420.2D86609966k072007j049667m42237j195669k478212k395690j000524N1529K55257
$$ 486609966 484537959 483488292 483046055 481850386 479372174 476976484 475975960 476027489 476282746
438.5D76282746L09228J054168K092988J975745O39498n98461p50392k75106o91294
$$ 476282746 476591974 477646142 479739130 481714875 482354373 481755912 481005520 480730414 480039120
456.9D80039120k136737k883643k544761j936167j901716k584816l117024k702773
$$ 480039120 477902383 475018740 472473979 470537812 468636096 466051280 462934256 460231483
473.2D60231483j553208j025408j442790j515180p88212l33816p52389j484811j761467
$$ 460231483 458678275 457652867 456210077 454694897 453906685 453572869 452820480 451335669 449574202
491.5D49574202j587093j652568k095401k516777k805948k742440k474725k771109
$$ 449574202 447987109 446334541 444239140 441722363 438916415 436173975 433699250 430928141
507.9D30928141l300548l221184k775609k660990k822250k619326j935482j044214
$$ 430928141 427627593 424406409 421630800 418969810 416147560 413528234 411592752 410548538
524.2D10548538l24667j03563J02610Q62270J825154K402455K507895K385676K235442
$$ 410548538 410223871 410120308 410222918 411085188 412910342 415312797 417820692 420206368 422441810
542.5D22441810J730562N95182n03093j022279j188696j264423j502991j934498k155274
$$ 422441810 424172372 424767554 424264461 423242182 422053486 420789063 419286072 417351574 415196300
560.9D15196300k128542k301335k750904k881944k181232q76993L63440J153081J748413
$$ 415196300 413067758 410766423 408015519 405133575 402952343 402075350 402438790 403591871 405340284
579.2D05340284K579540L513247L810495L129482J981497J114816P72804O30021L01152
$$ 405340284 407919824 411433071 415243566 418373048 420354545 421469361 422242165 422872186 423173338
597.6D23173338j65045k51770K07215N54085L72768J16646K02537O27607J080691J195372
$$ 423173338 423008293 422756523 422963738 423517823 423890591 424007237 424209774 424837381 425918072 427113444
618D27113444J247286J871318K864480L386557L092051K487451K308070K524227K492786
$$ 427113444 428360730 430232048 433096528 436483085 439575136 442062587 444370657 446894884 449387670
636.3D49387670J862734J188159J208872J671284J684040J041889L80129K87860O75530
$$ 449387670 451250404 452438563 453647435 455318719 457002759 458044648 458424777 458712637 459388167
654.7D59388167Q15391L78251j0133J48178O03616J218080J358658O20693Q58874J737237
$$ 459388167 460203558 460581809 460571676 460719854 461323470 462541550 463900208 464520901 465379775 467117012
675.1D67117012K160012J813948J266092J101226J308799J271397O36339j49101n83500
$$ 467117012 469277024 471090972 472357064 473458290 474767089 476038486 476674825 476525724 475942224
693.5D75942224p13646q84950r59248n11616L98606J328230K005339K356976K569586
$$ 475942224 475228578 474343628 473384380 472872764 473271370 474599600 476604939 478961915 481531501
711.8D81531501L020227L710747M295557M550934M604787M778206N027235M820346
$$ 481531501 484551728 488262475 492558032 497108966 501713753 506491959 511519194 516339540
728.1E16339540M152775L472448K902805K525509K152145J420736N38647O6340r7096
$$ 516339540 520492315 523964763 526867568 529393077 531545222 532965958 533504605 533570945 533473849
746.5E33473849l72469p81179j181185j467347j583159j558006j350522q34048J18673
$$ 533473849 533101380 532320201 531139016 529671669 528088510 526530504 525179982 524345934 524464607
764.8E24464607J507104K947688M119515N000293N612731N867064N626202M972279
$$ 524464607 525971711 528919399 533038914 538039207 543651938 549519002 555145204 560117483
781.2E60117483M197538L540814L023267K577841K172351K055406K359927K826333
$$ 560117483 564315021 567855835 570879102 573456943 575629294 577684700 580044627 582870960
797.5E82870960L206969L390193L375828L177285K755046K109229J430154R58145O62804
$$ 582870960 586077929 589468122 592843950 596021235 598776281 600885510 602315664 603273809 603936613
815.8F03936613J85191n86033j368403j929045k334177k764106l212690l516496l479004
$$ 603936613 604121804 603535771 602167368 600238323 597904146 595140040 591927350 588410854 584931850
834.2E84931850l236293l185094l347218l285765k767921k000451j416683j292825
$$ 584931850 581695557 578510463 575163245 571877480 569109559 567109108 565692425 564399600
850.5E64399600j294792r91046n00858L7909J081407K944231N073487O667376P194936
$$ 564399600 563104808 562113762 561612904 561650813 562732220 565676451 570749938 577417314 584612250
868.9E84612250O552756N183041L639102K038241J11758k135694m141092n300283n568087
$$ 584612250 591165006 596348047 599987149 602025390 602137148 600001454 595860362 590560079 584991992
887.2E84991992n516053n638241n791784n598485n155981m965246n408287o318032
$$ 584991992 579475939 573837698 568045914 562447429 557291448 552326202 546917915 540599883
903.5E40599883p027090p245541p384121p713616p907987p456600o197959m553080
$$ 540599883 533572793 526327252 518943131 511229515 503321528 495864928 489666969 485113889
919.8D85113889l180832k297431j626730r47952l46035j08540k92927m86165l25650
$$ 485113889 481933057 479635626 478008896 477060944 476714909 476606369 476313442 475827277 475501627
938.2D75501627p6890n46336k268762m800916p145702q783043r907782j0759294j1201382
$$ 475501627 475424737 474878401 472609639 467808723 460663021 451879978 441972196 431212902 420011520
956.6D20011520j1173069j0984004j0949641j1096537j1137665j0694354r731591q613497
$$ 420011520 408838451 397854447 386904806 375808269 364670604 353976250 344244659 335631162
972.9C35631162p586956o521165n190999l690719k492369j868158j595706j354098
$$ 335631162 328044206 321523041 316332042 312641323 310148954 308280796 306685090 305330992
989.2C05330992j048535q03650o83456n71520l05414J20431M10140K15113m23461j069158
$$ 305330992 304282457 303478807 302795351 302223831 301918417 302038848 302448988 302664101 302240640 301171482
1009.6C01171482j383514j435130j485110j635074j769334j776755j753986j838178
$$ 301171482 299787968 298352838 296867728 295232654 293463320 291686565 289932579 288094401
1025.9B88094401k010285k135396k105177j995295j972735k103776k215266k139211
$$ 288094401 286084116 283948720 281843543 279848248 277875513 275771737 273556471 271417260
1042.2B71417260j915216j633078j324177r37045l82989L26603R86755J469970J822084
$$ 271417260 269502044 267868966 266544789 265607744 265224755 265551358 266538113 268008083 269830167
1060.6B69830167K172441K523660K417356J396000j83016j322865j307726k81304J069784
$$ 269830167 272002608 274526268 276943624 278339624 278156608 276833743 275526017 275244713 276314497
1078.9B76314497K283126L277749M051298M513651M638314M504800M168361L705115
$$ 276314497 278597623 281875372 285926670 290440321 295078635 299583435 303751796 307456911
1095.2C07456911L174066K557218J896292J431585J370966J687497K156556K553790
$$ 307456911 310630977 313188195 315084487 316516072 317887038 319574535 321731091 324284881
1111.6C24284881K785713K822429K706200K480596K161741J862675J782954K044737
$$ 324284881 327070594 329893023 332599223 335079819 337241560 339104235 340887189 342931926
1127.9C42931926K567709K959579K827316K212644J388520N68450r1464n16981p59929
$$ 342931926 345499635 348459214 351286530 353499174 354887694 355456144 355364680 354847699 354087770
1146.2C54087770q38161o92397l59654Q6337O64711J391172K229035L100932L854156
$$ 354087770 353249609 352557212 352197558 352283895 352948606 354339778 356568813 359669745 363523901
1164.6C63523901M355907M704773N192638N960584O802111P361144P550955P572532
$$ 363523901 367879808 372584581 377777219 383737803 390539914 397901058 405452013 413024545
1180.9D13024545P541746P325172O736308N750239M540891L323436K172231J064778
$$ 413024545 420566291 427891463 434627771 440378010 444918901 448242337 450414568 451479346
1197.2D51479346P1972n84453p82311o21140l55214k09928j26421P7605K84046K00689
$$ 451479346 451551318 450966865 450184554 449563414 449208200 448998272 448871851 448949456 449233502 449434191
1217.6D49434191k16931p57426j161307j344383j480669j767665k015442j881569j388282
$$ 449434191 449217260 448459834 447298527 445954144 444473475 442705810 440690368 438808799 437420517
1236D37420517q50946m67032j02788M61131J223505J877487K161890K197295K283484
$$ 437420517 436569571 436102539 435999751 436460882 437684387 439561874 441723764 443921059 446204543
1254.3D46204543K501279K654374K545506K244889K080679K252549K541900K505958
$$ 446204543 448705822 451360196 453905702 456150591 458231270 460483819 463025719 465531677
1270.6D65531677K041429J533300J340777J362413J301259J109063J026809J181305
$$ 465531677 467573106 469106406 470447183 471809596 473110855 474219918 475246727 476428032
1287D76428032J286894J011908L28690m27932r00387j123876j404077j814812k082050
$$ 476428032 477714926 478726834 479055524 478627592 477727205 476603329 475199252 473384440 471302390
1305.3D71302390j980513j632154j343906j182556r26227m01705J82777L79831n4687
$$ 471302390 469321877 467689723 466345817 465163261 464237034 463835329 464018106 464397937 464343250
1323.7D64343250q63224j575739k033949k347052k527445k417535j993954j366347
$$ 464343250 463480026 461904287 459870338 457523286 454995841 452578306 450584352 449218005
1340D49218005q08865o28203p55072q95559j002551j214712j582921j985431k217620
$$ 449218005 448409140 447780937 447025865 446130306 445127755 443913043 442330122 440344691 438127071
1358.3D38127071k425760k947539l604323l961533l886849l263205k808005l054619
$$ 438127071 435701311 432753772 429149449 425187916 421301067 418037862 415229857 412175238
1374.7D12175238l423899l635645l797800l723710l219515k396137j360148m92960
$$ 412175238 408751339 405115694 401317894 397594184 394374669 391978532 390618384 390125424
1391C90125424j72615k14965j63584Q4280M89444R47505J335264J528054J580626J666575
$$ 390125424 389952809 389737844 389574260 389658540 390147984 391095489 392430753 393958807 395539433 397206008
1411.4C97206008J756192J848042K086729K512842K600491K522767K406448K004206
$$ 397206008 398962200 400810242 402896971 405409813 408010304 410533071 412939519 414943725
1427.7D14943725J442224Q16255K67715k55078m29124M6641N18620O74009O35505N29140
$$ 414943725 416385949 417202204 417469919 417214841 416785717 416832358 417350978 418024987 418660492 419189632
1448.1D19189632L87669K57164M57823J351565K550185K873510K923071L317655L882676
$$ 419189632 419577301 419834465 420292288 421643853 424194038 427067548 429990619 433308274 437190950
1466.4D37190950M743457O573707R217232R732336P973820O280869M781932L274470
$$ 437190950 441934407 448508114 457725346 467457682 475431502 481712371 486494303 489768773
1482.8D89768773J580924k36511k217770l805935m258245m988015o450266o753295
$$ 489768773 491349697 491113186 488895416 485089481 480831236 475843221 469392955 462639660
1499.1D62639660o020218n602509p177353j0637671r914428q136302p803291o834686
$$ 462639660 456619442 451016933 443839580 433201909 423287481 415151179 407347888 400513202
1515.4D00513202n077630l231913k628267k711475k780348l045499k789378k490491
$$ 400513202 395435572 392203659 389575392 386863917 384083569 381038070 378248692 375758201
1531.7C75758201k497614j915901j283050j297057p82311L86238J311571K073735K818554
$$ 375758201 373260587 371344686 370061636 368764579 367982268 368368506 369680077 371753812 374572366
1550.1C74572366L524602M119515M409224N192608N623817M051894L416866L369451
$$ 374572366 378096968 382216483 386625707 391818315 397442132 401494026 404910892 408280343
1566.4D08280343L064900K703876K091944J683593J462251R74357M67867P3879j19507
$$ 408280343 411345243 414049119 416141063 417824656 419286907 420261264 420729131 420803010 420683503
1584.7D20683503l19302o80715j242906j809060k343238k846002l495455m386753n198538
$$ 420683503 420364201 419683486 418440580 416631520 414288282 411442280 407946825 403560072 398361534
1603.1C98361534n816698o540001p561862q220703q293271r242564j1046648j0166049
$$ 398361534 392544836 386004835 378442973 370222270 361928999 352686435 341639787 331473738
1619.4C31473738r736180j1466325j1601537j0812193j0380328r147018q478105q922667
$$ 331473738 321737558 310271233 298669696 287857503 277477175 268330157 259852052 250929385
1635.7B50929385o702274l444507j665339n19470M23655J235739J544550K042889L089324
$$ 250929385 244227111 240782604 239117265 238597795 239021450 240257189 241801739 243844628 246933952
1654.1B46933952L318176L576427M575700N883038O790221O776750P589280Q809626
$$ 246933952 250252128 253828555 258404255 264287293 271077514 277854264 285443544 294253170
1670.4B94253170Q397609Q696229R582698R215981Q951157J0169804J2912125J2468278
$$ 294253170 302650779 311347008 320929706 330145687 339096844 349266648 362178773 374647051
1686.7C74647051J1292875J2513131J3289004J5898765J8379062J8299907J9526333
$$ 374647051 385939926 398453057 411742061 427640826 446019888 464319795 483846128
1701D83846128J6251564J3330996J2891173J0983587R243369Q076548P308662P138133
$$ 483846128 500097692 513428688 526319861 537303448 546546817 554623365 561932027 569070160
1717.3E69070160O250084M792988M028261L647148L166616K808512K406537K229154
$$ 569070160 575320244 580113232 584141493 587788641 590955257 593763769 596170306 598399460
1733.6E98399460K276719K306521K664924L214001L822744M675150N743146O927013
$$ 598399460 600676179 602982700 605647624 608861625 612684369 617359519 623102665 630029678
1749.9F30029678P599116P187247P053792P131935O732285O525218N918980N286157
$$ 630029678 637628794 644816041 651869833 659001768 665734053 672259271 678178251 683464408
1766.3F83464408N123734M856766M602790M168987L554821L329634L250599K942682
$$ 683464408 688588142 693444908 698047698 702216685 705771506 709101140 712351739 715294421
1782.6G15294421K559483K369523K330541K262176K182126J966595J819432J848221
$$ 715294421 717853904 720223427 722553968 724816144 726998270 728964865 730784297 732632518
1798.9G32632518J917302J800359J551032J457989J545489J646161J538992J352608
$$ 732632518 734549820 736350179 737901211 739359200 740904689 742550850 744089842 745442450
1815.2G45442450J266420J343667J414955J351893J211524J098037J114130J193344
$$ 745442450 746708870 748052537 749467492 750819385 752030909 753128946 754243076 755436420
1831.5G55436420J148761R38415Q26061R13203J000643R30786Q10623P50244P22885
$$ 755436420 756585181 757523596 758349657 759262860 760263503 761194289 762004912 762755156 763478041
1849.9G63478041P47859P73907P17938O10888O06179O87718P24256N94795M29213M57466
$$ 763478041 764225900 764999807 765717745 766328633 766934812 767622530 768346786 768941581 769370794 769828260
1870.3G69828260O11484O85990O08742N32806N58078O37710O66738O06656N16474M89712
$$ 769828260 770439744 771125734 771734476 772267282 772825360 773463070 774129808 774736464 775252938 775742650
1890.7G75742650N35607N56648N12958M37498M09007M22537M59016M46081L37004K59996
$$ 775742650 776278257 776834905 777347863 777785361 778194368 778616905 779075921 779522002 779859006 780119002
1911.1G80119002K93016L57569L67462L41058K84314K65718L23176L45230K95460K40028
$$ 780119002 780412018 780769587 781137049 781478107 781762421 782028139 782351315 782696545 782992005 783232033
1931.5G83232033K03848K02894K54035K52128J77145J43051K21372L07977L00109K33114
$$ 783232033 783435881 783638775 783892810 784144938 784322083 784465134 784686506 784994483 785294592 785527706
1951.9G85527706J63555J87457K93791L28779K42532J72853J91271K61248K97486K24889
$$ 785527706 785691261 785878718 786172509 786501288 786743820 786916673 787107944 787369192 787666678 787891567
1972.3G87891567J10984Q1062J56701K31683K15530J00613L8862J24753K30729J88589
$$ 787891567 788002551 788083613 788240314 788471997 788687527 788788140 788827002 788951755 789182484 789371073
1992.6G89371073L6955j1742R2089J84059R8169p8857j65522p8022N1438O915j99140
$$ 789371073 789408028 789396286 789488375 789672434 789770603 789691746 789526224 789448202 789499640 789506555 789307415
2015.1G89307415l27110k50041j18852r3400k38896l94821l40641j48117q6308k21848
$$ 789307415 788980305 788730264 788611412 788518012 788279116 787884295 787543654 787395537 787309229 787087381
2035.5G87087381l51250k88785r6857k7120j54615k91705k12610L5763J65701L2186
$$ 787087381 786736131 786447346 786350489 786323369 786168754 785877049 785664439 785700202 785865903 785898089
2055.9G85898089j34885o9857J50204K52247J32740k1697k5033J25944K32041J51038
$$ 785898089 785763204 785693347 785843551 786095798 786228538 786206841 786181808 786307752 786539793 786690831
2076.3G86690831n662k4557R8407K04682J96159M7326l8564R4473K66314K56002J06394
$$ 786690831 786685169 786660612 786759019 786963701 787159860 787207186 787168622 787263095 787529409 787785411 787891805
2098.7G87891805L7968J53303K95461K54333N7161n2333P4207K61069K59101O6161
$$ 787891805 787929773 788083076 788378537 788632870 788690031 788637698 788711905 788972974 789232075 789298236
2119.1G89298236m9054M3511J75238J89543Q2612j9551M1783K20418K53976Q5771n9069
$$ 789298236 789249182 789292693 789467931 789657474 789740086 789720535 789762318 789982736 790236712 790322483 790263414
2141.5G90263414J1444J91868K49326J43647K7895Q5592K49088L17991K49922J63913
$$ 790263414 790274858 790466726 790716052 790859699 790887594 790973186 791222274 791540265 791790187 791954100
2161.9G91954100K20716L98100M63426L55363K67982L26991M63009N13077M25279L17573
$$ 791954100 792174816 792572916 793036342 793391705 793659687 793986678 794449687 794962764 795388043 795705616
2182.3G95705616L29912M33624M78089L93510K72810K82824M19855M98653M04656K49266
$$ 795705616 796035528 796469152 796947241 797340751 797613561 797896385 798316240 798814893 799219549 799468815
2202.7G99468815K19226L15309M01854M11928L32594K39491K94805M07159L44336J83106
$$ 799468815 799688041 800003350 800405204 800817132 801149726 801389217 801684022 802091181 802435517 802618623
2223.1H02618623J50203K49267L21090K66850J42396R4414J73032K53916K01106Q4996
$$ 802618623 802768826 803018093 803339183 803606033 803748429 803842843 804015875 804269791 804470897 804555893
2243.5H04555893M2617R8706J89721J95682Q0943j609Q5890K04444J90973J00911L6538
$$ 804555893 804598510 804697216 804886937 805082619 805163562 805161953 805247843 805452287 805643260 805744171 805780709
2265.9H05780709M3750R5486J27375J11461O8843L9041L8803K6643L815K682L0339
$$ 805780709 805824459 805919945 806047320 806158781 806227624 806266665 806305468 806332111 806335926 806338608 806368947
2288.4H06368947N4717K8730k0087m8042k8312K5094O9797P3254N4777L1828J2994
$$ 806368947 806423664 806452394 806432307 806384265 806355953 806381047 806450844 806524098 806578875 806610703 806623697
2310.8H06623697L1054M1724K5749K5391M1187L6657L6895M4108r299j31189k48492
$$ 806623697 806654751 806696475 806722224 806747615 806788802 806825459 806862354 806906462 806897163 806765974 806517482
2333.3H06517482k91646k72274k37405k40386l60071o31631o22332k37822J42097L14594
$$ 806517482 806225836 805953562 805716157 805475771 805115700 804484069 803861737 803623915 803766012 804080606
2353.6H04080606K82764Q9526k50280n06103n99265o23822o55651o92904p23183p47800
$$ 804080606 804363370 804452896 804202616 803696513 803097248 802473426 801817775 801124871 800401688 799653888
2374G99653888p23124o48379n72562n13435m77254m69864m30047l44575l26216m12345
$$ 799653888 798930764 798282385 797709823 797196388 796719134 796249270 795819223 795474648 795148432 794736087
2394.4G94736087m59730m22478m25816m86493n37097n34833m76479m53770n44966o57916
$$ 794736087 794276357 793853879 793428063 792941570 792404473 791869640 791393161 790939391 790394425 789736509
2414.8G89736509o84857o24418n67675o27339p42554p68006o91295o35922o73294p57933
$$ 789736509 789051652 788427234 787859559 787232220 786489666 785721660 785030365 784394443 783721149 782963216
2435.2G82963216q00669p30872o49750o89328p67946p87616p55548p18356p40528p88688
$$ 782963216 782162547 781431675 780781925 780092597 779324651 778537035 777781487 777063131 776322603 775533915
2455.6G75533915p79212p04765o48916o76215p62284q19027p40826o03557o02364p49290
$$ 775533915 774754703 774049938 773401022 772724807 771962523 771143496 770402670 769799113 769196749 768447459
2476G68447459q40843p43747o03497o19054p30991p56919o85752n84960n36561o28114
$$ 768447459 767606616 766862869 766259372 765640318 764909327 764152408 763466656 762881696 762345135 761717021
2496.4G61717021p45415o93321n40495n29886o73532p47740o45996m98294m75347n99564
$$ 761717021 760971606 760278285 759737790 759207904 758534372 757786632 757140636 756642342 756166995 755567431
2516.8G55567431p40587p43985o10829n30839o37054q03650q25166o88792o03556p10428
$$ 755567431 754826844 754082859 753472030 752941191 752304137 751500487 750675321 749986529 749382973 748672545
2537.2G48672545q56280q36194o91354o36459p42852q57950q35537o75023n61059o59346
$$ 748672545 747816265 746980071 746288717 745652258 744909406 744051456 743215919 742540896 741979837 741320491
2557.6G41320491q32319q47876o96362n83767o55771p99119q15988o84798n85794o55115
$$ 741320491 740488172 739640296 738943934 738360167 737704396 736905277 736089289 735404491 734818697 734163582
2578G34163582q09550q57651p35045o04033o30200p65204q31485p36416o00695o38366
$$ 734163582 733354032 732496381 731761336 731157303 730527103 729761899 728930414 728193998 727593303 726954937
2598.4G26954937q22723r01639q05915p19368p82907r45390j063525j059771r75966
$$ 726954937 726132214 725230575 724424660 723705292 722922385 721976995 720913470 719853699 718877733
2616.8G18877733r59993j099825j231789j192987j091600j121103j276493j393497
$$ 718877733 717917740 716817915 715586126 714393139 713301539 712180436 710903943 709510446
2633.1G09510446j363993j236856j174569j258075j367450j331806j193226j162886
$$ 709510446 708146453 706909597 705735028 704476953 703109503 701777697 700584471 699421585
2649.4F99421585j288534j405954j386106j259863j159788j182436j275898j300692
$$ 699421585 698133051 696727097 695340991 694081128 692921340 691738904 690463006 689162314
2665.7F89162314j208127j120627j153051j251996j259327j125753j014709j046479
$$ 689162314 687954187 686833560 685680509 684428513 683169186 682043433 681028724 679982245
2682F79982245j128733j142562j092553j031637j043737j134395j198769j201749j181006
$$ 679982245 678853512 677710950 676618397 675586760 674543023 673408628 672209859 671008110 669827104
2700.4F69827104j199901j268745j320422j315772j279950j286030j350343j377941
$$ 669827104 668627203 667358458 666038036 664722264 663442314 662156284 660805941 659428000
2716.7F59428000j321435j265525j276255j291692j246810j194716j144349j095414
$$ 659428000 658106565 656841040 655564785 654273093 653026283 651831567 650687218 649591804
2733F49591804j110971j139343j112581j073420j052022j053571j094640j094579j008392
$$ 649591804 648480833 647341490 646228909 645155489 644103467 643049896 641955256 640860677 639852285
2751.4F39852285r65654j003862j047552j068294j041650j005411j032532j084149
$$ 639852285 638886631 637882769 636835217 635766923 634725273 633719862 632687330 631603181
2767.7F31603181j098871j114368j173854j225114j246512j288831j338542j381933
$$ 631603181 630504310 629389942 628216088 626990974 625744462 624455631 623117089 621735156
2784F21735156j444757j487017j519263j579165j641512j720190j788378j816213j836658
$$ 621735156 620290399 618803382 617284119 615704954 614063442 612343252 610554874 608738661 606902003
2802.3F06902003j885414j980364k041042k054274k125681k232015k305209k351940
$$ 606902003 605016589 603036225 600995183 598940909 596815228 594583213 592278004 589926064
2818.7E89926064k405882k526104k670229k773046k882183l043651l250778l506661
$$ 589926064 587520182 584994078 582323849 579550803 576668620 573624969 570374191 566867530
2835E66867530l846407m299581m965365n887687o871342p589996p743240p100999n663931
$$ 566867530 563021123 558721542 553756177 547868490 540997148 533407152 525663912 518562913 512898982
2853.3E12898982l878773k353728j553237j674294k481640l477096m218191m469842
$$ 512898982 509020209 506666481 505113244 503438950 500957310 497480214 493262023 488792181
2869.7D88792181m202217l541052k745152k061486j556426j256079j226723j390695
$$ 488792181 484589964 481048912 478303760 476242274 474685848 473429769 472203046 470812351
2886D70812351j567215j686305j818478k021194k266168k508253k734482k978981l332913
$$ 470812351 469245136 467558831 465740353 463719159 461452991 458944738 456210256 453231275 449898362
2904.3D49898362l821224m360258m922867n541593o138146o496757o442249n885184
$$ 449898362 446077138 441716880 436794013 431252420 425114274 418617517 412175268 406290084
2920.6D06290084m820257l435493j984834n63711Q15421K114326L307670M329383N055577
$$ 406290084 401469827 398034334 396049500 395485789 396301210 398415536 401723206 406052589 411108166
2939D11108166N379140N250901M703492L859401K923012K089798J469165J206041J448959
$$ 411108166 416487306 421738207 426441699 430301100 433224112 435313910 436783075 437989116 439438075
2957.4D39438075K091110K900064L769874M610032N311847N844861O211102O407082
$$ 439438075 441529185 444429249 448199123 452809155 458121002 463965863 470176965 476584047
2973.7D76584047O409854O253123O008118N632133N130350M622281M090249L481091
$$ 476584047 482993901 489247024 495255142 500887275 506017625 510639906 514730155 518211246
2990E18211246K855420K230584J585007Q98600K04622l93092q25823j072824j194238
$$ 518211246 521066666 523297250 524882257 525780857 525985479 525592387 524766564 523693740 522499502
3008.3E22499502j235307j151561r69887q84295j021921j283407j573205j856149k068758
$$ 522499502 521264195 520112634 519142747 518258452 517236531 515953124 514379919 512523770 510455012
3026.7E10455012k169966k197683k188921k181471k260029k405405k504706k548695
$$ 510455012 508285046 506087363 503898442 501716971 499456942 497051537 494546831 491998136
3043D91998136k595812k657503k685368k672404k695590k733082k702594k626210k535641
$$ 491998136 489402324 486744821 484059453 481387049 478691459 475958377 473255783 470629573 468093932
3061.4D68093932k413065k280503k133787j982331j891464j827657j759351j719325
$$ 468093932 465680867 463400364 461266577 459284246 457392782 455565125 453805774 452086449
3077.7D52086449j724929j712590j598865j469821j424611j399487j340776j297713
$$ 452086449 450361520 448648930 447050065 445580244 444155633 442756146 441415370 440117657
3094D40117657j276046j262158j318038j431345j503706j504541j489431j557618j664847
$$ 440117657 438841611 437579453 436261415 434830070 433326364 431821823 430332392 428774774 427109927
3112.4D27109927j697421j716048j757711j805514j877010j939118j979351k018690
$$ 427109927 425412506 423696458 421938747 420133233 418256223 416317105 414337754 412319064
3128.7D12319064k061128k097130k124399k136886k136290k193034k266318k267897
$$ 412319064 410257936 408160806 406036407 403899521 401763231 399570197 397303879 395035982
3145C95035982k255440k242297k232372k304048k396911k382666k318054k304107k350033
$$ 395035982 392780542 390538245 388305873 386001825 383604914 381222248 378904194 376600087 374250054
3163.4C74250054k401441k375215k310336k319962k373486k381295k346367k294362
$$ 374250054 371848613 369473398 367163062 364843100 362469614 360088319 357741952 355447590
3179.7C55447590k290308k337515k338261k273053k201617k184569k201409k168625
$$ 355447590 353157282 350819767 348481506 346208453 344006836 341822267 339620858 337452233
3196C37452233k082467k017021k009720k042651k053648k005488j908600j835883j838863
$$ 337452233 335369766 333352745 331343025 329300374 327246726 325241238 323332638 321496755 319657892
3214.3C19657892j842827j830518j822889j814425j837104j863688j859665j867772
$$ 319657892 317815065 315984547 314161658 312347233 310510129 308646441 306786776 304919004
3230.7C04919004j884847j922459j995295k040744k091497k173990k211124k199292
$$ 304919004 303034157 301111698 299116403 297075659 294984162 292810172 290599048 288399756
3247B88399756k234966k305865k328724k347827k388477k370894k298981k252161k218485
$$ 288399756 286164790 283858925 281530201 279182374 276793897 274423003 272124022 269871861 267653376
3265.3B67653376k154440k050221j937419j837432j721174j600504j470953j316398
$$ 267653376 265498936 263448715 261511296 259673864 257952690 256352186 254881233 253564835
3281.6B53564835j189799j077175r39786q24526p31140o33270n56812n09753m49464
$$ 253564835 252375036 251297861 250358075 249533549 248802409 248169139 247612327 247102574 246653110
3300B46653110l51668k58565k11536j99348k02075j93253j52841j29715j30638p7039
$$ 246653110 246301442 246042877 245831341 245631993 245429918 245236665 245083824 244954109 244823471 244746432
3320.4B44746432l3960r2953j55837j55940j34111j05321q7440j27927k18615k95281
$$ 244746432 244712472 244619519 244463682 244307742 244173631 244068310 243980870 243852943 243634328 243339047
3340.8B43339047k96563k82645l20331l44291l41326l77655m63203m79489l92795l55705
$$ 243339047 243042484 242759839 242439508 242095217 241753891 241376236 240913033 240433544 240040749 239685044
3361.2B39685044m07428m09260l57390l78966m88192n38185m37155l44128l65361m08009
$$ 239685044 239277616 238868356 238510966 238132000 237643808 237105623 236668468 236324340 235958979 235550970
3381.6B35550970l43844k01568p4521j3724j28925l00959k61545m4122J14888K7999
$$ 235550970 235207126 235005558 234931037 234917313 234788388 234487429 234225884 234181762 234296650 234324649
3402B34324649j71796j18419J11565K14711J94788J69635J67742K27317L20584L77670
$$ 234324649 234152853 234034434 234145999 234360710 234555498 234725133 234892875 235120192 235440776 235818446
3422.4B35818446N22211P41213Q38608P88063Q20309R54851R06110P31230P34210R02966
$$ 235818446 236340657 237081870 237920478 238708541 239528850 240483701 241389811 242121041 242855251 243758217
3442.8B43758217J066625J165941J177385J187936J246348J336768J443833J516313
$$ 243758217 244824842 245990783 247168168 248356104 249602452 250939220 252383053 253899366
3459.1B53899366J482218J460791J628428J804561J693547J405298J394034J666218
$$ 253899366 255381584 256842375 258470803 260275364 261968911 263374209 264768243 266434461
3475.4B66434461J920402J971811J827657J781404J945287K026856J973719K008497
$$ 266434461 268354863 270326674 272154331 273935735 275881022 277907878 279881597 281890094
3491.7B81890094K078653K131462K144754K162784K187848K056390J952917K111941
$$ 281890094 283968747 286100209 288244963 290407747 292595595 294651985 296604902 298716843
3508B98716843K323538K416253K394259K310246K340585K509773K666831K576381K396912
$$ 298716843 301040381 303456634 305850893 308161139 310501724 313011497 315678328 318254709 320651621
3526.4C20651621K435177K573312K701103K868653K916991K787799K848059L074199
$$ 320651621 323086798 325660110 328361213 331229866 334146857 336934656 339782715 342856914
3542.7C42856914L151804L003091K909839L047228L193855L250539L335536L474712
$$ 342856914 346008718 349011809 351921648 354968876 358162731 361413270 364748806 368223518
3559C68223518L512383L445416L480077L743529L947914L898054L878713M021734M184872
$$ 368223518 371735901 375181317 378661394 382404923 386352837 390250891 394129604 398151338 402336210
3577.4D02336210M322529M409253M408777M390955M444868M561424M556268M583925
$$ 402336210 406658739 411067992 415476769 419867724 424312592 428874016 433430284 438014209
3593.7D38014209M734785M851609M861117M855245M800469M634350M666329M848897
$$ 438014209 442748994 447600603 452461720 457316965 462117434 466751784 471418113 476267010
3610D76267010M937619N017132M975736M950672N108416M975140M656911M508257M741669
$$ 476267010 481204629 486221761 491197497 496148169 501256585 506231725 510888636 515396893 520138562
3628.4E20138562N049526M818321M659831M612029M515469M518449M482925M308045
$$ 520138562 525188088 530006409 534666240 539278269 543793738 548312187 552795112 557103157
3644.7E57103157M169464M336834M499674M171133L900349M064977M106224L802538
$$ 557103157 561272621 565609455 570109129 574280262 578180611 582245588 586351812 590154350
3661E90154350L540814L479004L389239L297329L387749L165245K802968K849460K941429
$$ 590154350 593695164 597174168 600563407 603860736 607248485 610413730 613216698 616066158 619007587
3679.4F19007587K907038K894581K819418K637685K356291K244234K325713K269209
$$ 619007587 621914625 624809206 627628624 630266309 632622600 634866834 637192547 639461756
3695.7F39461756K058565J841069J732826J784921J834929J727640J485586J333475
$$ 639461756 641520321 643361390 645094216 646879137 648714066 650441706 651927292 653260767
3712F53260767J499475J581668J476288J396239J310408J170337J133144J328349J403332
$$ 653260767 654760242 656341910 657818198 659214437 660524845 661695182 662828326 664156675 665560007
3730.3F65560007J195252R90629J022637J171351J166999Q58188O97016J077891J045286
$$ 665560007 666755259 667745888 668768525 669939876 671106875 671965063 672662079 673739970 674785256
3748.7F74785256O90699Q53539J164078J102150Q82029Q29637Q90374Q84951Q37206
$$ 674785256 675475955 676329494 677493572 678595722 679477751 680307388 681197762 682082713 682919919
3767.1F82919919P55132P66992R01282R54628Q74579P15196O46234O55174O56545P16627
$$ 682919919 683675051 684442043 685343325 686297953 687172532 687887728 688533962 689189136 689845681 690562308
3787.5F90562308P94291Q00133P12872O15477N89013M68850M24207O88970O68227N41628
$$ 690562308 691356599 692156732 692869604 693485081 694074094 694542944 694967151 695656121 696324348 696865976
3807.8F96865976P06792Q15034O60181M39226M94480M46976L70741N92291O82712O42716
$$ 696865976 697572768 698387802 699047983 699487209 699981689 700428665 700799406 701391697 702074409 702717125
3828.2G02717125N21958M45783O07312N35369K04623L05414N41985N27501N52774O35981
$$ 702717125 703239083 703684866 704292178 704827547 705032170 705337584 705879569 706407070 706959844 707595825
3848.6G07595825L66092k80738r0361P60019P91192M64738L07977L69072L91364J98185
$$ 707595825 707961917 707681179 707590818 708350837 709142029 709606767 709914744 710283816 710675180 710873365
3869G10873365J64211L38078M77195N18798L67284L10600L39210K35379K86102L25799
$$ 710873365 711037576 711375654 711852849 712371647 712738931 713049531 713388741 713624120 713910222 714236021
3889.4G14236021J88887K48432L81947K58326Q7977P6592J14202K16782L31462L24070
$$ 714236021 714424908 714673340 715055287 715313613 715401590 715478182 715592384 715809166 716140628 716464698
3909.8G16464698K66850K01345P8022M5121K08497K92778J95742J15394R8765Q5950
$$ 716464698 716731548 716932893 717010915 717056036 717264533 717557311 717753053 717868447 717967212 718053162
3930.2G18053162J45137K33531K19286J93775J99854J86264J68801J23560R1255J51575
$$ 718053162 718198299 718431830 718651116 718844891 719044745 719231009 719399810 719523370 719614625 719766200
3950.6G19766200K18391J85132J21892J69634K20836J35004N1677R3162J76609J60515
$$ 719766200 719984591 720169723 720291615 720461249 720682085 720817089 720868766 720961928 721138537 721299052
3971G21299052R3580J20878J72674J43469J12951J59800K01940J49250P8857J01745
$$ 721299052 721392632 721513510 721686184 721829653 721942604 722102404 722304344 722453594 722532451 722634196
3991.4G22634196J68622J83880J48714
$$ 722634196 722802818 722986698 723135412
3997.5G23135412
$$ 723135412
##END=$$ End of the data block
