##TITLE=Zn(bpa)2-3 $$ Begin of the data block
##JCAMP-DX=5.00 $$ ACD/SpecManager v 10.08
##SPECTROMETER/DATA SYSTEM=Alpha
##DATE=16 Apr 2015 08:31:26
##DATA TYPE=INFRARED SPECTRUM
##DATA CLASS=XYDATA
##ORIGIN=
##OWNER=
##NPOINTS=1765
##FIRSTX=399.76428223
##LASTX=3997.64306641
##MAXX=3997.64306641
##MINX=399.76428223
##MAXY=0.83763176
##MINY=0.23945245
##XFACTOR=1.0000000000
##YFACTOR=1.000000000000000e-9
##FIRSTY=0.78107870
##DELTAX=2.03961372
##XUNITS=1/CM
##YUNITS=ARBITRARY UNITS
##XYDATA=(X++(Y..Y))
$$ plain form
399.8 781078696 778393805 776601553 777944624 777285755 768896103 753692865 735191703 715824068
416.1 715824068 699577630 702521026 730126500 764486611 786281943 792908549 795909464 800006330
432.4 800006330 801267445 798030138 795475423 795882404 794485509 788119435 780453205 774687052 768905997
450.8 768905997 761234164 754655004 751933217 749855220 741892815 727896810 714429677 706370413
467.1 706370413 705678463 714456320 730056047 744109094 752603173 756561220 759488940 764839470
483.4 764839470 770748198 773275733 773858011 776395559 779740334 779452264 775814056 772842288 770305514
501.7 770305514 762975276 748460352 731366932 719866574 718041718 723762870 733595490 745283186
518.1 745283186 754706264 758169234 757741511 758601189 761498570 762558997 761036038 760803699 763564944
$$ packed form
399.8G81078696k684891j792252J343071o58869q389652j5203238j8501162j9367635
416.1G15824068j6246438K943396K7605474L4360111K1795332O626606L000915M096866
432.4H00006330J261115l237307k554715M06981j396895o366074p666230n766153n781055
450.8G68905997p671833o579160k721787k077997p962405j3996005j3467133q059264
467.1G06370413o91950Q777857J5599727J4053047Q494079L958047K927720N350530
483.4G64839470N908728K527535N82278K537548L344775k88070l638208k971768k536774
501.7G70305514p330238j4514924j7093420j1500358j824856N721152R832620J1687696
518.1G45283186R423078L462970m27723Q59678K897381J060427j522959k32339K761245
$$ plain form
536.4 763564944 765359640 763128340 759975910 759643435 759865642 756266534 749614060 743476570 737608373
554.8 737608373 730241895 723346889 717969596 707530499 681934595 643989563 621269643 637926340
571.1 637926340 677697659 708279729 720750868 726134777 733004153 740485847 746040702 751017213
587.4 751017213 756601989 760493279 761128902 761330187 763716340 765819073 763710260 758576572 755152464
605.8 755152464 755177975 756014824 755791664 756164670 758263350 759674191 758317709 756230175 755813420
624.1 755813420 754926741 749617398 739923477 728253007 713713944 692878425 665048480 635772765
640.4 635772765 621642292 636670232 668769419 696985781 718435526 736493468 748802543
654.7 748802543 755031228 759489954 763969183 766101420 765282512 764115930 765020430 765534997 763692677
$$ packed form
536.4G63564944J794696k231300l152430l32475K22207l599108o652474o137490n868197
554.8G37608373p366478o895006n377293j0439097k5595904l7945032k2719920J6656697
571.1F37926340L9771319L0582070J2471139N383909O869376P481694N554855M976511
587.4G51017213N584776L891290O35623K01285K386153K102733k108813n133688l424108
605.8G55152464K5511Q36849k23160L73006K098680J410841j356482k087534m16755
624.1G55813420q86679n309343r693921j1670470j4539063k0835519k7829945k9275715
640.4F35772765j4130473J5027940L2099187K8216362K1449745J8057942J2309075
654.7G48802543O228685M458726M479229K132237q18908j166582R04500N14567j842320
$$ plain form
673.1 763692677 761324167 761103988 762082815 761161089 758569419 757468998 758304596 757832706 754724443
691.4 754724443 751836538 751300752 750983477 748219907 744229972 741697490 739870548 735733092 728933573
709.8 728933573 721679747 713853061 702044904 684107423 661885142 639661729 619283438 597615719
726.1 597615719 570322812 535947025 499594837 472724348 464838564 482246280 524022281 566665232
742.4 566665232 576743603 542184174 473326445 388365388 312755227 277501881 298342079
756.7 298342079 357720286 418607593 457345217 475616366 486945242 504628897 534575462
771 534575462 572302520 607799649 632474542 643301249 645292580 649058998 661326408 678833783
787.3 678833783 693924308 703776062 710671186 715999722 718646526 718546152 717610478 716324747 712589681
$$ packed form
673.1G63692677k368510k20179R78827r21726k591670j100421Q35598m71890l108263
691.4G54724443k887905n35786l17275k763570l989935k532482j826942m137456o799519
709.8G28933573p253826p826686j1808157j7937481k2222281k2223413k0378291k1667719
726.1E97615719k7292907l4375787l6352188k6870489p885784J7407716M1776001M2642951
742.4E66665232J0078371l4559429o8857729q4961057p5610161l5253346K0840198
756.7B98342079N9378207O0887307L8737624J8271149J1328876J7683655K9946565
771E34575462L7727058L5497129K4674893J0826707J991331L766418J2267410J7507375
787.3F78833783J5090525R851754O895124N328536K646804j00374r35674j285731l735066
$$ plain form
805.6 712589681 706182122 701341689 701619685 705824494 710625589 714197814 716796696 718552887 718389273
824 718389273 716354132 714456081 713693738 712591946 709878325 706586480 703933597 700673044 694496632
842.4 694496632 685517728 676230729 668654382 663705528 662039340 663207293 664572299 662239194
858.7 662239194 653454483 638188899 618622899 598322868 580962956 567750275 558106422 554487467
875 554487467 560350835 571627676 581092119 589041293 594701529 586892188 557870209 516575277
891.3 516575277 483686328 475246549 489799380 514099121 536610067 551941812 558489084 556729138
907.6 556729138 550266922 547553003 558999956 588293076 627682328 664310634 689865708 704183817
923.9 704183817 712048471 717347264 720980465 723512769 726617575 731551409 737971485 744310737
$$ packed form
805.6G12589681o407559m840433K77996M204809M801095L572225K598882J756191j63614
824G18389273k035141j898051p62343j101792k713621l291845k652883l260553o176412
842.4F94496632q978904r286999p576347m948854j666188J167953J365006k333105
858.7F62239194q784711j5265584j9566000k0300031j7359912j3212681r643853l618955
875E54487467N863368J1276841R464443P949174N660236p809341k9021979m1294932
891.3E16575277l2888949q439779J4552831K4299741K2510946J5331745O547272j759946
907.6E56729138o462216k713919J1446953K9293120L9389252L6628306K5555074J4318109
923.9G04183817P864654N298793L633201K532304L104806M933834O420076O339252
$$ plain form
940.3 744310737 749699950 755189240 761659920 767539501 770309031 769642532 767468035 765704870 764285326
958.6 764285326 762123644 760270000 760891974 763863683 767400444 770710528 773912072 776031911 775285900
977 775285900 771667123 766837060 761023223 752106071 738147378 718750477 694070220 666653454
993.3 666653454 644404233 634888589 635626256 637471199 636257648 633220255 627476752 617060959
1009.6 617060959 606830478 608945310 629039466 656549156 679561734 697577536 711349607
1023.9 711349607 716196775 706326962 682009578 660390615 663897157 690248072 717027068 730988562
1040.2 730988562 733468235 728429198 716360688 694419086 659537733 621926486 614534795 650365710
1056.5 650365710 690777302 703384161 697804630 687812209 671396673 644941449 617534280 608992875
$$ packed form
940.3G44310737N389213N489290O470680N879581K769530o66499k174497j763165j419544
958.6G64285326k161682j853644O21974K971709L536761L310084L201544K119839p46011
977G75285900l618777m830063n813837q917152j3958693j9396901k4680257k7416766
993.3F66653454k2249221r515644P37667J844943j213551l037393n743503j0415793
1009.6F17060959j0230481K114832K0094156K7509690K3012578J8015802J3772071
1023.9G11349607M847168r869813k4317384k1618963L506542K6350915K6778996J3961494
1040.2G30988562K479673n039037j2068510k1941602l4881353l7611247p391691L5830915
1056.5F50365710M0411592J2606859n579531r992421j6415536k6455224k7407169q541405
$$ plain form
1072.8 608992875 628125966 660072744 685570419 699390233 704805315 705167830 703262925 701796055
1089.2 701796055 701982617 703159332 704157174 703724444 699416637 690970063 685503304 689193070 698016524
1107.5 698016524 706016362 712204754 717630863 723659992 730497122 736633778 741345406 746161938
1123.8 746161938 752711713 760581732 768182516 774457455 779125631 781237662 778070748 766315103
1140.1 766315103 744244933 712794721 678940713 653823853 642074108 645127475 664704561
1154.4 664704561 691780984 716239929 739481926 761570632 776714921 783252239 784965754 785623908
1170.7 785623908 786351800 786409616 785247326 783069074 779303193 772132039 761209786 750675738
1187.1 750675738 746916592 752074242 761476934 769140303 773391485 775310576 775477886 774215281
$$ packed form
1072.8F08992875J9133091L1946778K5497675J3819814N415082L62515j904905j466870
1089.2G01796055J86562J176715R97842m32730m307807q446574n466759L689766Q823454
1107.5F98016524P999838O188392N426109O029129O837130O136656M711628M816532
1123.8G46161938O549775P870019P600784O274939M668176K112031l166914j1755645
1140.1G66315103k2070170l1450212l3854008k5116860j1749745L053367J9577086
1154.4F64704561K7076423K4458945K3241997K2088706J5144289O537318J713515O58154
1170.7G85623908P27892N7816j162290k178252l765881p171154j0922253j0534048
1187.1G50675738l759146N157650R402692P663369M251182J919091J67310j262605
$$ plain form
1203.4 774215281 772382498 770466745 767859161 763758898 758643329 754049420 750417352 746465623
1219.7 746465623 741248190 734795153 727370322 720324576 715943694 715075791 715931773 715446651 711560965
1238.1 711560965 704256475 694360137 681754231 665915787 648693442 634734452 626189768 619262218
1254.4 619262218 609612525 597383797 585090101 574225426 563584328 549821019 531246781
1268.6 531246781 509952962 489201993 470112324 451421857 431520730 409431577 384997487
1282.9 384997487 359315097 335194051 316230178 302767009 290471792 276453733 265417963
1297.2 265417963 267920882 294161707 347057074 417684257 489567727 548221529 587216437
1311.5 587216437 605211258 599351525 570228100 538994610 540623009 584562659 646254241 698190928
$$ packed form
1203.4G74215281j832783j915753k607584m100263n115569m593909l632068l951729
1219.7G46465623n217433o453037p424831p045746m380882q67903Q55982m85122l885686
1238.1G11560965p304490r896338j2605906j5838444j7222345j3958990q544684o927550
1254.4F19262218r649693j2228728j2293696j0864675j0641098j3763309j8574238
1268.6E31246781k1293819k0750969j9089669j8690467j9901127k2089153k4434090
1282.9C84997487k5682390k4121046j8963873j3463169j2295217j4018059j1035770
1297.2B65417963K502919K6240825N2895367P0627183P1883470N8653802L8994908
1311.5E87216437J7994821n859733k9123425l1233490J628399M3939650O1691582N1936687
$$ plain form
1327.8 698190928 732777119 755542040 771424413 782187760 788831711 792741537 795073926 795889616
1344.1 795889616 794651031 791088283 785599232 777540207 764589310 745832622 724688590 703946650
1360.4 703946650 683789074 670065224 666747034 667041242 667314053 676192880 698751032 723097324
1376.7 723097324 738782406 746394873 749235690 750337243 751134217 750895083 748815536 744528890
1393.1 744528890 738467276 731838822 724632144 716746151 708236158 698072255 685959578 670216203
1409.4 670216203 647903383 618609607 583602011 541162252 498543233 480718821 485097349
1423.7 485097349 490052253 481684655 460758954 441535294 439377427 457266986 480953306 489620984
1440 489620984 483571529 470807254 457168043 438244134 406835735 369518220 347765326 379315674
$$ packed form
1327.8F98190928L4586191K2764921J5882373J0763347O643951L909826K332389Q15690
1344.1G95889616j238585l562748n489051q059025j2950897j8756688k1144032k0741940
1360.4G03946650k0157576j3723850l318190K94208K72811Q878827K2558152K4346292
1376.7G23097324J5685082P612467K840817J101553P96974k39134k079547m286646
1393.1G44528890o061614o628454p206678p885993q509993j0163903j2112677j5743375
1409.4F70216203k2312820k9293776l5007596m2439759m2619019j7824412M378528
1423.7D85097349M954904q367598k0925701j9223660k157867J7889559K3686320Q667678
1440D89620984o049455j2764275j3639211j8923909l1408399l7317515k1752894L1550348
$$ plain form
1456.3 379315674 474489987 550325811 583320796 578067958 537172318 478924125 402736276
1470.6 402736276 305488139 240522608 239452451 274512112 320022851 354099810 365915298
1484.9 365915298 374354839 416644961 498518586 576049387 638051689 691575289 728353441
1499.1 728353441 748677671 760528445 769816577 779388905 785254717 787665367 789169550 790362358
1515.4 790362358 791553378 792548954 793772817 795516968 797000468 797451437 796814442 795671523 793987513
1533.8 793987513 792169929 789543092 784284413 777724087 771683216 764803469 756085217 743601263
1550.1 743601263 725903213 702449799 677440584 655359983 646966338 652132869 658960104 661027253
1566.4 661027253 651071191 626828909 602116227 588972092 596358716 613448799 616732240 598699450
$$ packed form
1456.3C79315674R5174313P5835824L2994985n252838m0895640n8248193p6187849
1470.6D02736276r7248137o4965531j070157L5059661M5510739L4076959J1815488
1484.9C65915298Q439541M2290122Q1873625P7530801O2002302N3523600L6778152
1499.1G28353441K0324230J1850774R288132R572328N865812K410650J504183J192808
1515.4G90362358J191020R95576J223863J744151J483500M50969o36995j142919j684010
1533.8G93987513j817584k626837n258679o560326o040871o879747q718252j2483954
1550.1G43601263j7698050k3453414k5009215k2080601q393645N166531O827235K067149
1566.4F61027253r956062k4242282k4712682j3144135P386624J7090083L283441j8032790
$$ plain form
1582.8 598699450 559869349 503751636 436824024 376397580 345500052 355027884 391004980
1597 391004980 421758831 423861623 405921608 405977756 449395895 522478342 591776550 640108407
1613.4 640108407 673175335 697189510 709963024 716341257 720911384 723764241 725142956 726327121
1629.7 726327121 728123426 730806828 734978437 739440382 743489981 747806132 752270937 757038414
1646 757038414 761832535 765281141 768577337 772680521 775305569 777175725 779172719 781390429 783578098
1664.3 783578098 785692990 788366020 791725755 794496953 796730995 799070001 801326454 803281724
1680.7 803281724 804871321 806644261 808626294 810415089 811879575 812834203 813407898 813909709 815346181
1699 815346181 818352222 821144581 823243201 824989796 825918972 826274872 826591611 827073395 827654481
$$ packed form
1582.8E98699450l8830101n6117713o6927612o0426444l0897528R527832L5977096
1597C91004980L0753851K102792j7940015N6148M3418139P3082447O9298208M8331857
1613.4F40108407L3066928K4014175J2773514O378233M570127K852857J378715J184165
1629.7G26327121J796305K683402M171609M461945M049599M316151M464805M767477
1646G57038414M794121L448606L296196M103184K625048J870156J996994K217710K187669
1664.3G83578098K114892K673030L359735K771198K234042K339006K256453J955270
1680.7H03281724J589597J772940J982033J788795J464486R54628N73695N01811J436472
1699H15346181L006041K792359K098620J746595R29176L55900L16739M81784N81086
$$ plain form
1717.4 827654481 828416467 829482377 830807626 832068205 832849026 833383381 834040105 834872901 835541308
1735.7 835541308 835839570 836069882 836502790 836882532 836934388 836919427 837208271 837631762 837594271 837079287
1756.1 837079287 836651385 836509407 836190701 835653722 835187614 834886611 834464848 833512723 832713068 832637131
1776.5 832637131 832901657 833093703 833262920 833779216 834662974 835312188 835199356 834685922 834616959 834798634
1796.9 834798634 834631503 834217429 834226131 834693849 835055590 835085571 835201740 835796237 836495340 836716771
1817.3 836716771 836534917 836422682 836375237 836002767 835219145 834318399 833758593 833389163 832695305 831988335
1837.7 831988335 831896245 832194686 832180202 831761003 831377566 831009865 830220580 828745246 827053368 825856209
1858.1 825856209 825294495 825037181 824968398 825213313 825753152 826233804 826296031 826094925 825947285 825752795
$$ packed form
1717.4H27654481P61986J065910J325249J260579P80821N34355O56724Q32796O68407
1735.7H35541308K98262K30312M32908L79742N1856j4961K88844M23491l7491n14984
1756.1H37079287m27902j41978l18706n36979m66108l01003m21763r52125p99655p5937
1776.5H32637131K64526J92046J69217N16296Q83758O49214j12832n13434o8963J81675
1796.9H34798634j67131m14074Q702M67718L61741K9981J16169N94497O99103K21431
1817.3H36716771j81854j12235m7445l72470p83622r00746n59806l69430o93858p06970
1837.7H31988335r2090K98441j4484m19199l83437l67701p89285j475334j691878j197159
1858.1H25856209n61714k57314o8783K44915N39839M80652O2227k01106j47640j94490
$$ plain form
1878.5 825752795 825176060 824366868 823780775 823412240 822819293 822075605 821832120 822327375 823159635 823756754
1898.9 823756754 824088812 824465334 824792981 824563682 823668838 822669506 822017848 821655989 821489036 821726441
1919.3 821726441 822468996 823428750 824152052 824570775 825073242 825787604 826325655 826469719 826589346 826981366
1939.7 826981366 827357948 827326000 827031910 826886296 826884449 826576173 825854421 825234532 825067699 825049996
1960.1 825049996 824776471 824401379 824327588 824512541 824496329 824203253 824082732 824267268 824269176 823788166
1980.5 823788166 823232710 823066235 823053718 822674394 821976066 821512818 821453571 821280658 820737302 820330262
2000.9 820330262 820496380 820864856 820810556 820418477 820313334 820657849 820962369 820929766 820818424 820811450
2021.3 820811450 820567548 819969237 819707334 820150912 820724428 820782900 820323825 819924116 819903731 819836617
$$ packed form
1878.5H25752795n76735q09192n86093l68535n92947p43688k43485M95255Q32260N97119
1898.9H23756754L32058L76522L27647k29299q94844r99332o51658l61859j66953K37405
1919.3H21726441P42555R59754P23302M18723N02467P14362N38051J44064J19627L92020
1939.7H26981366L76582l1948k94090j45614j847l08276p21752o19889j66833j7703
1960.1H25049996k73525l75092p3791J84953j6212k93076j20521J84536J908m81010
1980.5H23788166n55456j66475j2517l79324o98328m63248n9247j72913n43356m07040
2000.9H20330262J66118L68476n4300l92079j05143L44515L04520l2603j11342o974
2021.3H20811450k43902n98311k61903M43578N73516N8472m59075l99709k0385o7114
$$ plain form
2041.7 819836617 819288731 818575978 818203747 818013132 817482173 816608906 815936923 815645993 815241992 814383388
2062.1 814383388 813440979 812936723 812737703 812329769 811788499 811671257 812019944 812283754 812202871 812185764
2082.5 812185764 812577188 813034415 813035846 812689662 812558472 812713385 812606812 812009275 811429083 811311483
2102.9 811311483 811335146 810997725 810457766 810175836 810069561 809635162 808816075 808134735 807853162 807560742
2123.3 807560742 806851923 805993676 805450976 805083692 804400146 803434253 802755535 802572548 802407444 801885545
2143.7 801885545 801296175 800993145 800740302 800077319 799087405 798301637 797823966 797174811 796168864
2162 796168864 795268595 794841766 794639170 794284761 793905437 793883979 794169962 794280648 794042230 793844879
2182.4 793844879 793938339 793972075 793563068 792925775 792500913 792240560 791752875 790984929 790311038 789919078
$$ packed form
2041.7H19836617n47886p12753l72231j90615n30959q73267o71983k90930m04001q58604
2062.1H14383388r42409n04256j99020m07934n41270j17242L48687K63810q0883j7107
2082.5H12185764L91424M57227J431l46184j31190J54913j06573n97537n80192j17600
2102.9H11311483K3663l37421n39959k81930j06275m34399q19087o81340k81573k92420
2123.3H07560742p08819q58247n42700l67284o83546r65893o78718j82987j65104n21899
2143.7H01885545n89370l03030k52843o62983r89914p85768m77671o49155j005947
2162G96168864r00269m26829k02596l54409l79324k1458K85983J10686k38418j97351
2182.4G93844879R3460L3736m09007o37293m24862k60353m87685p67946o73891l91960
$$ plain form
2202.8 789919078 789493918 788763940 787977993 787495434 787177086 786602974 785807192 785239697 784997463 784666121
2223.2 784666121 784006059 783295631 782814145 782362819 781603932 780665934 779992461 779610872 779054403 778117955
2243.6 778117955 777104139 776201606 775118291 773604870 771991789 770804048 770101607 769536018 768949687
2262 768949687 768584192 768577993 768666208 768650115 768745482 769175708 769748330 770104945 770226538 770396709 770636201
2284.4 770636201 770565808 769983709 769139409 768255413 767145097 765554428 763651609 761803329 760034323
2302.7 760034323 758119047 756177127 754797697 754338503 754430115 754544318 754692614 755130470 755737901
2321.1 755737901 756166637 756382942 756663501 757122874 757511854 757598877 757503986 757413328 757204473 756581068
2341.5 756581068 755555153 754637599 754149377 753672540 752805233 751784027 751165092 750884593 750521660
$$ packed form
2202.8G89919078m25160p29978p85947m82559l18348n74112p95782n67495k42234l31342
2223.2G84666121o60062p10428m81486m51326p58887r37998o73473l81589n56469r36448
2243.6G78117955j013816r02533j083315j513421j613081j187741p02441n65589n86331
2262G68949687l65495o199Q8215j6093R5367M30226N72622L56615J21593J70171K39492
2284.4G70636201p0393n82099q44300q83996j110316j590669j902819j848280j769006
2302.7G60034323j915276j941920j379430m59194R1612J14203J48296M37856O07431
2321.1G55737901M28736K16305K80559M59373L88980Q7023r4891r0658k08855o23405
2341.5G56581068j025915r17554m88222m76837q67307j021206o18935k80499l62933
$$ plain form
2359.9 750521660 750122488 750026941 750223935 750448525 750688732 751227021 752183974 753273427 754190505 755087256
2380.2 755087256 756232679 757466793 758431613 759149253 759974182 761013687 761952817 762541533 762993336
2398.6 762993336 763626933 764316559 764709115 764851391 765139878 765682280 766158164 766381502 766593635 767004371
2419 767004371 767380178 767406762 767221510 767212033 767400444 767420232 767156005 766952634 767008185 767029524 766759455
2441.4 766759455 766447484 766433299 766573191 766476750 766129255 765899599 765936017 765906572 765532792 765051126
2461.8 765051126 764809728 764710009 764428794 764018655 763840377 763934374 763930559 763639748 763308585 763181865
2482.2 763181865 763099551 762775898 762314320 762047708 761973739 761745572 761249602 760800123 760594428 760351419
2502.6 760351419 759790599 759146214 758800864 758661091 758333683 757779062 757324100 757077634 756748438 756161332
$$ packed form
2359.9G50521660l99172r5547J96994K24590K40207N38289R56953J089453R17078Q96751
2380.2G55087256J145423J234114R64820P17640Q24929J039505R39130N88716M51803
2398.6G62993336O33597O89626L92556J42276K88487N42402M75884K23338K12133M10736
2419G67004371L75807K6584j85252r477J88411J9788k64227k03371N5551K1339k70069
2441.4G66759455l11971j4185J39892r6441l47495k29656L6418k9445l73780m81666
2461.8G65051126k41398r9719k81215m10139j78278R3997l815k90811l31163j26720
2482.2G63181865q2314l23653m61578k66612p3969k28167m95970m49479k05695k43009
2502.6G60351419n60820o44385l45350j39773l27408n54621m54962k46466l29196n87106
$$ plain form
2523 756161332 755646110 755544603 755598307 755312383 754688144 754110813 753685772 753106236 752182961 751192510
2543.4 751192510 750453532 749802291 748891890 747763097 746726096 745814681 744753480 743455172 742194772
2561.8 742194772 741159558 740097225 738699555 737096548 735626876 734286427 732791007 731155276
2578.1 731155276 729854345 729319453 729500830 730124176 731151760 732647538 734317839 735632241 736416459
2596.4 736416459 736953378 737427354 737605214 737280428 736696720 736212909 735782325 735131562 734309435 733657479
2616.8 733657479 733279765 732928932 732469022 732072353 731846333 731557846 730934143 730098724 729443908 729099631
2637.2 729099631 728794217 728302717 727759540 727336168 726854265 726043880 725021780 724106252 723298550
2655.6 723298550 722364366 721271992 720249295 719458580 718735814 717821956 716795564 715918362 715122640
$$ packed form
2523G56161332n15222j01507N3704k85924o24239n77331m25041n79536r23275r90451
2543.4G51192510p38978o51241r10401j128793j037001r11415j061201j298308j260400
2561.8G42194772j035214j062333j397670j603007j469672j340449j495420j635731
2578.1G31155276j300931n34892J81377O23346J027584J495778J670301J314402P84218
2596.4G36416459N36919M73976J77860l24786n83708m83811m30584o50763q22127o51956
2616.8G33657479l77714l50833m59910l96669k26020k88487o23703q35419o54816l44277
2637.2G29099631l05414m91500n43177m23372m81903q10385j022100r15528q07702
2655.6G23298550r34184j092374j022697p90715p22766r13858j026392q77202p95722
$$ plain form
2673.9 715122640 714121819 712900400 711657047 710440338 709109485 707606852 706098855 704741240
2690.3 704741240 703400850 701793611 699860632 697800517 695872724 694311440 693270802 692768633
2706.6 692768633 692618668 692426085 691846430 690917075 689911485 688942254 687928855 686833382 685792744
2724.9 685792744 684865057 683824539 682492673 680988729 679536939 678153992 676662743 675061703
2741.2 675061703 673585236 672365069 671266377 670114815 668959975 667922676 666902423 665668607
2757.6 665668607 664168119 662572682 661010683 659422219 657752514 656104267 654562116 652988970
2773.9 652988970 651207507 649332166 647578955 645879745 644014537 641959727 639881074 637782514
2790.2 637782514 635449171 632785559 629968643 627216280 624585390 622045994 619556248 617142797
$$ packed form
2673.9G15122640j000821j221419j243353j216709j330853j502633j507997j357615
2690.3G04741240j340390j607239j932979k060115j927793j561284j040638n02169
2706.6F92768633j49965j92583n79655r29355j005590r69231j013399j095473j040638
2724.9F85792744r27687j040518j331866j503944j451790j382947j491249j601040
2741.2F75061703j476467j220167j098692j151562j154840j037299j020253j233816
2757.6F65668607j500488j595437j561999j588464j669705j648247j542151j573146
2773.9F52988970j781463j875341j753211j699210j865208k054810k078653k098560
2790.2F37782514k333343k663612k816916k752363k630890k539396k489746k413451
$$ plain form
2806.5 617142797 614920735 612978458 611368418 610091150 608896255 607292831 604923427 601798773
2822.8 601798773 598203599 594487548 590855002 587177694 583033681 577921093 571431100 563640237
2839.1 563640237 555874586 550647736 549657226 552011847 555321455 557943583 559521973 560314953 560813189
2857.5 560813189 561483026 562342286 562897325 562650740 561431050 559189081 555796027 551063240 544885933
2875.9 544885933 537367880 528897882 520513117 513808489 509395719 505808115 501363814 496910393
2892.2 496910393 495291919 498039782 503619850 509112954 512693107 514319837 514990687 515740693 516991436
2910.5 516991436 518523037 519947529 521053612 521794915 522342503 523145735 524561107 526508391 528625906
2928.9 528625906 530614257 532449663 534194231 535867691 537716508 540043116 542667687 544979632
$$ packed form
2806.5F17142797k222062j942277j610040j277268j194895j603424k369404l124654
2822.8F01798773l595174l716051l632546l677308m144013n112588o489993p790863
2839.1E63640237p765651n226850r90510K354621L309608K622128J578390P92980M98236
2857.5E60813189O69837Q59260N55039k46585j219690k241969l393054m732787o177307
2875.9E44885933p518053q469998q384765o704628m412770l587604m444301m453421
2892.2D96910393j618474K747863N580068N493104L580153J626730O70850P50006J250743
2910.5E16991436J531601J424492J106083P41303N47588Q03232J415372J947284K117515
2928.9E28625906J988351J835406J744568J673460J848817K326608K624571K311945
$$ plain form
2945.2 544979632 546529293 547403693 548013270 548663020 549348295 549936295 550436378 550889254 551201701
2963.6 551201701 551260769 551120520 550917625 550554156 549784958 548566818 547086835 545529902 543932617
2981.9 543932617 542286873 540615141 538839340 536766946 534148395 530875385 527234674 523447692
2998.2 523447692 519497693 515719831 512836516 511539340 511961162 513305724 514213979 513636589 511532187
3016.6 511532187 508981228 507565200 508170784 510117412 511942148 513000309 513613582 514241755 514919102
3034.9 514919102 515584052 516587913 517878950 518576920 517883956 515786469 513018608 510377765 508262515
3053.3 508262515 506898642 506522715 507416189 509585500 512495279 515584648 518572927 521399915 524248362
3071.7 524248362 527416050 531223059 535639048 540058672 543863595 546812713 548981249 550667226
$$ packed form
2945.2E44979632J549661Q74400O09577O49750O85275N88000N00083M52876L12447
2963.6E51201701N9068j40249k02895l63469p69198j218140j479983j556933j597285
2981.9E43932617j645744j671732j775801k072394k618551l273010l640711l786982
2998.2E23447692l949999l777862k883315j297176M21822J344562R08255n77390k104402
3016.6E11532187k550959j416028O05584J946628J824736J058161O13273O28173O77347
3034.9E14919102O64950J003861J291037O97970o92964k097487k767861k640843k115250
3053.3E08262515j363873l75927Q93474K169311K909779L089369K988279K826988K848447
3071.7E24248362L167688L807009M415989M419624L804923K949118K168536J685977
$$ plain form
3088 550667226 551939189 552549243 552627504 552616775 552596033 552217722 551267028 550123572 549382567 549192905
3108.4 549192905 549279630 549570441 550157905 550836205 551340282 551583469 551636398 551666319 551695347 551561654
3128.8 551561654 551163912 550605059 550058722 549528897 548857749 547973335 547036171 546211720 545485795 544877291
3149.2 544877291 544411361 543910921 543180585 542279243 541397333 540585279 539733410 538769662 537728429
3167.5 537728429 536642194 535492301 534215808 532811522 531406641 530086458 528785229 527447581
3183.8 527447581 526141226 524921119 523705959 522390962 521004558 519671023 518454552 517325044
3200.1 517325044 516288877 515428603 514807343 514391959 514092982 513877511 513775468 513753176 513740480 513757348
3220.5 513757348 513848662 513981819 514078319 514142394 514310062 514585376 514654934 514413297 514166713 514093399
$$ packed form
3088E50667226J271963O10054P8261j0729k0742l78311r50694j143456p41005j89662
3108.4E49192905Q6725K90811N87464O78300N04077K43187N2929K9921K9028j33693
3128.8E51561654l97742n58853n46337n29825o71148q84414r37164q24451p25925o08504
3149.2E44877291m65930n00440p30336r01342q81910q12054q51869r63748j041233
3167.5E37728429j086235j149893j276493j404286j404881j320183j301229j337648
3183.8E27447581j306355j220107j215160j314997j386404j333535j216471j129508
3200.1E17325044j036167q60274o21260m15384k98977k15471j02043k2292j2696J6868
3220.5E13757348R1314J33157R6500O4075J67668K75314O9558k41637k46584p3314
$$ plain form
3240.9 514093399 514175892 514373422 514543414 514616549 514772296 515143335 515624106 516048729 516430199 516848981
3261.3 516848981 517237246 517537057 517837167 518099070 517915905 517067015 515831888 514488339 513128638
3279.7 513128638 511796415 510679126 510152698 510557473 512089014 514732778 518433154 523198962 528757453
3298 528757453 534626365 540527165 546276689 551462948 555728793 559201181 562345445 565450907 568368495
3316.4 568368495 570888519 573060215 575050473 576819003 578048229 578708172 579198122 579689205 580067635
3334.8 580067635 580238521 580051780 579524517 578820109 577900887 576889694 576035798 575042546 573560536
3353.1 573560536 571857810 570294201 568887115 567400277 565758109 564245641 562886715 561271310
3369.4 561271310 559179366 556963921 555059850 553415537 551807225 550126612 548466921 547039390
$$ packed form
3240.9E14093399Q2493J97530J69992P3135J55747L71039M80771M24623L81470M18782
3261.3E16848981L88265K99811L00110K61903j83165q48890j235127j343549j359701
3279.7E13128638j332223j117289n26428M04775J531541K643764L700376M765808N558491
3298E28757453N868912N900800N749524N186259M265845L472388L144264L105462K917588
3316.4E68368495K520024K171696J990258J768530J229226O59943M89950M91083L78430
3334.8E80067635J70886j86741n27263p04408r19222j011193q53896r93252j482010
3353.1E73560536j702726j563609j407086j486838j642168j512468j358926j615405
3369.4E61271310k091944k215445j904071j644313j608312j680613j659691j427531
$$ plain form
3385.7 547039390 545914114 545008898 543995202 542643845 541339874 540540993 539986789 539033592 537746489
3404.1 537746489 536809862 536318421 535884738 535427511 534999311 534631252 534478068 534559429 534766376 535155296
3424.5 535155296 535817981 536712766 537693739 538808525 540111959 541269004 542141378 543130577 544518232
3442.9 544518232 546170175 547923625 549766183 551751137 553850174 556004643 558300853 560770750
3459.2 560770750 563149869 565427959 568002701 570834935 573355675 575367451 577366471 579735458
3475.5 579735458 582436502 585121512 587419868 589632690 592186451 594817817 597227275 599599004
3491.8 599599004 602141142 604824603 607412517 609827399 612260818 614682078 616972208 619285524
3508.1 619285524 621785939 624462903 627081573 629432023 631660044 634035349 636631846 639092147
$$ packed form
3385.7E47039390j125276r05216j013696j351357j303971p98881n54204r53197j287103
3404.1E37746489r36627m91441m33683m57227m28200l68059j53184Q1361K06947L88920
3424.5E35155296O62685Q94785R80973J114786J303434J157045Q72374R89199J387655
3442.9E44518232J651943J753450J842558J984954K099037K154469K296210K469897
3459.2E60770750K379119K278090K574742K832234K520740K011776J999020K368987
3475.5E79735458K701044K685010K298356K212822K553761K631366K409458K371729
3491.8E99599004K542138K683461K587914K414882K433419K421260K290130K313316
3508.1F19285524K500415K676964K618670K350450K228021K375305K596497K460301
$$ plain form
3524.4 639092147 641166329 643225789 645578027 648085237 650561988 652882576 655036330 657316804
3540.8 657316804 659774542 662032247 663945556 665838540 667884767 669921219 671886027 673906207
3557.1 673906207 676063180 678206801 680018127 681567311 683525801 685959458 688149452 690038860
3573.4 690038860 692029238 694215119 696462035 698712468 700868607 702768147 704520881 706538975
3589.7 706538975 708704591 710748553 712785661 714959741 717110813 719125688 721028268 722692609
3606 722692609 724236727 725973189 727846563 729707599 731372952 732888281 734664023 736494124 737894654
3624.4 737894654 738739789 739363432 740561724 742006123 743132532 743968785 744601548 745058656 745292842
3642.7 745292842 745118141 744267583 742896676 741830945 741175413 740587354 740727007 742306828 744736493
$$ packed form
3524.4F39092147K074182K059460K352238K507210K476751K320588K153754K280474
3540.8F57316804K457738K257705J913309J892984K046227K036452J964808K020180
3557.1F73906207K156973K143621J811326J549184J958490K433657K189994J889408
3573.4F90038860J990378K185881K246916K250433K156139J899540J752734K018094
3589.7G06538975K165616K043962K037108K174080K151072K014875J902580J664341
3606G22692609J544118J736462J873374J861036J665353J515329J775742J830101J400530
3624.4G37894654Q45135O23643J198292J444399J126409Q36253O32763M57108K34186
3642.7G45292842j74701q50558j370907j065731o55532n88059J39653J579821K429665
$$ plain form
3661.1 744736493 747460842 750255764 752797902 755197287 757990897 761065662 764737129 768793762
3677.4 768793762 772118270 774764955 776936591 778636098 779873431 780653596 781314194 782144010 782871485
3695.8 782871485 783219576 783211648 783174455 783425212 783695698 783645630 783304691 783122003 783540070 784099042
3716.2 784099042 784346700 784345150 784239173 784088671 784070849 784279406 784370005 784023702 783426821 783279657
3736.5 783279657 783677220 783874810 783254325 782230914 782084048 782129586 781661808 781609952 782073975 782322824
3756.9 782322824 782253504 782247663 782260358 782114506 781969428 781779945 781609893 781678319 781806350 781746268 781415701
3779.4 781415701 781070411 780865371 780699432 780572534 780459106 780363321 780224621 779906392 779543757 779077828
3799.8 779077828 778600752 778623223 778555334 778229892 778256416 778383672 778089345 777459443 777083337 776665211
$$ packed form
3661.1G44736493K724349K794922K542138K399385K793610L074765L671467M056633
3677.4G68793762L324508K646685K171636J699507J237333P80165O60598Q29816P27475
3695.8G82871485L48091p928l7193K50757K70486n0068l40939j82688M18067N58972
3716.2G84099042K47658j550j05977j50502j7822K08557R0599l46303n96881j47164
3736.5G83279657L97563J97590o20485j023411j46866M5538m67778n1856M64023K48849
3756.9G82322824o9320n841J2695j45852j45078j89483j70052O8426J28031o0082l30567
3779.4G81415701l45290k05040j65939j26898j13428r5785j38700l18229l62635m65929
3799.8G79077828m77076K2471o7889l25442K6524J27256k94327o29902l76106m18126
$$ plain form
3820.2 776665211 776253581 776312113 776372612 776326180 776179373 775889814 775661826 775236130 774487376 774101257
3840.6 774101257 774148941 774317205 774544358 774645329 774166167 772744238 771878362 772382796 772918344 772925198
3861 772925198 772460818 772047818 771886408 771477818 771078587 771060646 771119654 771065414 770680964 770329356
3881.4 770329356 770318270 770240188 770205319 770166934 769901514 769766629 769773066 769510031 768929780 768350542 768049419
3903.8 768049419 768135071 768383682 768440723 768314183 768109083 767770648 767480969 767424464 767385304 767207563
3924.2 767207563 767065048 766997933 766831279 766688764 766782641 766935229 766985118 766980052 766965330 766984105 766958475
3946.6 766958475 766864538 766849756 766929209 766977191 766926050 766840756 766775668 766730964 766712725 766700327 766695917 766690373
3971.1 766690373 766608953 766475737 766397715 766350806 766287625 766235471 766153872 765996516 765775979 765554845 765453815
$$ packed form
3820.2G76665211m11630N8532O0499m6432j46807k89559k27988m25696p48754l86119
3840.6G74101257M7684J68264K27153J00971m79162j421929q65876N04434N35548O854
3861G72925198m64380m13000j61410m08590l99231j7941N9008n4240l84450l51608
3881.4G70329356j1086p8082l4869l8385k65420j34885O437k63035n80251n79238l01123
3903.8G68049419Q5652K48611N7041j26540k05100l38435k89679n6505l9160j77741
3924.2G67207563j42515o7115j66654j42515R3877J52588M9889n066j4722J8775k5630
3946.6G66958475r3937j4782P9453M7982n1141q5294o5088m4704j8239j2398m410n544
3971.1G66690373q1420j33216p8022m6909o3181n2154q1599j57356k20537k21134j01030
$$ plain form
3993.5 765453815 765448093 765403211
3997.6 765403211
$$ packed form
3993.5G65453815n722m4882
3997.6G65403211
##END=$$ End of the data block
