##TITLE=G1-Zn(bpa)2-2 $$ Begin of the data block
##JCAMP-DX=5.00 $$ ACD/SpecManager v 10.08
##SPECTROMETER/DATA SYSTEM=Alpha
##DATE=16 Apr 2015 08:31:26
##DATA TYPE=INFRARED SPECTRUM
##DATA CLASS=XYDATA
##ORIGIN=
##OWNER=
##NPOINTS=1765
##FIRSTX=399.76428223
##LASTX=3997.64306641
##MAXX=3997.64306641
##MINX=399.76428223
##MAXY=0.87975341
##MINY=0.57053274
##XFACTOR=1.0000000000
##YFACTOR=1.000000000000000e-9
##FIRSTY=0.83137596
##DELTAX=2.03961372
##XUNITS=1/CM
##YUNITS=ARBITRARY UNITS
##XYDATA=(X++(Y..Y))
399.8H31375957N02347M08292R22799m53710l145814n047798o560922q765638r662628
418.1G99572885j260281J0913015J3861596Q513987K717495J421929J301706j54615
434.4H36887717r77993K71559P59184j062214k379477j416802q08657k153217l063262
452.8H26056838j572490Q4520o98388l281951m915774m632294l989398k418042K342582
471.2H06975603P045448O142795K599597J491487K532125K795636J206696j4126O88016
489.5H31463277J470149K38418j366734r77039k90037j859009m352450n414844n630791
507.9H13280940n232155k638161K049326N787552N842030K907574R02295J277149J677453
526.2H25854003M18485o13690K56062J323521N49316p91609n02348M75884j11819j660526
$$ plain form
399.8 831375957 831878304 832286596 833209395 832755685 829609871 824562073 818001151 809235513 799572885
418.1 799572885 798312604 809225619 823087215 831601202 834318697 835740626 837042332 836887717
434.4 836887717 835909724 836181283 836940467 835878253 833498776 832081974 831273317 829120100 826056838
452.8 826056838 824484348 824568868 823870480 820588529 815672755 811040461 807051063 804633021 806975603
471.2 806975603 814021051 820163846 822763443 824254930 826787055 829582691 830789387 830775261 831463277
489.5 831463277 832933426 833171844 831805110 830828071 830538034 828679025 824326575 818911731 813280940
507.9 813280940 808048785 805410624 807459950 813247502 819089532 821997106 822899401 824176550 825854003
526.2 825854003 826272488 825658798 825914860 827238381 827787697 826996088 826493740 826969624 826857805 825197279
546.6H25197279j780271p12991j129448l321708l875732j557350q74817n425811j2991190
565G93527961j7466307j0500729O429613J7203092J5315891R066164M283488J639783
581.3H19498956J415611K394258K102197M60326j74224Q73506J432598L54707p37310
599.6H27620625m78446M5478m82618r34184J88649J631975J309097j59324m57942O45339
620H28928649J022816o5207r36449p38561j084685l049434n422592p042348r387434
638.4H02224755j2845576r819984L673434J4938772J4328063Q729457N540014M716873
654.7H31485808L782153J861870M14312O17802J163304N50032n95927J41441J253844
673.1H40674639J040339k45213n62072O56485J174033p450q75533r7513O77347j32501
$$ plain form
546.6 825197279 823417008 822704017 821574569 818252861 814377129 812819779 811944962 806519151 793527961
565 793527961 776061654 765560925 771990538 789193630 804509521 813575685 817859173 819498956
581.3 819498956 820914567 823308825 825411022 825871348 825697124 826570630 828003228 828357935 827620625
599.6 827620625 827142179 827187657 826705039 825770855 825959504 827591479 828900576 828741252 828283310 828928649
620 828928649 829951465 829886258 828949809 828211248 827126563 824077129 818654537 811612189 802224755
638.4 802224755 789379179 779559195 783232629 798171401 812499464 821228921 826768935 831485808
654.7 831485808 835267961 837129831 837544143 838161945 839325249 839875281 839279354 839420795 840674639
673.1 840674639 841714978 841469765 840907693 841564178 842738211 842730761 841855228 841757715 842435062 842302561
693.5H42302561j150668o44505L52621r7513j352966j414299m53532n36382k076506
711.8H34928811l298164l642559m935801p952630r802521q390665o810724r141028
728.1G80954719j5539229k0935834j9171595j0430515L912031K1264196K7543127J4023483
744.5G81620383r272516l2018542n1511347n7385385l2762766J4313102M8127234M7541082
760.8G08651245K6140093O643773j323522K494991J2004435J7808676J6122639J0171175
777.1G98713505M059375L55482Q71241M652858P626772O854534L822684J933992J953244
795.4H30843687J756072L43204p43270o27101q19862k092957k289653o4433K603651
813.8H28909338L178000J752079O87599R07004P80701l56853q94427k8730O22452j76072
$$ plain form
693.5 842302561 841151893 840507388 840860009 840762496 839409530 837995231 837541699 837005317 834928811
711.8 834928811 831630647 827988088 823052287 815099657 805297136 796906471 790095747 780954719
728.1 780954719 765415490 744479656 725308061 714877546 718789577 740053773 767596900 781620383
744.5 781620383 772347867 740329325 688817978 631432593 598669827 612982929 661110163 708651245
760.8 708651245 734791338 741435111 740111589 742606580 754611015 772419691 788542330 798713505
777.1 798713505 802772880 803128362 803999603 808652461 816279233 823133767 826956451 828890443 830843687
795.4 830843687 832599759 832942963 832199693 831572592 830752730 828659773 826370120 826305687 828909338
813.8 828909338 832087338 833839417 834527016 835434020 836214721 835857868 834963441 834934711 835557163 835381091
834.2H35381091j024664n15640L1949j212240l301143l950715k913833j618266o61791
852.6H20214748M12107J284182M87745k263189n037546o305575o587803o909729p553219
870.9G87741721p727444n061389P38621M538000L974557L933847L955245l075898j5799463
889.3G73217797k4017930j9524812m213274J0037363J4557659J1239708N728304J145721
905.6G68170536k111495l847420k025724N264759J5077591K0578504J8381059J1700392
921.9H31188202O007612L632307K756178J437724O32405J542687K895236K990127K095223
940.3H55177701J698672K230227K395928J298547j10149o74487q45670j275420j550794
958.6H58344555j286566o80566j61350K93911J157105K056956J802683K46942j187802
$$ plain form
834.2 835381091 834356427 833840787 833872736 832660496 829359353 825408638 822494805 820876539 820214748
852.6 820214748 820626855 821911037 822398782 820135593 815098047 808792472 802204669 795294940 787741721
870.9 787741721 780014277 774952888 775691509 780229509 784204066 788137913 792093158 789017260 773217797
889.3 773217797 749199867 729675055 725461781 735499144 750056803 761296511 767024815 768170536
905.6 768170536 766059041 762211621 760185897 765450656 780528247 801106751 819487810 831188202
921.9 831188202 837195814 840828121 843584299 845022023 845654428 847197115 850092351 853082478 855177701
940.3 855177701 856876373 859106600 861502528 862801075 862690926 862016439 861170769 859895349 858344555
958.6 858344555 857057989 856377423 856216073 856509984 857667089 859724045 861526728 861773670 860585868
977H60585868j391112j227320k165734l932834n348623o959677j0184765j3078928
993.3H16296875j0692596l185451J732111N5850k758682k416730k305150n028844n974770
1011.6G85722613N50330J0867834J4538288J0457397O838202N477548J953363m979610
1028H31425965j1446059r248257L187597J3266862J2201428O173313J885712j303196
1044.3H46143365m958034r216368j5209913j9179702q383810J2434065J7929077O869793
1060.6H26428473j685023l941179o226480j0754227j2849152m858971R857655J7326355
1076.9H13297451J3575494O525814J829923O7591l57806q51512j073957j45018J143396
1095.3H34011376P54774k138258m841446k937436J925051L740012K618850K101779
$$ plain form
977 860585868 859194756 857967436 855801702 851868868 846520245 839560568 829375803 816296875
993.3 816296875 805604279 802418828 804150939 804206789 801448107 799031377 796726227 791697383 785722613
1011.6 785722613 786272943 797140777 811679065 822136462 828974664 834452212 836405575 831425965
1028 831425965 819979906 810731649 813919246 827186108 839387536 845560849 847446561 846143365
1044.3 846143365 841185331 831968963 816759050 797579348 789195538 801629603 819558680 826428473
1060.6 826428473 824743450 820802271 814575791 803821564 790972412 786113441 795971096 813297451
1076.9 813297451 826872945 833398759 835228682 835296273 834938467 834086955 833012998 832867980 834011376
1095.3 834011376 834766150 832627892 827786446 824849010 826774061 830514073 833132923 835234702
1111.6H35234702K128183J489401M78208J81139Q40664J503050J697183K182007L299594
1129.9H49034131L731310K513111O65128j057565l638447p448077j1594057j3238430
1146.3H18967104r512842l727019J881183Q662223J1718333R759248Q711040Q345305
1162.6H54804575N995453L140271J059591j42395j78576K73586r001j050889j903594
1180.9H61989021k449095l284156l560245j502514K374708M763961L847659J670837
1197.3H63850176O36340N11407j5735r48131j256168q38340q16047j600206k090037
1215.6H57433259j566767r84550j324415k258122k837300k454639j327514q5295Q24690
1234H45419347R91643L1173j709759l258944m345298n563795o463111n196988j992107
$$ plain form
1111.6 835234702 837362885 838852286 839330494 839511633 840352297 841855347 843552530 845734537 849034131
1129.9 849034131 852765441 855278552 855943680 854886115 851247668 843799591 832205534 818967104
1146.3 818967104 809454262 805727243 807608426 816270649 827988982 837748230 846459270 854804575
1162.6 854804575 860800028 863940299 864999890 864857495 864678919 864952505 864943504 863892615 861989021
1180.9 861989021 859539926 856255770 852695525 851193011 853567719 858331680 862179339 863850176
1197.3 863850176 864486516 864997923 864982188 864034057 862777889 861939549 861123502 859523296 857433259
1215.6 857433259 855866492 854881942 853557527 851299405 848462105 846007466 844679952 844594657 845419347
1234 845419347 846410990 846442163 844732404 841473460 837128162 831564367 825101256 819904268 817912161
1252.3H17912161M292p27952k539873l663897l735543l784656n156517p227779q334100
1270.7G82746136q553564r334207j1402130j4336467j7533243k0577490k2732317k2085548
1287F56191170j7279506j1854410j1621236j5627802j5117288k913594J9017160M0305615
1303.3F41100109M9937248M5488536L2711685J8756509O668687n637587j8122076j9632519
1319.6G51270592j478016K1823525L0860722K4720133J4971435Q761883N573630L403604
1336H59907508J796484J240075J345515R64701k3663r55761j385092k144575m200519
1354.3H56544673o817519p893801p717073p702708n464077j579642p29621j248121
1370.6H17392111K722800R499669J0936439P133245L109932O99163N12004J480937
$$ plain form
1252.3 817912161 817916453 817188501 814648628 810984731 807249188 803464532 798308015 791080236 782746136
1270.7 782746136 774192572 764858365 753456235 739119768 721586525 701009035 678276718 656191170
1287 656191170 638911664 627057254 615436018 599808216 584690928 581777334 600794494 641100109
1303.3 641100109 691037357 736525893 769237578 787994087 794662774 789025187 770903111 751270592
1319.6 751270592 749792576 771616101 802476823 827196956 842168391 850930274 856503904 859907508
1336 859907508 861703992 862944067 864289582 865254283 865230620 864274859 862889767 860745192 856544673
1354.3 856544673 849727154 841833353 834116280 826413572 820949495 819369853 818640232 817392111
1370.6 817392111 820114911 829614580 840551019 847684264 850794196 851493359 852005363 853486300
1386.9H53486300J314342j38045j413882j834333j913487k430857k876043l054202
1403.3H41139793l652453m811406p037521j0394394j4078617j7860711k3173749k3971856
1419.6G36159086r111941M803896N353511l372491j2146592j2170553j416087J3142526
1435.9G21241355J9227982R873092m78506n732656o443858r838224k0129919k7405500
1452.2F80313766j8968999J5767395N6339264M2270899J4896810n726755k2351324
1466.5G62541056l1692207m6996296o7620813m5699001P078588L7637890M3640017
1480.8F58889234K9776752O154835l152311J5434564L9972961L7445128K6618778J9927204
1497.1H31067145J2440026O792068L870011K224743J838148J968026J383304N08130
$$ plain form
1386.9 853486300 854800642 854662597 853248715 851414382 849500895 847070038 844193995 841139793
1403.3 841139793 837487340 832675934 825638413 815244019 801165402 783304691 760130942 736159086
1419.6 736159086 727047145 731851041 737204552 733832061 721685469 709514916 708098829 721241355
1435.9 721241355 740469337 750342429 749863923 744131267 737687409 727849185 707719266 680313766
1452.2 680313766 661344767 677112162 733451426 775722325 790619135 784892380 762541056
1466.5 762541056 730848849 683852553 616231740 570532739 577611327 615249217 658889234
1480.8 658889234 688665986 694820821 691668510 707103074 747076035 784521163 811139941 831067145
1497.1 831067145 843507171 850299239 854169250 856393993 858232141 860200167 861583471 862091601
1513.4H62091601n51403q09014k05874N14984O98984M51624N20110L34561m67896j097262
1533.8H61480415q47280j091480k090037k145887j398503j319767k294719m365682
1550.1H45927060o773591r253204j0345757r275377j908004M414558N103767L027022
1566.4H20916474k516568r400487j1601925q975327l97682O836534K315104p723749
1582.8G89452374j8575132k9020607l7576497l6480606j8839538Q489073K5817215
1597F83266282J9764125k415299j7899394o350577K1735370L7529052L1159162J7450750
1613.4G84239471Q853435M948378K103806L13997l84212n07474o65128n94914j41382
1631.7G98165977N15044K007127L066599K863526K789974K756656L257453L872812
$$ plain form
1513.4 862091601 861540198 860731184 860525310 861040294 861739278 862190902 862711012 863045573 862577677 861480415
1533.8 861480415 860633135 859541655 857451618 855305731 853907228 852587461 850292742 845927060
1550.1 845927060 839153469 829900265 819554508 810279131 808371127 812785685 817889452 820916474
1566.4 820916474 818399906 808999419 797397494 788422167 788024485 794861019 797176123 789452374
1582.8 789452374 770877242 741856635 704280138 667799532 648959994 657449067 683266282
1597 683266282 703030407 700615108 682715714 676365137 698100507 735629559 766788721 784239471
1613.4 784239471 793092906 798041284 800145090 800459087 800074875 799567401 798902273 798307359 798165977
1631.7 798165977 798681021 800688148 803754747 806618273 809408247 812164903 815422356 819295168
1648H19295168K781629K669573M497588L420293K094746J921117K214194K229988J606763
1666.4H42731059J550316K293051K181232J799762J928806J701713J127422P20799
1682.7H56034160J393735J919508J527309J124263M44293j63197k01225O56187K002120
1701.1H64737153J880229J299858J180112O71744J28627j03175j27078K71380Q83818
1719.4H70822668R30905P87676N87046K17736L4392R5009M39942P27117M22955L41713
1739.8H75407159M77255K99990K0623L7491M50910P18653L15666n7220M291L1889n1678
1762.2H77655029j0013l4452j71423m10557l93569J65582M03166J61349k6941J46806
1782.6H77484977M79818M97520J4126l64959l1054L24130M7266k61187m7803L70621
$$ plain form
1648 819295168 822076797 824746370 829243958 832664251 834758997 836680114 838894308 841124296 842731059
1666.4 842731059 844281375 846574426 848755658 850555420 852484226 854185939 855313361 856034160
1682.7 856034160 857427895 859347403 860874712 861998975 862443268 862280071 862078846 862735033 864737153
1701.1 864737153 866617382 867917240 869097352 869769096 869897723 869794548 869667470 869938850 870822668
1719.4 870822668 871753573 872541249 873128295 873346031 873380423 873475432 873915374 874642491 875065446 875407159
1739.8 875407159 875884414 876184404 876205027 876242518 876693428 877412081 877727747 877670527 877674818 877706707 877655029
1762.2 877655029 877645016 877610564 877439141 877028584 876635015 876800597 877203763 877365112 877338171 877484977
1782.6 877484977 877964795 878462315 878476441 878111482 878080428 878404558 878451824 878190637 878142834 878513455
1803H78513455K85685o7412q2910K84671M46380J73628j2756J18196R4474k62439m85957
1825.5H79005015l45469q2373M0531j80364l15785o7473M6313k28584k87473J67608
1845.9H77751946L10183n7995m41969n28514m60208n20229n24640k13146J09732L7193
1866.3H75462353q1658K18093M60983K76148j19627l50117k33770n9724j74105m60684
1886.7H74937892m86553j10209J09911J5617Q8155L30210L62098R1374j61886j64330
1907.1H75012279j10448k73645n42938n24819r0361K75791J52707J19388M12106M63546
1927.5H74893606J61230p4744L5167K20239R9301j79290j68264J16706J31428j44065
1947.9H75091314k61306j69099j51157l03626l47078j28806M3571r2685k89559j40012
$$ plain form
1803 878513455 878799140 878731728 878648818 878933489 879379869 879553497 879540741 879658937 879753411 879490972 879005015
1825.5 879005015 878659546 878577173 878617704 878437340 878121555 878054082 878100395 877871811 877584338 877751946
1845.9 877751946 878062129 878004134 877562165 877033651 876573443 876053214 875528574 875315428 875425160 875462353
1866.3 875462353 875380695 875598788 876059771 876335919 876216292 875866175 875632405 875572681 875398576 874937892
1886.7 874937892 874451339 874341130 874451041 874466658 874554813 874885023 875247121 875338495 875176609 875012279
1907.1 875012279 874901831 874628186 874085248 873560429 873470068 873745859 873898566 874017954 874430060 874893606
1927.5 874893606 875054836 874980092 875015259 875235498 875334799 875155509 874987245 875103951 875235379 875091314
1947.9 875091314 874830008 874660909 874509752 874206126 873859048 873730242 873773813 873681128 873391569 873251557
1968.3H73251557J52707J41204q1182j66356o6042k5153j55092k64823k04027j32203
1988.7H72450590k17795l14951k36333j04844j01388k00092j69039M8458J40965n4776
2009H71240795k32697q6307J39355Q9169j39058k97904m18901l85344L7908M04716
2029.4H70351732L84509K18332j4603j92583j34050o497p9811k42889k10643m8876
2049.8H70024621p8797k98560l46183j47105n3703k41638l98337k48135l4570q8036
2070.2H68089557k25663j16587J25587J49786j3768J1563K22325K30551j0610j26540
2090.6H68336201K5868J29044m4942k31623j43469M1068J9550j40726j42932j0968
2111H67837071k6106k01703k67922j25111k1219j33931k68102k15113j10865j76430
$$ plain form
1968.3 873251557 873404264 873545468 873464286 873297930 873231888 873206735 873051643 872786820 872582793 872450590
1988.7 872450590 872232795 871917844 871681511 871576667 871475279 871275187 871106148 871154606 871295571 871240795
2009 871240795 871008098 870921791 871061146 871150315 871011257 870713353 870294452 869909108 869947016 870351732
2029.4 870351732 870736241 870954573 870939970 870747387 870613337 870606840 870527029 870284140 870073497 870024621
2049.8 870024621 869945824 869647264 869301081 869153976 869100273 868858635 868460298 868212163 868177593 868089557
2070.2 868089557 867863894 867747307 867872894 868022680 868008912 868020475 868242800 868473351 868462741 868336201
2090.6 868336201 868362069 868491113 868446171 868214548 868071079 868112147 868131697 867990971 867848039 867837071
2111 867837071 867810965 867609262 867341340 867216229 867195010 867061079 866792977 866577864 866466999 866290569
2131.4H66290569l16858k66492p9155m0531j48714j60217l6121j430j53065k94209
2151.8H64793777k44200j52230k39551l77476l25501j70231j63138k70844k00569N2988
2172.2H62703025J75119P4267m9949r894Q0824J2875j23144j46091o4492m9472j84059
2194.6H62419009k78652j88529r3698j63615k53678j88887q3565j41979k90453k87652
2215H60448301j43826r3877j90616k33591j15871m2081j63019k73704j98126j01745
2235.4H58891845j71066k86042k18869n9962j05321l36588m60386l73781k75015k67447
2255.8H56337368j91271L6657J98782R6917q5712m9710J25050J07050q3327j14083
2276.2H56377721J7881L8386p3195j35720q2552l8505j43051k98381l02255j91808
$$ plain form
2131.4 866290569 865973711 865707219 865628064 865587533 865438819 865278602 865242481 865241051 865087986 864793777
2151.8 864793777 864549577 864397347 864157796 863780320 863454819 863284588 863121450 862850606 862650037 862703025
2172.2 862703025 862878144 862952411 862902462 862892568 862973392 862986267 862863123 862717032 862652540 862603068 862419009
2194.6 862419009 862140357 861951828 861858130 861694515 861440837 861251950 861168385 861026406 860735953 860448301
2215 860448301 860304475 860210598 860019982 859786391 859670520 859628439 859465420 859191716 858993590 858891845
2235.4 858891845 858720779 858434737 858215868 858155906 858050585 857713997 857253611 856879830 856604815 856337368
2255.8 856337368 856146097 856182754 856381536 856478453 856392741 856343031 856468081 856575131 856491804 856377721
2276.2 856377721 856395602 856433988 856360793 856225073 856142521 856104016 855960965 855662584 855360329 855168521
2296.6H55168521k17259l88562m61698l90887l34621k99215j36971R8526J96278R1613
2317H53325725p6116j20043m8399m9532j37925j07050M530o258j51337k65359j83881
2339.5H52184355l7312L1352J3292j02878j80662k21550l26157l38077j46687j729
2359.9H50873947L7968O3002J21892K09629K39015J82927J55866K35796K85029K16365
2380.2H52621436J51992J76012J92643J11341J2040K1756Q3506M4882n8651o7710K1100
2402.7H53310347K4557j07885j65641n8711L7015Q702m3332j5021K4438l5345j44065
2425.1H52835059j50859n8115l7193j14620j36852o2168j7702r3818j69694q8871J5020
2447.6H51920187m5299j41323r3460L636l2067j61231k01463j09852m4822j05203j54853
$$ plain form
2296.6 855168521 854951262 854562700 854101002 853710115 853375494 853076279 852939308 853037834 853234112 853325725
2317 853325725 853249609 853129566 853081167 853031635 852893710 852786660 852791190 852784932 852633595 852368236 852184355
2339.5 852184355 852147043 852178395 852191687 852088809 851908147 851686597 851360440 851022363 850875676 850873947
2359.9 850873947 850911915 850974917 851096809 851306438 851545453 851728380 851884246 852120042 852405071 852621436
2380.2 852621436 852773428 852949440 853142083 853253424 853265464 853287220 853370726 853415608 853356957 853289247 853310347
2402.7 853310347 853334904 853227019 853061378 853002667 853039682 853048384 853005052 852990031 853014469 852979124 852835059
2425.1 852835059 852684200 852626085 852588892 852474272 852337420 852275252 852257550 852163732 851994038 851905167 851920187
2447.6 851920187 851874888 851733565 851640105 851643741 851611674 851450443 851248980 851139128 851094306 850989103 850834250
2470H50834250p0214L2664j8359j38521j29282n2929p8023j57356j39356m9650m4763
2492.4H49988461j17898j55211j47223j43409j85847k19584j78814j19805j16170j78635
2512.8H48425865j96814j22905j02282j78635j99258j00911J431L755q2195j56105
2533.2H47291946j78575k15054k70128k84552k55764k50697l14534l76820l62397l45468
2553.6H44437957l96967m53711m43995l87787l96252m97580n78642n86927n70952o01709
2574H39523435o65784o51837n30183l59476j24991J95444N16951P17700P04467N34713
2594.4H39860439L77536K45631P0512r3877j73211k27869l44157m52578m40836l46184
2614.8H38475406k89857l10838l04997j93954j00434j47819k66254l19243k71976k31564
$$ plain form
2470 850834250 850764036 850796700 850778341 850639820 850510538 850457609 850379586 850222230 850082874 850033224 849988461
2492.4 849988461 849870563 849715352 849568129 849424720 849238873 849019289 848840475 848720670 848604500 848425865
2512.8 848425865 848229051 848106146 848003864 847825229 847625971 847525060 847526491 847530246 847448051 847291946
2533.2 847291946 847113371 846898317 846628189 846343637 846087873 845837176 845522642 845145822 844783425 844437957
2553.6 844437957 844040990 843587279 843143284 842755497 842359245 841861665 841283023 840696096 840125144 839523435
2574 839523435 838857651 838205814 837675631 837316155 837191164 837386608 837903559 838621259 839325726 839860439
2594.4 839860439 840237975 840483606 840554118 840460241 840287030 840059161 839715004 839262426 838821590 838475406
2614.8 838475406 838185549 837874711 837569714 837375760 837275326 837127507 836861253 836542010 836270034 836038470
2635.2H36038470k51591k56836k25127k21908k80857l50058l68655l58641m01855m69565
2655.6H32853377m59492m13657m10020m14312l70323l13223l24249m01437m40956l90529
2676H28915179l72529m93467o44028o66976n91457n59688o08861o56009o75440p49886
2696.4H22896838q89599r41098p21037l20912o8485n9784j68443l01241m25339n22733
2716.8H18478167n16593m33624l99411m09603m84645o16551o66082o48379o38068o57379
2737.2H13007832p05004p05123o47009n86390n39482n03361n23746n83529n79417n60641
2757.6H07074130o41764p86841q53061q03352p50720p51674p44224p07507p62701q77082
2778G99395204r06289q92103q78930q36432q13305r08375j066566j167654j219333
$$ plain form
2635.2 836038470 835786879 835530043 835304916 835083008 834802151 834452093 834083438 833724797 833322942 832853377
2655.6 832853377 832393885 831980228 831570208 831155896 830785573 830472350 830148101 829746664 829305708 828915179
2676 828915179 828542650 828049183 827405155 826738179 826146722 825587034 824978173 824322164 823646724 822896838
2696.4 822896838 822007239 821066141 820345104 820024192 819955707 819895923 819727480 819426239 819000900 818478167
2716.8 818478167 817961574 817527950 817128539 816718936 816234291 815617740 814951658 814303279 813665211 813007832
2737.2 813007832 812302828 811597705 810950696 810364306 809824824 809321463 808797717 808214188 807634771 807074130
2757.6 807074130 806432366 805645525 804792464 803989112 803238392 802486718 801742494 801034987 800272286 799395204
2778 799395204 798488915 797596812 796717882 795881450 795068145 794159770 793093204 791925550 790706217
2796.3G90706217j257360j253545j171529j132727j170576j110792r70185q28027o85871
2814.7G81125605o60121q28445j143635j518547j808524j855016j720369j719177k065539
2833G67806232k688944l448546m238010m424572l059029n30005J408279J786053J218319
2851.4G53829777O08266K90036K46525K96473K46108M1365l57806r25720j469612j966119
2871.8G50839293k642035l521085m367769m999518n023838l998756k558768k133786
2888.1G21593738k794743k720535o82056K132774L687918L436088K217353R79543K58743
2906.5G28108823J85490N13852P61866O37233K60473j09077k41697J6928M94063R35256
2926.8G31563210J156509J018584P85709P20918P90953J082361J529813J667619J290917
$$ plain form
2796.3 790706217 789448857 788195312 787023783 785891056 784720480 783609688 782639503 781811476 781125605
2814.7 781125605 780465484 779637039 778493404 776974857 775166333 773311317 771590948 769871771 767806232
2833 767806232 765117288 761668742 757430732 753006160 749947131 749417126 750825405 752611458 753829777
2851.4 753829777 754438043 754728079 754974604 755271077 755517185 755558550 755200744 754275024 752805412 750839293
2871.8 750839293 748197258 744676173 740308404 735308886 730285048 726286292 723727524 721593738
2888.1 721593738 718798995 716078460 715396404 717529178 721217096 724653184 726870537 727850080 728108823
2906.5 728108823 728294313 728808165 729570031 730207264 730467737 730358660 730116963 730133891 730627954 731563210
2926.8 731563210 732719719 733738303 734524012 735244930 736035883 737118244 738648057 740315676 741606593
2945.2G41606593P26104K92122P2241O0380J49369J94073J63793J13309N8293m172
2965.6G43432105k9266k3306j4007r9957l44574n40972o06418o67393p03990o78480
2986G39723742o80566p44939r74536j387238j646280j806140k058149k057254j578093
3004.4G26790547o70433M11570J063407P98762k06590j227975j526773q34048L83854
3022.7G24982321J114488Q89242L88980K51472L80873L82006L19004O13332Q68619
3041.1G30190337M56273m24742j181126j452565j415253j291156r68456m41670K39372
3059.4G23711014R29475J290977J332759J168132R27508R65595J364768J947343K320826
3077.8G35958397K144993J684129J238823Q09491N14268L04938k4021k56359k03312
$$ plain form
2945.2 741606593 742332697 742624819 742697060 742757440 742906809 743100882 743264675 743377984 743436277 743432105
2965.6 743432105 743402839 743379533 743365526 743265569 742920995 742380023 741773605 741106212 740402222 739723742
2986 739723742 739043176 738298237 737323701 735936463 734290183 732484043 730425894 728368640 726790547
3004.4 726790547 726120114 726531684 727595091 728393853 728187263 726959288 725432515 724598467 724982321
3022.7 724982321 726096809 726986051 727375031 727626503 728007376 728389382 728708386 729321718 730190337
3041.1 730190337 730646610 730221868 729040742 727588177 726172924 724881768 723913312 723471642 723711014
3059.4 723711014 724640489 725931466 727264225 728432357 729359865 730325460 731690228 733637571 735958397
3077.8 735958397 738103390 739787519 741026342 741835833 742350101 742655039 742631018 742374659 742171347
3096.1G42171347j28984l25382o82831p69913m89771k03312j17361L3080K96593L26514
3116.5G40109980J23143j31666l23117l27051k08795j57475k94924m83155m63427k88963
3136.9G37554550l11315n99325p73370p03573n80788m12523k96236n09321q41320q64506
3157.3G31662273p22229o96182p51019p82430p91430q54731r62377j025319j004040
3175.7G24072516r79602j029671j074016j053691j052856j109123j165450j199722
3192G15408385j238466j282930j254201j144707j021206q99375q03947p40290o92725
3210.3G06330538o78838o84320o50108n95689n94854o07133n94676n74052m86553l23713
3230.7G00540602l14772o25908q93236q27908o78778n56588l87788l63469n37693n43714
$$ plain form
3096.1 742171347 742042363 741716981 741034150 740264237 739774466 739571154 739453793 739486873 739783466 740109980
3116.5 740109980 740233123 740101457 739778340 739451289 739242494 739085019 738790095 738306940 737843513 737554550
3136.9 737554550 737243235 736643910 735870540 735166967 734586179 734173656 733877420 733368099 732526779 731662273
3157.3 731662273 730940044 730243862 729492843 728710413 727918983 727064252 726101875 725076556 724072516
3175.7 724072516 723092914 722063243 720989227 719935536 718882680 717773557 716608107 715408385
3192 715408385 714169919 712886989 711632788 710488081 709466875 708567500 707763553 707023263 706330538
3210.3 706330538 705651700 704967380 704317272 703721583 703126729 702519596 701924920 701350868 700864315 700540602
3230.7 700540602 700225830 699599922 698706686 697878778 697200000 696643412 696255624 695892155 695354462 694810748
3251.1F94810748k81095p8381j09910j90199j80721j58489j46151j17123j88470n93602
3271.5F92766607j141131j450181j567304j581431j466930j178562o59764Q1599R59515
3289.9F84762418J670718K017677K101004K024293J979769K058029J957416J458705
3306.2G00030029P91609L11077J79529K47836K24173J24991M0472o8903k61188o67691
3326.6G00951934j069605j178146j205027j193881j111448j314759j700163j913786
3342.9F90265119k041399j984716j767456j953006k436876k552569k342999k253652
3359.2F72932446k388775k443612k215385k107799k439976k845228k835393k490103
3375.5F53166175k257526k250254k289832k202987j960755j627505j316011j408815
$$ plain form
3251.1 694810748 694529653 694451272 694341362 694151163 693970442 693811953 693665802 693548679 693360209 692766607
3271.5 692766607 691625476 690175295 688607991 687026560 685559630 684381068 683721304 683802903 684762418
3289.9 684762418 686433136 688450813 690551817 692576110 694555879 696613908 698571324 700030029
3306.2 700030029 700821638 701132715 701312244 701560080 701784253 701909244 701949716 701880813 701619625 700951934
3326.6 700951934 699882329 698704183 697499156 696305275 695193827 693879068 692178905 690265119
3342.9 690265119 688223720 686239004 684471548 682518542 680081666 677529097 675186098 672932446
3359.2 672932446 670543671 668100059 665884674 663776875 661336899 658491671 655656278 653166175
3375.5 653166175 650908649 648658395 646368563 644165576 642204821 640577316 639261305 637852490
3391.9F37852490j831114j839698j334130j069785j480639j884997j588344j099587
3408.2F25724196r63866j027763j144469j142740q77083o30438n31256l27885J9371
3426.5F19098067K56300K29240K96771N44608M38511R0301J55747N75602R05156J084507
3446.9F23674810J180351J245498J311660J400113J592577J773834J692295J669884
3463.2F35541022K016127K186596J779914J303554J366198J764595K068520K014220
3479.6F50040746J670837J629055J925111J963615J788080J819551J988113K074837
3495.9F64899945J969159J867115J931251J867711J682162J741588K039016K275645
3512.2F80273592K151609J847982J808226K009213K167821J967192J666486J808167
$$ plain form
3391.9 637852490 636021376 634181678 632847548 631777763 630297124 628412127 626823783 625724196
3408.2 625724196 624760330 623732567 622588098 621445358 620568275 619937837 619406581 619078696 619098067
3426.5 619098067 619354367 619583607 619880378 620424986 620863497 620953798 621109545 621685147 622590303 623674810
3446.9 623674810 624855161 626100659 627412319 628812432 630405009 632178843 633871138 635541022
3463.2 635541022 637557149 639743745 641523659 642827213 644193411 645958006 648026526 650040746
3479.6 650040746 651711583 653340638 655265749 657229364 659017444 660836995 662825108 664899945
3495.9 664899945 666869104 668736219 670667470 672535181 674217343 675958931 677997947 680273592
3512.2 680273592 682425201 684273183 686081409 688090622 690258443 692225635 693892121 695700288
3528.5F95700288K126872K221883K241492K202570K046645K054930K157509K098620
3544.8G12850809J920581J860082J970053K072275K086579K077282K107203K028584
3561.1G28973448J703739J667679K459764K969027K526820K194464K293586K420724
3577.5G47209251K515197K600789K459168K258063K431750K698421K521634K391637
3593.8G67085910K569377K694071K672255K578020K263725J936852K049447K285540
3610.1G86135197K266347K157748J973569K179861K651632K232790J319051Q46863
3626.4H01763058J392841K193213J892864J529038J320422J048684Q48532N49078K5511
3644.8H12563241l45111R9659O38365K04504M4107P51853J400471J479924J444936
$$ plain form
3528.5 695700288 697827160 700049043 702290535 704493105 706539750 708594680 710752189 712850809
3544.8 712850809 714771390 716631472 718601525 720673800 722760379 724837661 726944864 728973448
3561.1 728973448 730677187 732344866 734804630 737773657 740300477 742494941 744788527 747209251
3577.5 747209251 749724448 752325237 754784405 757042468 759474218 762172639 764694273 767085910
3593.8 767085910 769655287 772349358 775021613 777599633 779863358 781800210 783849657 786135197
3610.1 786135197 788401544 790559292 792532861 794712722 797364354 799597144 800916195 801763058
3626.4 801763058 803155899 805349112 807241976 808771014 810091436 811140120 811988652 812537730 812563241
3644.8 812563241 812218130 812317789 812956154 813160658 813204765 813956618 815357089 816837013 818281949
3663.1H18281949J214921P53403P28547J177848J289963J852096K469003K029896J499772
3681.5H31297398R97364N62489O33061R56953Q80181P19130N68212K68757L2365J17541
3701.9H37033451K93970J32322k32458k87891L06488P11977M07934l338j77919j38641
3722.3H38045895L1591K19404R6262l25382n31375o9261O30498M23372m28736r09627
3742.7H37182641m72069M1723j26302J78337P82073N04553M4227N3346K17378O2347
3763.1H38468254j05858m8459P8798K04205J58727n6684j19924j7703q3744j95384
3783.5H38282228n5671J26958Q4161j46746l70503m32551m38094m18722r0421K28644
3803.9H36769283K16663K72512J23859k70546n04494m71115l57508k01226K03729L15249
$$ plain form
3663.1 818281949 819496870 820250273 820978820 822156668 823446631 825298727 827767730 829797626 831297398
3681.5 831297398 832294762 832857251 833490312 834447265 835327446 836046576 836614788 836883545 836915910 837033451
3701.9 837033451 837327421 837459743 837227285 836939394 837245882 837957859 838365793 838362455 838184536 838045895
3722.3 838045895 838077486 838296890 838393152 838067770 837536395 837467134 838097632 838521004 838092268 837182641
3742.7 837182641 836710572 836752295 836625993 836804330 837586403 838090956 838135183 838188529 838405907 838468254
3763.1 838468254 838362396 838313937 838392735 838596940 838755667 838698983 838579059 838561356 838477612 838282228
3783.5 838282228 838226557 838353515 838437676 838290930 837920427 837487876 837049782 836631060 836540639 836769283
3803.9 836769283 836985946 837258458 837382317 837111771 836607277 836136162 835778654 835577428 835781157 836096406
3824.3H36096406Q4758j00732k46227k78115k23339k76029k33114J23501L69668L19720
3844.6H35636497q643o12497j142383p73966N71072P93934K03669k98977m43459k30133
3865H33695114k01345k62379O5445L55721K83718o6996l95000k52306O9499J74999
3885.4H33466470J6749k13206p2658J28806j20998m67419n27144k28226K78354N33938
3905.8H32794666L36170P2122j07765l09765l71218j66059k0444n9664k7717P4566
3926.2H32214892R835q8871M9770K04802J02102o9260j45734j05619L2961R2447L4511
3948.7H32331836k8550n6506j6987L6478n662l7074J8417O56m8637j0670O0l8683j4246
3975.2H32130432J3113J252M6849P2718n6565j70827j09553l1114m0412l8504k2412
$$ plain form
3824.3 836096406 836181164 836080432 835834205 835556090 835332751 835056722 834823608 834947109 835316777 835636497
3844.6 835636497 835627854 835015357 833872974 833099008 833670080 834464014 834667683 834368706 833925247 833695114
3865 833695114 833493769 833231390 833296835 833652556 833936274 833869278 833474278 833221972 833291471 833466470
3885.4 833466470 833483219 833270013 833197355 833326161 833205163 832737744 832210600 831982374 832260728 832794666
3905.8 832794666 833130836 833202958 833095193 832785428 832414210 832248151 832227707 832168043 832140326 832214892
3926.2 832214892 832224727 832135856 832185626 832390428 832492530 832423270 832277536 832171917 832204878 832297325 832331836
3948.7 832331836 832303286 832246780 832229793 832266271 832260609 832223535 832241952 832242608 832193971 832183301 832183361 832144678 832130432
3975.2 832130432 832143545 832144797 832191646 832264364 832207799 832036972 831927419 831896305 831855893 831817389 831794977
3997.6H31794977
$$ plain form
3997.6 831794977
##END=$$ End of the data block
