##TITLE=G1-Salen $$ Begin of the data block
##JCAMP-DX=5.00 $$ ACD/SpecManager v 10.08
##SPECTROMETER/DATA SYSTEM=Alpha
##DATE=08 Apr 2014 08:54:24
##DATA TYPE=INFRARED SPECTRUM
##DATA CLASS=XYDATA
##ORIGIN=
##OWNER=
##NPOINTS=1765
##FIRSTX=399.75695801
##LASTX=3997.56933594
##MAXX=3997.56933594
##MINX=399.75695801
##MAXY=0.82835680
##MINY=0.37816444
##XFACTOR=1.0000000000
##YFACTOR=1.000000000000000e-9
##FIRSTY=0.82754171
##DELTAX=2.03957629
##XUNITS=1/CM
##YUNITS=ARBITRARY UNITS
##XYDATA=(X++(Y..Y))
399.8H27541709Q15093j474857k010763K75255n34058k110898m05372o3777k638816
418.1H19393516l005267k795040n485058p521391j0610640j4136791p342279Q150160
434.4G76647210J6206622J3502240Q899630L808379k21312J12831m2438j895666j075745
452.8H15941751k56121k554059k983391j910508m403353o868660r719789j6901315
469.1G70344555j7396748k928734J0188342J1232197P965505L383458l513813n617678
485.4G73657084M493176J5684724J6639233J0433614L074765o77704K54452L3498j785994
503.8H21806848m50015M06742j471877r93669N61953j028121j587808M21584k69831
522.1H17395806j562237k6823r2983k002179j077295p3194j589120j541853m69267
$$ y = [827541709, 828356802, 826881945, 824871182, 825146437, 824612379, 822501481, 822096109, 822032332, 819393516, 816388249, 813593209, 808108151, 800586760, 789976120, 775839329, 768497050, 776647210, 792853832, 806356072, 815255702, 819064081, 818842769, 818955600, 818913162, 817017496, 815941751, 815685630, 813131571, 810148180, 808237672, 803834319, 796965659, 787245870, 770344555, 752947807, 750019073, 760207415, 771439612, 779405117, 782788575, 779274762, 773657084, 778150260, 793834984, 810474217, 820907831, 823982596, 823304892, 823559344, 823592842, 821806848, 821356833, 821763575, 820291698, 819298029, 819859982, 818831861, 817244053, 817665637, 817395806, 815833569, 815806746, 815713763, 813711584, 812634289, 812561095, 810971975, 809430122, 808960855]
540.5H08960855j914382k893865k239645m463076q396507r278535q173347o618202
556.8G64983296n391657m772425K341152J5732109K0541132J2516260L996849J588940
573.1H11535656L32654j307189n93186O8784j051784p61568L74794m60506j010060
591.5H07127595m5836l78191j145542j73092J14918j120448r20535q9287q47400j151800
611.9H01370382l16977p48575j292467k01166L6121j066804j100242r14574k189755
630.2G93575943l120423l378689n109191p723868j0978639j7950595k6822984k3376584
646.5F95114970L328800L3491493L8716435K4681330J0565281L225088J032114j35362
662.9H10020149j596511k279877j193464j21474k09451k41280r36866j531779r09984
$$ y = [808960855, 807046473, 804152608, 801912963, 797449887, 789053380, 779774845, 771601498, 764983296, 759591639, 754819214, 757160366, 772892475, 793433607, 805949867, 809946716, 811535656, 811868310, 810561121, 809967935, 810036719, 808984935, 808223367, 808598161, 808137655, 807127595, 807081759, 806703568, 805558026, 805384934, 805499852, 804379404, 803458869, 803369582, 802522182, 801370382, 801053405, 800304830, 799012363, 798811197, 798847318, 797780514, 796680272, 795765698, 793575943, 790455520, 787076831, 781967640, 774243772, 763265133, 745314538, 718491554, 695114970, 698443770, 731935263, 770651698, 795333028, 805898309, 809123397, 810155511, 810020149, 808423638, 806143761, 804950297, 804828823, 804619372, 804378092, 803441226, 801909447, 800999463]
681.2H00999463r15945j724541j510024j220823j930594k031088j558721k169311k725005
699.6G85213411k325833k572358l357291l195464l185571m132211m461467m413247
715.9G57569969n429387o488264o762385p955075j0094225j2064576j5112400k0158768
732.2F73504889k6847363l8239300n8322549o9848001k9351502L5806060K1089345
746.5E07791579l6545843r514481N3052604M6343208J0814547K1112085N7354211O2629581
762.8G13037491L4936189M048765j9282639l5036146l3514083p762194K5164128M0918290
779.1G22509801L6694885K5560975J6004205R332716N427957K839922P570j786649
795.4H16591382j976311k496720l356874l615081m664600o262243m778623q67248M99368
$$ y = [800999463, 800083518, 798358977, 796848953, 795628130, 793697536, 791666448, 790107727, 787938416, 785213411, 782887578, 780315220, 776957929, 773762465, 770576894, 766444683, 761983216, 757569969, 752140582, 745652318, 738889933, 730934858, 720840633, 708776057, 693663657, 673504889, 646657526, 608418226, 550095677, 480247676, 450896174, 486702234, 507791579, 471245736, 461731255, 514783859, 561127067, 571941614, 593053699, 650407910, 713037491, 747973680, 752022445, 732739806, 697703660, 664189577, 656427383, 681591511, 722509801, 759204686, 784765661, 800769866, 810102582, 815530539, 818370461, 818378031, 816591382, 814615071, 812118351, 808761477, 805146396, 800481796, 794219553, 789440930, 788573682, 789073050]
813.8G89073050p24196j868189l201544m401207m505873m880249n976022o464481o886244
832.1G50165045q198976r369493j0335266j2523592j5357137j7738580k0360589k2869349
848.5F33412063k3377597k1431446j7213404j0147453l58581J1926174K6871800M0374160
864.8F40055716M2980492L1228185J3854980K946079K806306P237673Q941054O869257
881.1G56919742M037141K565504J308679m87566j662969l636420r249985j4077545
897.4G35716581m961431J6609252K6910364J8842280Q005143K581656J234948J111388
913.7H06050181L59178o8426J79410l34501j062930r90033j498699l537953p845879
932.1G91250348j5212417j3852655M847109J8562198J2660026L338695L78966l69728
$$ y = [789073050, 788348854, 786480665, 783279121, 778877914, 774372041, 769491792, 763515770, 757051289, 750165045, 741966069, 732596576, 722261310, 709737718, 694380581, 676642001, 656281412, 633412063, 610034466, 588603020, 571389616, 561242163, 560883582, 572809756, 599681556, 640055716, 683036208, 714264393, 728119373, 731065452, 733871758, 741109431, 750050485, 756919742, 760956883, 763522387, 764831066, 764343500, 762680531, 759044111, 749794126, 735716581, 730755150, 747364402, 774274766, 793117046, 801122189, 803703845, 804938793, 806050181, 806409359, 806340933, 806520343, 806185842, 805122912, 804132879, 802634180, 799096227, 791250348, 776037931, 762185276, 767032385, 785594583, 798254609, 801593304, 801972270, 801602542]
948.4H01602542j162171j311779j372814k331257l230333l958404n987645r632289
964.7G72615850j6755283k8910041l0796945j0738849P771015N118549p451952o426454
981F84425890J6785503L4278750K6713014J1613727L153562m6372j431644k842129
997.3G72650301l967225m566848n694926p259011q601785j0719359j4698148k0436287
1013.7F96706712k8877437m0136039l9522469l470957N1406383P1981609M7456086
1027.9G55543888J3558626q828819k3501813l8156331n3353727n4937661k3075878
1042.2E67248285L1097650O5186739O1990142M1890264K3644268J1829257N416274
1056.5H08302879J888872J08003m14669r74000j746595j856208j719236j988649j902581
$$ y = [801602542, 800440371, 799128592, 797755778, 795424521, 792194188, 788235784, 782248139, 772615850, 755860567, 726950526, 696153581, 685414732, 693185747, 698304296, 690852344, 684425890, 701211393, 735490143, 762203157, 773816884, 776970446, 776924074, 775492430, 772650301, 768683076, 764116228, 758421302, 751162291, 742560506, 731841147, 717142999, 696706712, 667829275, 627693236, 588170767, 584699810, 636106193, 708087802, 755543888, 769102514, 760273695, 736771882, 698615551, 645261824, 590324163, 567248285, 598345935, 663532674, 725522816, 767413080, 791057348, 802886605, 808302879, 810191751, 810299754, 809885085, 808911085, 807164490, 805308282, 803589046, 801600397, 799697816]
1074.8G99697816j412272j498520j825273j715959j837372k328694k364993k445996
1091.2G84268737l378332m668236o195783q779049j1902571j3065636r458542l181815
1107.5G23638773k800584r759009r369790Q476436K7488053K8328597J6542673O324828
1123.8G88869977R70304j672268k505243k872884l932118n192697o694675j0429919
1140.1G56540477j9121945l6531806n6104600n2088141m859150N8821201P9688132
1154.4G26344168N0345719J8050015L763616j006603k351821k666711k619505j939655
1170.7G87919223j369118j808107k381981k629876l264189m352808n422413p060409
1187G59630322r721517j3306618j9108236k7039289k8637111j3332129J1415601K5732875
$$ y = [799697816, 798285544, 796787024, 794961751, 793245792, 791408420, 789079726, 786714733, 784268737, 780890405, 776222169, 770026386, 761247337, 749344766, 736279130, 726820588, 723638773, 720838189, 711079180, 701709390, 710185826, 737673879, 766002476, 782545149, 788869977, 789840281, 788168013, 785662770, 782789886, 778857768, 773665071, 766970396, 756540477, 737418532, 700886726, 644782126, 592693985, 587834835, 646656036, 726344168, 776689887, 794739902, 798503518, 797496915, 795145094, 792478383, 789858878, 787919223, 786550105, 784741998, 782360017, 779730141, 776465952, 772113144, 766690731, 759630322, 749908805, 736602187, 717493951, 690454662, 661817551, 648485422, 659901023, 685633898]
1203.3F85633898K3275256J2329042J472771n140662q372009j0853410j0108530j496852
1219.7F86739504J1455059J9001902J7930746J3141870Q956432N790771K488732j262605
1236G64242411m278601o158888q481085j1688411j2484134n389988R213149J9368172
1252.3G44342625J5910387N254448k916217o556273p343352o998777p625043j0922909
1268.6G23144889j6429722k2830427l0285895l9497733m8107028m9248636l0188203
1282.9D86557245J5989661O1337770O4509034L3183097R777427R724438J8869937K4363279
1299.2G24311888K3901761J8144369J0121345M312754J042009k870858q298099j0480821
1315.5G60184348k175272J2952209J8668234J1766136L613114j50979j357853k123117
$$ y = [685633898, 708909154, 721238196, 722710967, 717570305, 709198296, 698344886, 688236356, 686739504, 698194563, 717196465, 735127211, 748269081, 757225513, 763016284, 765505016, 764242411, 759963810, 753804922, 745323837, 733635426, 721151292, 715761304, 724974453, 744342625, 760253012, 765507460, 762591243, 756034970, 748691618, 741692841, 734067798, 723144889, 706715167, 683884740, 653598845, 614101112, 565994084, 516745448, 486557245, 502546906, 563884676, 628393710, 661576807, 671354234, 681078672, 699948609, 724311888, 748213649, 766358018, 776479363, 780792117, 781834126, 778963268, 770665169, 760184348, 758009076, 770961285, 789629519, 801395655, 805008769, 804857790, 803499937, 801376820]
1331.8H01376820k485216k335429k417267k531886j957595j603186j967490k320945
1348.1G83757806k432704k808035l277778l719628m738629o926477j0773718j5288890
1364.5G33791947j9509554k1665692j4942348J9848J2970508J5055894J0254860N323053
1380.8G21298516J837611q6129j597225l173411m317940o261646r065450j0488152
1397.1F88146174j1059642j0167539p845938n695880l416359k320707l974318p798136
1413.4F35867655j0702550r542883l61323J3088346K2665321K5506258K1530509J8003345
1429.7G16054678J4226437Q724927M107893J8895l315449o306350r292245j2855649
1446G11363137j9047201k5285602k7498304k1577418q851826k758444k853930J0182798
$$ y = [801376820, 798891604, 796556175, 794138908, 791607022, 789649427, 788046241, 786078751, 783757806, 781325102, 778517067, 775239289, 771519661, 766781032, 759854555, 749080837, 733791947, 714282393, 692616701, 677674353, 677694201, 690664709, 705720603, 715975463, 721298516, 723136127, 723049998, 721452773, 718279362, 713961422, 707699776, 698634326, 688146174, 677086532, 666918993, 659073055, 653377175, 649960816, 647640109, 643665791, 635867655, 625165105, 615622222, 615260899, 628349245, 651014566, 676520824, 698051333, 716054678, 730281115, 739006042, 743113935, 743132830, 739817381, 733511031, 724218786, 711363137, 692315936, 667030334, 639532030, 617954612, 609102786, 606344342, 603490412, 613673210]
1462.4F13673210L4746230M3881058K6391030J1193216M158079r4115l450334o448567
1478.7G24049807r771526j3483584j6743660k1694184l0291497l6147952l1911254
1493E64006150k8556407k0948767Q294940L7356972M6952069N1896453N7967365L2415032
1509.3G49383807J1145890N277872J537859j719594l464698m390657l847182j946509
1525.6G51976788K35379J971900K636552K707362J505256n75781l268719m593968m244626
1543.9G48350143m586398n311132o950736q120179q262634q051455j1967659j6159773
1560.3F78940177j1165679j1892199j5543044k1237433k9456019k8372288k4960518
1574.5E36312997j7596602N526543K5431454L5529971L3830643K3504018J2574196
$$ y = [613673210, 648419440, 692300498, 718691528, 729884744, 734042823, 733948708, 730498374, 724049807, 714278281, 700794697, 684051037, 662356853, 632065356, 595917404, 564006150, 535449743, 514500976, 522795916, 560152888, 607104957, 659001410, 716968775, 749383807, 760529697, 765807569, 767345428, 765625834, 762161136, 757770479, 753923297, 751976788, 752212167, 754184067, 756820619, 759527981, 761033237, 760457456, 757188737, 752594769, 748350143, 743763745, 738452613, 731501877, 723381698, 715119064, 707067609, 695099950, 678940177, 667774498, 655882299, 640339255, 619101822, 589645803, 561273515, 536312997, 518716395, 524242938, 549674392, 585204363, 619035006, 642539024, 655113220]
1588.8F55113220M123092k657116p597804r977162j1197865j3158082j5366495j6011357
1605.1E83270431j3598144p700623p40051L375352N163252N931020L174722k047598
1621.4E76828361j0411442k0651996l2113731m1559696m0595353l5701602j7630101
1635.7C78164440L2237113O8832070P5384438O1798691N0766945M0942312K2515296
1650G30641305J7412127K0962357J0984242M822850L221274J676440M58777k3246o6400
1668.4G90089726L37184O47902j41799n75662R90749L421962N798519P699370M803777
1686.7H13071728J276016n0426m92215q12351r62079k47300O04988Q22186N07176J97470
1707.1H13915193k31564m88520m35233m62830l77834L10481Q99434J060486J190841
$$ y = [655113220, 659236312, 656579196, 648981392, 639004230, 627806365, 614648283, 599281788, 583270431, 569672287, 561971664, 561231613, 564606965, 569770217, 575701237, 578875959, 576828361, 566416919, 545764923, 513651192, 472091496, 431496143, 395794541, 378164440, 410401553, 479233623, 554618061, 616416752, 667183697, 708126009, 730641305, 748053432, 769015789, 780000031, 784822881, 788044155, 789720595, 790179372, 790156126, 790089726, 790426910, 791074812, 790933013, 790357351, 791348100, 794770062, 800568581, 808267951, 813071728, 814347744, 814297318, 813805103, 812992752, 812030673, 811783373, 812388361, 813210547, 813717723, 813915193, 813683629, 813195109, 812759876, 812297046, 811919212, 812229693, 813129127, 814189613, 815380454]
1725.5H15380454J099885P89463M27067L32356M70161K86520J09911N8174q7738k52307
1745.9H18613946l13580n92827p03574n03003n83053p67529p61926p74503p06374n96762
1766.3H12310815n99325p50124j019180q41737p07984r58919j134992j117706j262129
1784.6H03918719j456201j528024k028645k512335j841069r23633k79486N64754J320958
1803G95235038J487374J320660J116872Q80241N45085K57254K5987j87576k79426l41356
1823.4H00060153n45502p00772o13033k34425J04546K10822K23696J34468o497r2566
1843.8G98540890q1181j67668k39670k15590k43783k03312j56701l02374m52638m55915
1864.2G96022058o50585j105070j306057j286209j105010k01047R28641J196622P57516
$$ y = [815380454, 816480339, 817269802, 817696869, 818029225, 818499386, 818785906, 818895817, 818953991, 818866253, 818613946, 818300366, 817707539, 817003965, 816500962, 815917909, 815150380, 814388454, 813613951, 812907577, 812310815, 811711490, 810961366, 809942186, 809100449, 808392465, 807433546, 806298554, 805180848, 803918719, 802462518, 800934494, 798905849, 796393514, 794552445, 793628812, 793349326, 793914080, 795235038, 796722412, 798043072, 799159944, 800040185, 800585270, 800842524, 800868511, 800680935, 800401509, 800060153, 799514651, 798813879, 798200846, 797966421, 798070967, 798281789, 798505485, 798639953, 798633456, 798540890, 798459709, 798292041, 798052371, 797836781, 797592998, 797389686, 797232985, 796930611, 796477973, 796022058, 795371473, 794266403, 792960346, 791674137, 790569127, 790368080, 791296721, 792493343, 793250859]
1882.5G93250859K27213l16322p80642p85530n85496o61612q14855j094460j643420
1900.9G86795735j877308j389026p87497m16875J19865O80805R04619J048804J117646
1919.2G86196768O91891L4988m72128j000405j522243j721322j808882j960755j895725
1937.6G76542187j561344q55982P43150K464235K860487K112269J259685O21140J18136
1955.9G84303963j13725j81854l52443n60939o78718p06375o24835m71711l43859l16024
1976.3G79953480l10660k84373k92659l04938k92182l14652m14491m90010m74155m60088
1996.7G76315272m38750l44217k48253j73926r8050n8234m7505k3544l5584j16765
2017.1G74730444j81377k01106k19226k59995k91467l22759m06623m75884m45068l87728
$$ y = [793250859, 793478072, 793161750, 792381108, 791595578, 791010082, 790348470, 789533615, 788439155, 786795735, 784918427, 783529401, 782741904, 782325029, 782444894, 783125699, 784030318, 785079122, 786196768, 786888659, 786923647, 786451519, 785451114, 783928871, 782207549, 780398667, 778437912, 776542187, 774980843, 774124861, 774868011, 777332246, 780192733, 782305002, 783564687, 784185827, 784303963, 784190238, 784008384, 783655941, 783095002, 782416284, 781709909, 781085074, 780613363, 780269504, 779953480, 779642820, 779358447, 779065788, 778760850, 778468668, 778154016, 777739525, 777249515, 776775360, 776315272, 775876522, 775532305, 775284052, 775110126, 775012076, 774953842, 774906337, 774882793, 774847209, 774730444, 774549067, 774347961, 774128735, 773868740, 773577273, 773254514, 772847891, 772372007, 771926939, 771539211]
2037.5G71539211l80754l62575l47197m12882n16712o00338p10845p80702o44684l36647
2057.9G66445875j8656J96099K55585J65462K9564q2671k09630l17514l30508l32474
2078.3G65801132l92974m36902m89950o26504p43211o75082m31061j22606J23739J88827
2098.7G62195408J16170K5451q8513k44915l42727l19243k83837l20434l53396l57509
2119.1G60026455l65615l40939k79486k42412k16424j81854j91391k30491k45988k52664
2139.5G57479191k89381l22818l05832k79248k69115k27213j85608k34306l24667l77476
2159.9G54663527m24147m75645m72665m37378m05014l25382j85847l5405J25587K95520
2180.3G52323151K95341P6532r6679j55925k15769k01345j24752j51456k40504k46466
$$ y = [771539211, 771158457, 770795882, 770448685, 770035803, 769519091, 768918753, 768207908, 767427206, 766782522, 766445875, 766427219, 766623318, 766878903, 767044365, 767073929, 766991258, 766781628, 766464114, 766133606, 765801132, 765408158, 764971256, 764481306, 763854802, 763111591, 762436509, 762005448, 761882842, 762006581, 762195408, 762311578, 762337029, 762248516, 762003601, 761660874, 761341631, 761057794, 760737360, 760383964, 760026455, 759660840, 759319901, 759040415, 758798003, 758581579, 758399725, 758208334, 757977843, 757731855, 757479191, 757189810, 756866992, 756561160, 756281912, 756012797, 755785584, 755599976, 755365670, 755041003, 754663527, 754239380, 753763735, 753291070, 752853692, 752448678, 752123296, 751937449, 751902044, 752027631, 752323151, 752618492, 752695024, 752598345, 752442420, 752226651, 752025306, 751900554, 751749098, 751508594, 751262128]
2200.7G51262128k31981k52724k15351j95980k90633l78251m04656m65810n34117m81427
2221.1G47811198m14848m77553n24342n38528o66022p65741o95884n76734m31359k10285
2241.5G42509902p9334j34707k08854k57671l47257l52144k47658k33054k93195k85745
2261.9G40070283l21745m09842l30865k13504l01481l86238k52068j22189j38521j39356
2282.3G37454474j28210j19567l6001p8380l62694o04689o72877p36058p37369n76258
2302.7G33402371n42461p49410q86321q75115q94308r24528r38237j081228j231074
2321G25279689j054049p90894q97169j088440j031935r84788j069487j059413q65578
2339.4G16437936m50850K39373R78648R92894J9908j230061j951694j773834j137495
$$ y = [751262128, 751030147, 750777423, 750562072, 750366092, 750075459, 749697208, 749292552, 748826742, 748292625, 747811198, 747396350, 746918797, 746394455, 745855927, 745189905, 744424164, 743728280, 743151546, 742720187, 742509902, 742430568, 742295861, 742087007, 741829336, 741482079, 741129935, 740882277, 740649223, 740356028, 740070283, 739748538, 739338696, 739007831, 738794327, 738492846, 738106608, 737854540, 737732351, 737593830, 737454474, 737326264, 737206697, 737170696, 737092316, 736729622, 736124933, 735452056, 734715998, 733978629, 733402371, 732859910, 732110500, 731224179, 730349064, 729454756, 728530228, 727591991, 726510763, 725279689, 724225640, 723434746, 722537577, 721449137, 720417202, 719432414, 718362927, 717303514, 716437936, 715987086, 716226459, 717205107, 718198001, 718217909, 716987848, 715036154, 713262320, 712124825]
2357.7G12124825n29111p8440K44916M65095O29902P86245Q49545O97076M92454M00245
2378.1G16082752K93791J26541k8134k60055n64635p57038q01087p44283n37872k48969
2398.5G12561011j30891k56360m25398m97282m67002k96533q8513k3544k3961J1146
2418.9G10362673M351p5579j53899k17974k73764k87891l11315l67105l61800l05653
2439.3G08012044l16143m09245m72963m60327m58002m63068m03702l68894m27246n00023
2459.7G03732431n85795o81102o83009n88298m86255l82662k56896j83821j76727k24889
2480.1F99482977m00424o48558q16464q57115q21531p14123m98772k92420k03967j73986
2500.5F94055617k15590l53038m53890m64260m90129n22018m51684l36230k52902j50144
$$ y = [712124825, 711595714, 711517274, 711762190, 712227285, 712857187, 713643432, 714492977, 715190053, 715682507, 716082752, 716376543, 716503084, 716474950, 716214895, 715650260, 714893222, 714092135, 713347852, 712809980, 712561011, 712430120, 712173760, 711748362, 711251080, 710784078, 710487545, 710399032, 710375488, 710351527, 710362673, 710367024, 710291445, 710137546, 709919572, 709645808, 709357917, 709046602, 708679497, 708317697, 708012044, 707695901, 707286656, 706813693, 706353366, 705895364, 705432296, 705028594, 704659700, 704232454, 703732431, 703146636, 702465534, 701782525, 701194227, 700707972, 700325310, 700068414, 699884593, 699707866, 699482977, 699082553, 698433995, 697617531, 696760416, 695938885, 695224762, 694725990, 694433570, 694229603, 694055617, 693840027, 693486989, 693033099, 692568839, 692078710, 691556692, 691105008, 690768778, 690515876, 690365732]
2520.9F90365732r6619k19465m17292n20289n38051n09202l63529j61350r6559j42813
2541.3F87300563k14160m04417o90699q82447r09984p74204l54588K24232N12481M49896
2561.7F84256673L11136J57535J1265o7591j82510l27706l16739j75536j05262q4638
2582.1F83476627R715M7327j0312K6047J36495K46763M56810O53505N52416K63870
2602.5F85859263N5969j12772k52664k10643p8380k6405O3896J67370K9445k25842
2622.9F85269237m07160p10606j133740j327575j112759m97281L67403J015603J117528
2641.2F82580650R73165Q93116O94871L45349J24872K9504o3956q34K01404L27051
2661.6F86105192N27560Q69513J033485J042664J159549J238703J095891R46701Q40306
$$ y = [690365732, 690269113, 690049648, 689632356, 689112067, 688574016, 688064814, 687701285, 687539935, 687443376, 687300563, 687086403, 686681986, 685991287, 685108840, 684198856, 683424652, 683070064, 683294296, 683806777, 684256673, 684567809, 684725344, 684736609, 684669018, 684486508, 684158802, 683842063, 683666527, 683561265, 683476627, 683486342, 683533669, 683523357, 683549404, 683685899, 683932662, 684389472, 685042977, 685595393, 685859263, 685915232, 685802460, 685549796, 685339153, 685260773, 685234368, 685298264, 685465634, 685495079, 685269237, 684862077, 684151471, 683017731, 681690156, 680577397, 680080116, 680447519, 681463122, 682580650, 683553815, 684446931, 685141802, 685487151, 685612023, 685641527, 685577571, 685576737, 685778141, 686105192, 686632752, 687502265, 688535750, 689578414, 690737963, 691976666, 693072557, 694019258, 694859564]
2680F94859564N90146L68178L40283L00944J91390J54138P1823k13861n66066r09864
2700.4F95186675j309038j587867j581312j419186j162827p72476m20154k80499j81556
2718.7F86471760M292J17659J50741J81794J73807J71602J87933O1154k07722k90036
2739.1F87022984m0114L08156O12617Q38995Q72910P70509P43687P71880P12276O50942
2759.5F93264842O65188O73711P29084Q71360R22502Q35657O42180J51098n86927j146197
2779.9F97022498j354814j311064j022875o25074l98457l10481j36256J02341K13027
2798.3F92178845K16544K73883L71814M49121N15342N21183M52936L79324L01540J86562
2818.7F95847094N2869j21235l87788o49274q12232r03189r18448q49724p41840p41958
$$ y = [694859564, 695449710, 695817888, 696158171, 696459115, 696650505, 696804643, 696876466, 696662605, 696096539, 695186675, 693877637, 692289770, 690708458, 689289272, 688126445, 687353969, 686933815, 686653316, 686471760, 686476052, 686593711, 686744452, 686926246, 687100053, 687271655, 687459588, 687520742, 687313020, 687022984, 686982870, 687291026, 687903643, 688742638, 689615548, 690386057, 691129744, 691901624, 692613900, 693264842, 693930030, 694603741, 695332825, 696204185, 697126687, 697962344, 698604524, 698755622, 698168695, 697022498, 695667684, 694356620, 693333745, 692708671, 692310214, 691999733, 691863477, 691965818, 692178845, 692395389, 692669272, 693041086, 693490207, 694005549, 694526732, 694979668, 695358992, 695660532, 695847094, 695899963, 695778728, 695390940, 694741666, 693929434, 693026245, 692107797, 691258073, 690516233, 689774275]
2839.1F89774275r24826j128137j237214j326918j449943j548230j680315j995444
2855.4F78483248k409637k787292l057003k940774k240479j147986J27614J408517
2871.7F65436208K296388K618611K612353K359092J751780Q56579j69695j301229k606153
2890.1F73853934m098773n665004o858528o364048k683520L300130P837952Q081197
2906.4F67403340N025387J587153n22733j280069j176179o01411j58250m84884j502991
2924.7F68289363k329290k096772n51045K009034M549921N753577N344033M082263
2941F85051084K580761J071036j91688j037061j435757j331151n40673R45150K600611
2959.4F87712312L718674L861964L187239K249420J347661N36978j70112p99298j324713
$$ y = [689774275, 688849449, 687721312, 686484098, 685157180, 683707237, 682159007, 680478692, 678483248, 676073611, 673286319, 670229316, 667288542, 665048063, 663900077, 664027691, 665436208, 667732596, 670351207, 672963560, 675322652, 677074432, 677931011, 677761316, 676460087, 673853934, 669755161, 664090157, 657231629, 650867581, 648184061, 651484191, 659322143, 667403340, 672428727, 674015880, 673493147, 672213078, 671036899, 670435488, 670277238, 669792354, 668289363, 665960073, 663863301, 663312256, 665321290, 669871211, 675624788, 680968821, 685051084, 687631845, 688702881, 688511193, 687474132, 686038375, 684707224, 684166551, 685111701, 687712312, 691430986, 695292950, 698480189, 700729609, 702077270, 702614248, 702444136, 701644838, 700320125]
2977.8G00320125j706481j940072j915991j467228p36058k01404j48356l73363o41108
2996.1F91190064r92596j345635j509130j534879j381039p56324M54962J960874L151953
3014.5F89238250L485620K939463K080381J443446R35614M08947O3837k01047o49154
3032.8F99745357j212954j678050j899600k047300k327919k609134k523363j733422
3049.1F83713615m86255O64950J360893J188576O01530J175821L140807M531443L983140
3067.5F99874520K487064J442194J047432J009345J027525Q58545O60777N94199M68075
3085.8G09469676L01540K24888Q6963o5624K3007K14040J47164q1300r3639O6161Q8095
3108.3G10380971m2140n1916Q1003R5189m6671k72155m59492l91543k03848j54316
$$ y = [700320125, 698613644, 696673572, 694757581, 693290353, 692554295, 692352891, 692204535, 691831172, 691190064, 690197468, 688851833, 687342703, 685807824, 684426785, 683670461, 684125423, 686086297, 689238250, 692723870, 695663333, 697743714, 699187160, 700122774, 700531721, 700595558, 700394511, 699745357, 698532403, 696854353, 694954753, 692907453, 690579534, 687970400, 685447037, 683713615, 683227360, 683892310, 685253203, 686441779, 687043309, 688219130, 691359937, 695891380, 699874520, 702361584, 703803778, 704851210, 705860555, 706888080, 707746625, 708407402, 709001601, 709469676, 709771216, 709996104, 710083067, 710017443, 710040450, 710254490, 710401654, 710320354, 710226715, 710292876, 710380971, 710338831, 710286915, 710367918, 710463107, 710416436, 710144281, 709684789, 709293246, 709089398, 708935082]
3128.7G08935082k00212k26796k00987j05619o1035k13683l72708l62932l46005m02451
3149.1G06442654m39584m51803m85957m92752m16815l30806k98738k74241k53320k45452
3169.5G02753186k34008k62677l39151l77357l49641l55362m16816m77969n30661n54800
3189.9F98854744n54204n69522o14226o51300o45280o29663o10769n67555n36561n37575
3210.3F92938089n57243n61297n71669o51359p06434o81341o69241o99162p24257o98208
3230.7F86417878o97852q25285r63748r85086r74119j014649j104057j212657j258611
3249F77381814j120866o90579m4763M67479N44786K86758N484j69337l05772m25458
3269.4F75929546m65452m54009m73797n70417p15017p82907p65979p77602p90775p06733
$$ y = [708935082, 708734870, 708508074, 708307087, 708201468, 708140433, 707926750, 707554042, 707191110, 706845105, 706442654, 706003070, 705551267, 705065310, 704572558, 704155743, 703824937, 703526199, 703251958, 702998638, 702753186, 702519178, 702256501, 701917350, 701539993, 701190352, 700834990, 700418174, 699940205, 699409544, 698854744, 698300540, 697731018, 697116792, 696465492, 695820212, 695190549, 694579780, 694012225, 693475664, 692938089, 692380846, 691819549, 691247880, 690596521, 689890087, 689208746, 688539505, 687840343, 687116086, 686417878, 685720026, 684894741, 683930993, 682945907, 681971788, 680957139, 679853082, 678640425, 677381814, 676260948, 675570369, 675525606, 675993085, 676537871, 676824629, 676830113, 676660776, 676355004, 675929546, 675464094, 675010085, 674536288, 673965871, 673250854, 672467947, 671701968, 670924366, 670133591, 669426858]
3289.8F69426858o32524p25091q95738j008213r98735p93934n50330o65545j126826
3308.2F62029922j478672j523674j398325j293241j278937j305700j257240j200796
3324.5F51293337j418650j731396j742363j600265j481950j382590j540959j859962
3340.8F38535202j977325j998544j938045j715362j781225k210677k389431k187073
3357.1F22337520j994371k073169k199888k009869j851976k149164k560258k537072
3373.4F04961753k155542j905978j902044j963139j905799j664519j293063r73821
3389.7E91197848j091778j497745j485885r96470p61330j202584j654088j412213r30667
3408.1E80165088p81834q57651j012385j082063q96036p17938o72937n09739k24769
$$ y = [669426858, 668794334, 668069243, 667173505, 666165292, 665166557, 664372623, 663822293, 663156748, 662029922, 660551250, 659027576, 657629251, 656336010, 655057073, 653751373, 652494133, 651293337, 649874687, 648143291, 646400928, 644800663, 643318713, 641936123, 640395164, 638535202, 636557877, 634559333, 632621288, 630905926, 629124701, 626914024, 624524593, 622337520, 620343149, 618269980, 616070092, 614060223, 612208247, 610059083, 607498825, 604961753, 602806211, 600900233, 598998189, 597035050, 595129251, 593464732, 592171669, 591197848, 590106070, 588608325, 587122440, 586125970, 585364640, 584162056, 582507968, 581095755, 580165088, 579383254, 578525603, 577513218, 576431155, 575535119, 574817181, 574144244, 573634505, 573409736]
3426.5E73409736n3346j02818j00255N4955m9054l86715l69310L457L02970M28677
3446.8E73138297M05669L78072M66287O07550P90120R01997P55071O99222J040697
3465.2E79182982J227141Q15332L15010L74020P57455J043022J036227P11143O02662
3483.6E86064994Q51930R23872Q16583Q58784J007080J109242J056970R74595R90033
3501.9E94654083Q42572O40273P89702J119017J301885J213074R90688R53853J149416
3520.3F03654563J375318J264930R23931R40264J199305J308024J392364J366735J163363
3538.6F14588797J249552J511514J396656J010358Q90613J041651J190901J283109
3554.9F24163151J338601J346767J256227J012802R12965J427710J826823J483261
$$ y = [573409736, 573356390, 573253572, 573153317, 573208272, 573159218, 572772503, 572403193, 572406650, 572709620, 573138297, 573543966, 573922038, 574388325, 574995875, 575785995, 576687992, 577443063, 578142285, 579182982, 580410123, 581225455, 581540465, 581914485, 582671940, 583714962, 584751189, 585462332, 586064994, 586916924, 587840796, 588657379, 589516163, 590523243, 591632485, 592689455, 593664050, 594654083, 595496655, 596136928, 596926630, 598045647, 599347532, 600560606, 601551294, 602505147, 603654563, 605029881, 606294811, 607218742, 608159006, 609358311, 610666335, 612058699, 613425434, 614588797, 615838349, 617349863, 618746519, 619756877, 620647490, 621689141, 622880042, 624163151, 625501752, 626848519, 628104746, 629117548, 630030513, 631458223, 633285046, 634768307]
3571.3F34768307J246393J424909J606702J709223J815975J753151J552582J602531
3587.6F47479773J869857J721382J529217J733541J902759J765728J663149J637697
3603.9F61303103J458347J432419J579105J543582J547873J391172J166583J431405
3620.2F72853589J537859J178444O77109O39617J401246J419782J071334R81272Q78810
3638.6F82639062Q36969P99894N24402J59383L41355R77874P58529K73704N34475Q22962
3659F88668609M31358J07527O8248j94848m36664J8895k9147m67777J28150N63443
3679.4F88857794M99666M98652M16398J54197j5497K56240N00024L95417J10328j60873
3699.8F91512346j20461K03789J76370j58847l68416m3571M41968K82944r1791k28823
$$ y = [634768307, 636014700, 637439609, 639046311, 640755534, 642571509, 644324660, 645877242, 647479773, 649349630, 651071012, 652600229, 654333770, 656236529, 658002257, 659665406, 661303103, 662761450, 664193869, 665772974, 667316556, 668864429, 670255601, 671422184, 672853589, 674391448, 675569892, 676247001, 676886618, 678287864, 679707646, 680778980, 681760252, 682639062, 683476031, 684275925, 684800327, 684959710, 685301065, 686278939, 687037468, 687311172, 687845647, 688668609, 689099967, 689207494, 689275742, 689080894, 688644230, 688663125, 688633978, 688166201, 688294351, 688857794, 689357460, 689856112, 690272510, 690426707, 690411210, 690667450, 691167474, 691562891, 691673219, 691512346, 691391885, 691595674, 691772044, 691613197, 691244781, 691201210, 691643178, 691926122, 691834331, 691605508]
3720.1F91605508k03311k26498r1553J21594k8312l04342k92122J73211N32747J50978
3740.5F91437900o45995o70850J46448j41680m73857L04759N46574Q9050j20461R5129
3760.9F90567017N9962j68026k45750k67207l5763J59502L4988j88112k79963k00928
3781.3F89435720k52068k38180n2631J1862n4181k58625l64780k04325l63707l34740
3801.7F87324345J14203m2737J1683K73466O0141l12984k76387m1306l77953j87397
3822.1F86545074K19047M7565k7538j31249j86205j57178m11212l86179J21058K59876
3842.5F85893059K57730K51889r5546q37207j320660o1154Q00013L07858j40130l22640
3862.9F84733212r4831j192l41714k38478K3425Q0764l5822l43681j36375M5002j28985
$$ y = [691605508, 691402197, 691175699, 691084146, 691205740, 691177428, 690873086, 690580964, 690754175, 691286922, 691437900, 690791905, 690121055, 690267503, 690125823, 689651966, 689956725, 690503299, 690592349, 690471888, 690567017, 690626979, 690458953, 690213203, 689945996, 689910233, 690069735, 690104723, 689916611, 689636648, 689435720, 689183652, 688945472, 688892841, 688904703, 688850522, 688591897, 688227117, 688022792, 687659085, 687324345, 687438548, 687395811, 687407494, 687680960, 687741101, 687428117, 687151730, 687110424, 686732471, 686545074, 686764121, 686811686, 686784148, 686652899, 686466694, 686309516, 685898304, 685512125, 685633183, 685893059, 686150789, 686402678, 686307132, 685469925, 684149265, 684088111, 684888124, 685195982, 685055852, 684733212, 684638381, 684637189, 684295475, 684056997, 684080422, 684161186, 684125364, 683781683, 683645308, 683690310, 683561325]
3885.4F83561325n1141k13504l27169M5359Q5830l06427n09918m45843k83837P6652
3905.7F81631327J93596m9890k03728k48432l53992l20912j00553n8889j73152j29342
3926.1F80186033r7096k30372k46405j41084j91570l03626l49402k47598J1623J23680
3946.5F78514183J52468K38240K34306J93715J99556J49250N0843O1154O2347m8935
3966.9F79807127j08362r7513n9545J1325j3471j19209j07884k9028o6817j50025j24454
3989.4F78942144o4969p4208q7440r0122
3997.5F78625405
$$ y = [683561325, 683510184, 683296680, 682969511, 683014870, 683100700, 682794273, 682284355, 681838512, 681554675, 681631327, 681824923, 681775033, 681571305, 681322873, 680968881, 680647969, 680547416, 680488527, 680315375, 680186033, 680088937, 679858565, 679612160, 679471076, 679279506, 678975880, 678626478, 678378880, 678390503, 678514183, 678666651, 678904891, 679139197, 679332912, 679532468, 679681718, 679732561, 679793715, 679856062, 679807127, 679698765, 679601252, 679541707, 679553032, 679539561, 679420352, 679312468, 679283440, 679216623, 679066598, 678942144, 678877175, 678802967, 678715527, 678625405]
##END=$$ End of the data block
