##TITLE=G1 - CuSalen $$ Begin of the data block
##JCAMP-DX=5.00 $$ ACD/SpecManager v 10.08
##SPECTROMETER/DATA SYSTEM=Alpha
##DATE=05 May 2014 12:06:40
##DATA TYPE=INFRARED SPECTRUM
##DATA CLASS=XYDATA
##ORIGIN=
##OWNER=
##NPOINTS=1765
##FIRSTX=399.75695801
##LASTX=3997.56933594
##MAXX=3997.56933594
##MINX=399.75695801
##MAXY=0.88430029
##MINY=0.44026595
##XFACTOR=1.0000000000
##YFACTOR=1.000000000000000e-9
##FIRSTY=0.85220635
##DELTAX=2.03957629
##XUNITS=1/CM
##YUNITS=ARBITRARY UNITS
##XYDATA=(X++(Y..Y))
399.8H52206349J521707K424777J303315j256407j765489K49147R62317j134574k848208
418.1H51662934r15528J043737p51018k912223k118051o27757k422630p306517j1254131
436.5H24398816j1010349o798506j80662O025732Q985221Q720100N476833J394391
452.8H37011576m67480j837492p746279j4123738j4905810j3902128n419969J3770997
469.1G92379677K2765875J5965700Q670628M551649O13928j227140K93553J596987
485.4H45610857j28865k414108k666354k621174n845069j0264397p135868M321515
501.7H18856537J1173785P595778K341151J407862K658724J978755o34312j631856
518.1H43746424J58250J439154J26779j782894j512945J42396N66661n80668j020312
$$ y = [852206349, 853728056, 856152833, 857456148, 856199741, 854434252, 854683399, 855645716, 854511142, 851662934, 850747406, 851791143, 851040125, 848127902, 846009851, 845382094, 842959464, 835652947, 824398816, 813388467, 806589961, 806409299, 812435031, 821420252, 830140352, 835617185, 837011576, 836544096, 834706604, 826960325, 812836587, 797930777, 784028649, 778608680, 792379677, 815145552, 831111252, 839781880, 844333529, 844947457, 843720317, 844013870, 845610857, 845481992, 843067884, 840401530, 837780356, 831935287, 821670890, 814535022, 818856537, 830030322, 837626100, 839967251, 841375113, 844033837, 846012592, 845378280, 843746424, 843904674, 845343828, 845470607, 843687713, 842174768, 842317164, 842883825, 842303157, 841282845]
536.4H41282845L52621J331269k65717k976895l070533l4511K090514P28607j162767
554.8H38275433p72417j92702k046943n400598r104430j4562249j7227829p582068
571.1G81386197O984949R170413P85529k697885L881753J1405170J2493431R264946
587.4H32674503N068779K150953J347959P25091j109958j750052K03311K035082J520574
605.8H42866242o42717l112137p334948j7768919k5544107p688225K2043229K7432203
622.1H30250621J4917910N140901O31094q75891j920700m508018n071700P5936M811347
640.4H43451500J374185r148598j5204906m246950J2989402J6105771Q814752L513753
656.7H57648909K338052K386451J442432k78890j458168J18494K048373Q48711m48227
$$ y = [841282845, 841635466, 842966735, 842701018, 839724123, 836653590, 836619079, 838709593, 839438200, 838275433, 837503016, 837310314, 835263371, 829862773, 820758343, 806196094, 788968265, 781386197, 788371146, 797541559, 798327088, 795629203, 799510956, 810916126, 823409557, 832674503, 837743282, 839894235, 841242194, 841967285, 840857327, 839107275, 839310586, 841345668, 842866242, 842223525, 839111388, 831776440, 814007521, 788463414, 780775189, 802818418, 830250621, 845168531, 850309432, 850940526, 850064635, 848143935, 843635917, 838564217, 838640153, 843451500, 844825685, 835677087, 820472181, 816225231, 829214633, 845320404, 854135156, 857648909, 859986961, 862373412, 863815844, 863536954, 862078786, 862197280, 864245653, 865094364, 864646137]
675.1H64646137m7982R32455P54356k30133l28541O68109J159370K18331p54296l02196
695.5H66715610P37548N66423o72996j166463k95580M24922l51548j523733j543045
713.8H62891138q84891j575708l882587o150604q475720j4455200l0451119n7668268
730.2G39347041o6224933k0645499L7300884M2450488J2823284k972365K433300l56614
746.5G44155586k3657084k5725007K203226J6739786J8228233K0217776J6996384K0473659
762.8G89632559K7569413K2019506J1203706N786955M038513K276420L22521q63433
779.1H61986160j464784k587736m323661n075157k106487M452109R022713Q063137
795.4H67966294M980922L396928K610505J358867K50518M23193J242816J047969j24514
$$ y = [864646137, 864598155, 865530610, 866284966, 866054833, 865726292, 866394401, 867553771, 867772102, 867017806, 866715610, 867453158, 868019581, 867346585, 866180122, 865884542, 866309464, 865957916, 864434183, 862891138, 862006247, 860430539, 856547952, 850397348, 841921628, 827466428, 797015309, 739347041, 673122108, 652476609, 689777493, 732227981, 745051265, 742078900, 744512200, 744155586, 720498502, 694773495, 696976721, 713716507, 731944740, 752162516, 769158900, 789632559, 817201972, 839221478, 850425184, 856212139, 860250652, 862527072, 862849593, 861986160, 860521376, 857933640, 853609979, 848534822, 846428335, 850880444, 859903157, 867966294, 872947216, 876344144, 878954649, 880313516, 880564034, 880987227, 882230043, 883278012, 883153498]
813.8H83153498n34177L64066R92596L24309o73414n16653L28720K66731p93517j368582
834.2H81543577q86262p55727k287090n334556r980977j6606807j8388689p986426
850.5H19317043J547634j841008r56178J3442934K2215843J6596258P919609L219962
866.8H81462097O98328p32004p21217m4465j04725j125693j938761k030313k358973
885.2H73104274l864050n303561m697979k429247j550495l707469p935583j4579833
901.5H29036057k4197996k3810923L035903L4161687L5876453J8732131O321311J356124
917.8H80510747n900k73645j611293m328668n963623n935133m992962K63870O926298
936.2H64589691P128477L344357N56648j551509l561437o372511j2965203k1778583
$$ y = [883153498, 882619321, 882983387, 883975983, 884300292, 883626878, 883110225, 883438945, 883705676, 882912159, 881543577, 880657315, 879901588, 877614498, 872279942, 862298965, 845692158, 827303469, 819317043, 820864677, 819023669, 818067491, 831510425, 853726268, 870322526, 878242135, 881462097, 882160425, 881428421, 880707204, 880662739, 880558014, 879432321, 877493560, 875463247, 873104274, 869240224, 863936663, 859238684, 856809437, 855258942, 851551473, 843615890, 829036057, 804838061, 781027138, 784063041, 818224728, 854101181, 872833312, 879154623, 880510747, 880504847, 880231202, 878619909, 874291241, 868327618, 862392485, 857399523, 857663393, 864589691, 871718168, 875062525, 875619173, 874067664, 870506227, 864133716, 851168513, 829389930]
952.5H29389930j7066419O731510K3196280J7470121N555272r27150k689421l079414
968.8H58580709l929258m997015j0601520j9881726j1582553J5252769K5765478J4634073
985.1H63240957M898370J644074K35677l22163o4373J64628k54631r28044j114965
1003.5H67499530q84235j006901j634359j949191j395285q57294j263917k774953n841911
1021.8H49891484j1533022j3718903m895985N369126Q648813R474933P292271K180517
1038.1H52709234j601279l803313o323874j1987686k2492349k9948771j7613590J1893690
1054.5G70832062L1033993K7748763J6196132P855952L068626M8816j972795l230095
1070.8H51581454l964424l653169k503156k373755n408585j2777210j9457101j1201620
$$ y = [829389930, 812323511, 819055021, 842251301, 859721422, 865276694, 864349544, 861660123, 858580709, 854651451, 849654436, 839052916, 819171190, 807588637, 822841406, 848606884, 863240957, 868139327, 869783401, 870019078, 869696915, 869632542, 869797170, 869542539, 868614495, 867499530, 866615295, 865608394, 863974035, 862024844, 860629559, 859772265, 858508348, 855733395, 849891484, 838358462, 824639559, 819743574, 825112700, 833761513, 843236446, 850528717, 852709234, 851107955, 847304642, 840980768, 828993082, 806500733, 776551962, 758938372, 770832062, 801866055, 829614818, 845810950, 853666902, 856735528, 856784344, 854811549, 851581454, 847617030, 843963861, 841460705, 839086950, 833678365, 820901155, 801444054, 790242434]
1087.1G90242434J0621845K1404147J4265776M983246J464665J272321J432479N25474
1103.4H46212387p97987j429796j560390k182007l627062n307197p600606j3113379
1119.7H10593963k6868403m6071172m4224203K2114M8029422M9448014J9388616j1084497
1136G99233854m2282760n6432188j8631279L9062678N1276207K6271522J0612071J2107432
1152.4H21217537J3335347R427667N515516K800166J039744L31163l8862j051069k490520
1170.7H50086689l608286m470647n910754q140504j0942579j5835285k5753677m1081488
1187G34343469n0011098l2130957M866004K6649892L1223596L6850929L6387324K3707569
1203.3H11886728J0389030M163682L200770K500236k086j828135j154124J276195L451645
$$ y = [790242434, 800864279, 822268426, 836534202, 841517448, 842982113, 844254434, 845686913, 846212387, 845414400, 843984604, 842424214, 840242207, 836615145, 831307948, 823707342, 810593963, 783725560, 737654388, 693430185, 693452299, 741481721, 790929735, 810318351, 799233854, 756951094, 700518906, 681887627, 720950305, 772226512, 798498034, 809110105, 821217537, 834552884, 843980551, 849496067, 852296233, 853335977, 853667140, 853628278, 852577209, 850086689, 846478403, 842007756, 836097002, 827956498, 817013919, 801178634, 775424957, 734343469, 684332371, 652201414, 657067418, 683717310, 714940906, 751791835, 788179159, 811886728, 822275758, 826439440, 829640210, 832140446, 832138360, 830310225, 829156101, 830432296, 833883941]
1221.7H33883941L332079J629054M59731N0902r23157l812193q620978q924842J754880
1240.1H18829417J3086021J0992646J079858j258970N335212Q331657M116416J34408
1256.4H60646665n86390M3094N6505o62386j045228q83936r24349j628757k440989
1274.7H52574229k774179k736211k977967l621936m176080m455745m955232o095648
1291H20781231p635892r521901j2657225j7298877j9057870j2511492r54867P462383
1307.4G48605490J1260032J2429119J0995209P374286K488912k929926q039713j3169408
1323.7G69014001j8737197j7200112o263197l268659j0437190k924264K3554921L7808359
1340G71546662K3612559K737701j3595105k4641454j1012256K5575876M2589903K7909279
$$ y = [833883941, 837216020, 838845074, 839304805, 839355707, 838432550, 834620357, 825999379, 817074537, 818829417, 831915438, 842908084, 843987942, 842728972, 848064184, 856395841, 860512257, 860646665, 860060275, 860103369, 860159874, 859497488, 858452260, 857568324, 856643975, 855015218, 852574229, 849800050, 847063839, 844085872, 840463936, 836287856, 831832111, 826876879, 820781231, 813145339, 803623438, 790966213, 773667336, 754609466, 742097974, 741143107, 748605490, 759865522, 772294641, 783289850, 790664136, 793153048, 790223122, 782183409, 769014001, 750276804, 733076692, 726813495, 723544836, 713107646, 710183382, 733738303, 771546662, 795159221, 797896922, 784301817, 759660363, 748648107, 774223983, 816813886, 844723165]
1356.3H44723165R939313K052903J31965R2566m72248j583278k101958k278328k891421
1374.7H47612679m268587o877899j1142432j8124939k7278840k7976513n634069J7993271
1391G64302671K0513117J5168846J3402879J1478901P091522K806247M00304l46124
1407.3H34818363o29067j488328l325761n709290q972406j3254583j7540872k4991692
1423.6G58906364k8243422j3963640P175923J2317955K187193l908873j959801o042719
1439.9G26468980k3407221m8260748o7031264n8633089r332121M8394561P8100383
1454.2F46299481Q0171466M8495233l20613k6247025l8125395l9817691j3857901L8405001
1470.5F95002556P7022016N5770159K0336091P011712J900494n43177j394689j906395
$$ y = [844723165, 854662478, 856715381, 856847346, 856939912, 856467664, 854884386, 852782428, 850504100, 847612679, 843344092, 836466193, 825323761, 807198822, 779919982, 751943469, 746309400, 764302671, 784815788, 799984634, 813387513, 824866414, 831957936, 834764183, 835164487, 834818363, 834189296, 832700968, 829375207, 823665917, 814693511, 801438928, 783898056, 758906364, 730662942, 716699302, 723875225, 736193180, 738380373, 734471500, 732511699, 726468980, 703061759, 654801011, 587769747, 529136658, 519804537, 568199098, 646299481, 726470947, 774966180, 774645567, 748398542, 710273147, 670455456, 656597555, 695002556, 772024572, 827794731, 848130822, 855142534, 857043028, 856499851, 855105162, 853198767]
1486.8H53198767k206624j643538p74980j028061j815855k392710k993345m113495
1503.2H36230159p360816j2738586j3466477j3161182j2425304q422017m998565o627142
1519.5G57030070j4006972k1334947l0243039m1144430l3800185j486421L1037927
1533.7F46052003K0542323q192002m03345N0891578O5632582M4026077K1011054Q422911
1550.1H47983181L057302K49445k037406m186392k788782m92454k002537l816068m745245
1568.4H31221044m349232l191769l784060m665792k959430k087236l482819n505919
1584.7H01194787p738471j0793746j6442358k6777804m0072620m2072594k1093905
1599F36203289R473205K7743876K8622031K1276951J2511134M299879l171682j2459338
$$ y = [853198767, 850992143, 849348605, 848573625, 847545564, 845729709, 843336999, 840343654, 836230159, 828869343, 816130757, 802664280, 789503098, 777077794, 768655777, 763657212, 757030070, 743023098, 721688151, 691445112, 650300682, 616500497, 615014076, 646052003, 666594326, 658402324, 657998979, 708890557, 774523139, 818549216, 839560270, 847983181, 851040483, 851289928, 849252522, 845066130, 842277348, 841784894, 839782357, 835966289, 831221044, 826871812, 823680043, 819895983, 815230191, 812270761, 810183525, 806700706, 801194787, 793456316, 782662570, 766220212, 739442408, 699369788, 657297194, 636203289, 645676494, 673420370, 702042401, 723319352, 735830486, 740130365, 736958683, 724499345]
1615.3G24499345k4637699l1334281m0825069n6641340n5743635m1253954k6404083
1629.6D47659284p393330J8949002N2648633N4607451K5352240j789749k7932346n1162958
1645.9E10938227m3512583k136558N2505225J06395721P3775769M0180385L0638218
1660.2G68784404K5033951J9253492J2075007P734239N879819M049421K793252K625406
1676.5H48228991J868129O41048j41323R71198K264798J587629J061380Q43346P69317
1694.9H58094513J156211J642883K654791K806425J704991J069725O35206J73688j92582
1713.2H69745851o16074m31478P83980J259208P52568K59399k22087m76062n25594
1731.6H70529711m00364L83139L96728k4855K00152L31462m7922k40267K09570R68635
$$ y = [724499345, 699861646, 668527365, 627702296, 571060956, 515317321, 474063367, 447659284, 440265954, 459214956, 511863589, 566471040, 591823280, 590033531, 562101185, 510938227, 467425644, 465289086, 517794311, 624190032, 697965801, 738146186, 768784404, 793818355, 813071847, 825146854, 832881093, 838760912, 842810333, 845603585, 848228991, 850097120, 850738168, 850596845, 851568043, 853832841, 855420470, 856481850, 857325196, 858094513, 859250724, 860893607, 863548398, 866354823, 868059814, 869129539, 869764745, 869938433, 869745851, 869129777, 868698299, 869482279, 870741487, 871494055, 871753454, 871531367, 871055305, 870529711, 870129347, 870512486, 870909214, 870884359, 871084511, 871415973, 871368051, 871127784, 871337354, 872305989]
1752H72305989P20382j08600l17156j85072j05322q2195n40971j067222j274704j120210
1772.4H68224919j90139M30167M33683L76165J61052j69039n8114J38163j40250j11580
1792.8H69095027L67225M26531J36017j19924k41280k49445k47479m78744p71940o37412
1813.2H67278576j75119J61350J08123l00288n39124j95086R3996j05381J3054L28541
1833.6H66668642L56137K42234j37210o66619o42776Q7380J01388o25551j071095r13382
1854H63399148l35872Q7559J55330K27928K66671j07229l69608J70112O88433M94480
1874.4H64676952j4126l59416l23534j25885j55210m93527q18193o55651m19974n52535
1894.7H60758901n78404k93672O7115K55704J31249j07109j05024Q4937j8477n94736
$$ y = [872305989, 873026371, 872917771, 872600615, 872415543, 872310221, 872228026, 871687055, 870619833, 869345129, 868224919, 868034780, 868464947, 868898630, 869274795, 869435847, 869266808, 869208694, 869346857, 869206607, 869095027, 869462252, 869888783, 870024800, 869904876, 869663596, 869414151, 869166672, 868687928, 867915988, 867278576, 867103457, 867264807, 867372930, 867072642, 866533518, 866338432, 866432428, 866327047, 866340101, 866668642, 867024779, 867267013, 867129803, 866463184, 865820408, 865907788, 866009176, 865383625, 864312530, 863399148, 863063276, 863150835, 863306165, 863534093, 863800764, 863693535, 863323927, 863494039, 864182472, 864676952, 864662826, 864303410, 863979876, 863853991, 863698781, 863205254, 862387061, 861731410, 861311436, 860758901, 860180497, 859886825, 859953940, 860209644, 860340893, 860233784, 860128760, 860213697, 860195220, 859600484]
1915.1H59600484j088500r52840p09295q00729r55820j136958j165092q86143m07516
1933.5H51497591L62098J186967J406312R93669N66542L77834L74913M28676K78175
1951.9H57472777J8478K6583K38240J74701k29179n62132m96208j56045o4195l11553
1972.3H56111467l94642j72437n2213k33770m31895l53575j05381l8922k44081k74419
1992.6H53810132p75Q6248j52946m22001m38928k21908j13786k53319l52562k24411
2013H51715744o5208q5354k18332k45869o4611J08361L1471j50144j41144J5617L57
2035.5H50900888k31385l75926k42114j2815P331j63376k37763r8884P3075L8683j48058
2057.9H49509656j74045l0279J3768p8678j38521o7234K8014p9036l28421l81112j58131
$$ y = [859600484, 858511984, 857559144, 856849849, 856049120, 855093300, 853956342, 852791250, 851905107, 851497591, 851859689, 853046656, 854452968, 855446637, 856013179, 856391013, 856765926, 857194602, 857472777, 857491255, 857517838, 857756078, 857930779, 857701600, 857139468, 856643260, 856487215, 856423020, 856111467, 855716825, 855544388, 855492175, 855258405, 854826510, 854472935, 854367554, 854328632, 854084551, 853810132, 853809357, 853895605, 853742659, 853320658, 852881730, 852659822, 852546036, 852292717, 851940155, 851715744, 851650536, 851565182, 851346850, 851100981, 851036370, 851144731, 851176202, 851026058, 850884914, 850900531, 850900888, 850669503, 850293577, 850051463, 850038648, 850045979, 849882603, 849644840, 849545956, 849619031, 849657714, 849509656, 849335611, 849305332, 849319100, 849240422, 849101901, 849034667, 849062681, 848983645, 848655224, 848274112, 848115981]
2080.3H48115981j908j25289k78234j71423Q2672J22189p3433j53482K4080J92881
2100.7H47734034R5367j20818j32561K5094M530k30253l40402j73569K4617J1503j26123
2123.2H46771419j25945L7075Q6843j00374k71678j75357N0962J38998Q1242M4345
2143.6H46537530R8944J39296K2352j64092j77681k2411M1961q2910j94609j29044
2164H46069336r358m6074j89007k37584j60634q4818j10686j73568j20104J6034J9431
2186.4H44972968j31547k26558j64568p3016r2983k08080k49743j22845J19o9499k37584
2208.8H43396664k49803r0719k9146j71960k78830j91272p5161j25110k74658k87652
2229.2H41622353j34111j6451n7697j32978n8770O6340K5391j46031k02000l9697J21892
$$ y = [848115981, 848114073, 847988784, 847710550, 847539127, 847621799, 847743988, 847670555, 847517073, 847541153, 847734034, 847829401, 847708583, 847576022, 847601116, 847605646, 847375393, 847034991, 846861422, 846886039, 846897542, 846771419, 846645474, 846682549, 846769392, 846669018, 846397340, 846221983, 846272945, 846411943, 846493185, 846537530, 846636474, 846775770, 846798122, 846634030, 846456349, 846433938, 846475899, 846392989, 846198380, 846069336, 846059978, 846013904, 845824897, 845587313, 845426679, 845341861, 845231175, 845057607, 844937503, 844953537, 844972968, 844841421, 844614863, 844450295, 844377279, 844284296, 844076216, 843826473, 843703628, 843703747, 843634248, 843396664, 843146861, 843056142, 843026996, 842855036, 842576206, 842384934, 842309773, 842184663, 841910005, 841622353, 841488242, 841471791, 841414094, 841281116, 841222346, 841288686, 841314077, 841168046, 840966046, 840926349, 841048241]
2251.7H41048241R5665j3292j5974P4446K146k98738n12421m43221k85029k33412j81019
2274.1H39237392J2696K69055L66271J67608j53303k98679k30432j95682l16322l90350
2294.5H38468254k61009j14262k23756m83155n77808n15401n48661p41064q43943p29262
2314.9H33429933o48499p63774r15289q69274n73635l69430m88877o26504n38648m09245
2335.3H27226758m34101n87642n62131Q8572J241088J455903K28584j226664j878678
2353.6H25551689j722634j356065q60155k85745L57151R33111J190901J255452J286924
2372H26350629J151979R76920J121879J415968J370788R14514L34620n1319j06812
2390.4H33479166K6345Q6665j0252j05798q9764n2512r9957j54138r7274J4007K9325
$$ y = [841048241, 841143906, 841130614, 841114640, 841189086, 841191232, 840892494, 840380073, 839936852, 839651823, 839418411, 839237392, 839250088, 839519143, 839885414, 840053022, 839899719, 839601040, 839370608, 839174926, 838858604, 838468254, 838207245, 838092983, 837869227, 837386072, 836808264, 836292863, 835744202, 835003138, 834159195, 833429933, 832781434, 832017660, 831102371, 830233097, 829659462, 829290032, 828801155, 828174651, 827636003, 827226758, 826792657, 826205015, 825642884, 825731456, 826972544, 828428447, 828657031, 827430367, 825551689, 823829055, 822472990, 821612835, 821327090, 821684241, 822617352, 823808253, 825063705, 826350629, 827502608, 828479528, 829601407, 831017375, 832388163, 833302677, 833637297, 833585978, 833479166, 833505511, 833592176, 833581924, 833476126, 833386362, 833333850, 833233893, 833079755, 832982481, 832996488, 833025813]
2412.8H33025813r7811k26021j96457q3268q8393k10762k53737j41144m4703j35720
2433.2H31547797l04878l08096j17958K7657n6029j86503j24514R239k8670j72555
2453.6H30285490j64032J967P6591m5299j89245j86622r4950j29879l26872m12046
2474H28815103k27452n4955j78933l74675l19958j15573o5685k18987l15487j76669
2494.4H26766729m112p0811k63571k85387j35661q6188k29657l42488k33233o4373
2514.8H25051248j00791k52128k45452q0109k3484j86622l61025l36886j58667o4552
2535.2H23241532j63675k11060J20K33471J73092o2883j49786m4942K2947q6784k08795
2557.6H22743237j67131n7817q2433k66075l64900k11239k384n543j63675k19702j24634
$$ y = [833025813, 832928002, 832701981, 832505524, 832422256, 832333863, 832123101, 831869364, 831728220, 831683517, 831547797, 831242919, 830934823, 830816865, 830844522, 830788493, 830601990, 830477476, 830486715, 830458045, 830285490, 830121458, 830123425, 830200016, 830154717, 829965472, 829778850, 829683900, 829554021, 829227149, 828815103, 828587651, 828532696, 828353763, 827979088, 827659130, 827543557, 827477872, 827258885, 826943398, 826766729, 826762617, 826691806, 826428235, 826142848, 826007187, 825920999, 825691342, 825348854, 825115621, 825051248, 824950457, 824698329, 824452877, 824372768, 824349284, 824162662, 823801637, 823464751, 823306084, 823241532, 823077857, 822866797, 822866917, 823100388, 823273480, 823210597, 823060811, 823015869, 823038816, 822952032, 822743237, 822576106, 822518289, 822435856, 822169781, 821804881, 821593642, 821591258, 821585715, 821422040, 821202338, 821077704]
2580H21077704q1479k12669l47317k33829M8638J52945R537j05083l8266k742k38955
2602.5H20028484n32866m67002j05500R4592k1577j60276q0169K4319j21236l92198
2622.9H18266571m99785m08411l30091m20332n27620m01616j53125j02937k26080k55525
2643.3H14941049j84954k41935m65989n88298l68416l1352j2756k36511k44319O6101
2663.7H12632620L41356L22461J46628J26421L32475M58836L13640J47224J63555K39432
2684.1H15224648K06410P9573P927K4259K6703l1292o4135k6107n4717k38895m46380
2706.5H14707994n14030m22001l29196l74675m70162m23550k07305j9431l457r9957
2726.9H11844230j56880j05858q1539j32680j32441n9605m1544j26124j96159j60455
$$ y = [821077704, 820996225, 820783556, 820436239, 820202410, 820251048, 820403993, 820413530, 820308447, 820270181, 820267439, 820028484, 819495618, 819028616, 818923116, 819017708, 818996131, 818835855, 818755686, 818780005, 818658769, 818266571, 817766786, 817358375, 817028284, 816607952, 816080332, 815678716, 815525591, 815422654, 815196574, 814941049, 814756095, 814514160, 814048171, 813459873, 813091457, 813060105, 813047349, 812810838, 812566519, 812632620, 812973976, 813296437, 813443065, 813569486, 813901961, 814360797, 814674437, 814821661, 814985216, 815224648, 815431058, 815510631, 815518558, 815542817, 815569520, 815538228, 815474093, 815447986, 815393269, 815154374, 814707994, 814193964, 813771963, 813442767, 813068092, 812597930, 812174380, 811967075, 811947644, 811944187, 811844230, 811687350, 811581492, 811499953, 811367273, 811234832, 811175227, 811133683, 811007559, 810811400, 810650945]
2747.3H10650945j09434j73033k84970l21090k87652k51770k92837l83854l64483k15113
2767.7H07966709p9572k8968l2008l5822m4703q8454j58489j90496j22130p3254j88470
2790.1H06924343k93553j68800P3314J45554j7881j47105j13904n5790r2566k89619
2810.5H05963993m96268m86732l73602l70323m54367n17308n83947p68006j077950
2828.9H00835490j282096j074075m77255N5790p093n95152j140773j515627j817406
2847.2G92981803j622796n21898Q97229J589477J369536Q35597M56631K44737n364
2865.6G96224952k98023l97325l28720l73363n22256n29409m01377l43502m57287o89089
2886G91884601q90911j028835j257599j672089k065122k249300k383352k633929k793372
$$ y = [810650945, 810541511, 810368478, 810083508, 809762418, 809474766, 809222996, 808930159, 808546305, 808181822, 807966709, 807887137, 807858169, 807826161, 807790339, 807745636, 807657182, 807498693, 807308197, 807186067, 807112813, 806924343, 806630790, 806461990, 806535304, 806680858, 806662977, 806515872, 806401968, 806346178, 806253612, 805963993, 805467725, 804980993, 804607391, 804237068, 803782701, 803265393, 802681446, 801913440, 800835490, 799553394, 798479319, 798002064, 798057854, 798050761, 797455609, 796314836, 794799209, 792981803, 791359007, 790837109, 791734338, 793323815, 794693351, 795528948, 795985579, 796230316, 796224952, 795926929, 795529604, 795200884, 794827521, 794305265, 793775856, 793374479, 793030977, 792573690, 791884601, 790993690, 789964855, 788707256, 787035167, 784970045, 782720745, 780337393, 777703464, 774910092]
2904.3G74910092k464354j754045j191437q18074j33813Q69155J234830K56538j324236
2922.7G69584656j747728L66986L973723N928456N051077L068507J408875J51336q41797
2941G86944091j671791k589643l855228n364299o039739m028022Q87454N549073O981671
2959.4G76813567N746483L716946J948059P98225J77622o3062j33693l07023n06878
2977.8G88190246n80013n57542m12166k25186j04428M3571J21415k563j92523n55217
2998.1G85725594j112938j562596k019584k706170l432214l674865k876520j549721
3014.5G66790986j250923j814723p79688K521336N413294N843282M436910K494573
3030.8G83655047P24972p38085j930177k762198l315866l732562l894627l275216j341164
$$ y = [774910092, 772445738, 770691693, 769500256, 768682182, 768548369, 769417524, 770652354, 770908892, 769584656, 767836928, 768203914, 772177637, 778106093, 783157170, 786225677, 787634552, 787785888, 786944091, 785272300, 782682657, 778827429, 773463130, 767423391, 763395369, 764282823, 769831896, 776813567, 782560050, 786276996, 788225055, 789023280, 789200902, 789137840, 789004147, 788697124, 788190246, 787610233, 787052691, 786640525, 786415339, 786310911, 786354482, 786475897, 786473334, 786280811, 785725594, 784612656, 783050060, 781030476, 778324306, 774892092, 771217227, 768340707, 766790986, 765540063, 763725340, 762945652, 765466988, 770880282, 776723564, 781160474, 783655047, 784380019, 783641934, 781711757, 778949559, 775633693, 771901131, 768006504, 764731288, 763390124]
3049.1G63390124J152038K495408K214671J367390J223683K034486K673268K088547
3065.5G78639615N67555r71079k111137k655983k045929k42233J601100K528965K760887
3083.8G78071761K814055K851367K563595J671076O67274J69754O3241j23024m12941
3102.2G88336158m72486l23177l29554n74112o14106l00288j17839k74002o17445q77261
3122.6G83835888p69556m86076m44293o70790p88152n60403k39671k07662m06981m25875
3143G78836429k63929k52962l29852l51489m96507p02739p40945o82771n94854n08488
3163.4G73911893n50627o91951p43448o60003o13570p14898q25643p94054p34269p62761
3183.7G66820669q20160q33571p77006p04169p25627q19624q51869q45373q70704r26257
$$ y = [763390124, 764542162, 767037570, 769252241, 770619631, 771843314, 773877800, 776551068, 778639615, 779207170, 778236091, 776124954, 773468971, 771423042, 771180809, 772781909, 775310874, 778071761, 780885816, 783737183, 786300778, 787971854, 788639128, 788808882, 788872123, 788749099, 788336158, 787863672, 787540495, 787210941, 786636829, 786022723, 785722435, 785604596, 785330594, 784713149, 783835888, 783066332, 782580256, 782135963, 781465173, 780677021, 780116618, 779876947, 779669285, 779262304, 778836429, 778572500, 778319538, 777989686, 777638197, 777141690, 776438951, 775698006, 775015235, 774420381, 773911893, 773361266, 772669315, 771925867, 771265864, 770652294, 769937396, 769111753, 768317699, 767583430, 766820669, 766000509, 765166938, 764389932, 763685763, 762960136, 762140512, 761288643, 760443270, 759572566, 758646309]
3204.1G58646309r78231r66370r24468r38893r89735r98795r81211r88722j009107
3222.5G49870777j032472j047611r94384q91566q97944j047910j126706j080454j057803
3240.9G40693927j011670q53360o84320o54579p20083p63536p59840p30276p37548
3259.2G33778715p75158p91490p90716p88033p56859p22051p14302o99937p16508q09073
3279.6G26214588r00805q85606q03769p67588q07822q63612r12487r89497j081467
3298G18201935j191258j305819j353502j385987j574754j840473j909256j798570j772344
3316.3G04069972j861691j896084j868188j897812k085328k273023k247453k161860
3332.6F87778533k127409k124966k277434k483367k583564k692520k658368k423644
$$ y = [758646309, 757668078, 756701708, 755777240, 754838347, 753848612, 752849817, 751868606, 750879884, 749870777, 748838305, 747790694, 746796310, 745904744, 745006800, 743958890, 742832184, 741751730, 740693927, 739682257, 738828897, 738144577, 737489998, 736769915, 736006379, 735246539, 734516263, 733778715, 733003557, 732212067, 731421351, 730633318, 729876459, 729154408, 728440106, 727740169, 727023661, 726214588, 725313783, 724428177, 723624408, 722856820, 722048998, 721185386, 720272899, 719283402, 718201935, 717010677, 715704858, 714351356, 712965369, 711390615, 709550142, 707640886, 705842316, 704069972, 702208281, 700312197, 698444009, 696546197, 694460869, 692187846, 689940393, 687778533, 685651124, 683526158, 681248724, 678765357, 676181793, 673489273, 670830905, 668407261]
3348.9F68407261k525031k967060l125548k939165k806663k898991k960980k728403
3365.3F45455420k536893k793074l210663l203094k823830k564847k479077k431989
3381.6F23411953k367556k167821j799821j486898j596928j952588j920641j448392
3397.9F08671308j226187j675785k088010j757503j237809j152039j299500j412213
3414.2E96822262j385391j156866r40860q37803o46770l61442k14160l06964k82764
3432.6E90689242k1398k8372l11732l02732L7253L10778M54843O14047P31588P24435
3453E92897952P33494Q82566J007617R55641J064301J444459J548171J113355O28888
3471.3F02276444O66023J050234J344144J291990J013518J034796J280427J269996
$$ y = [668407261, 665882230, 662915170, 659789622, 656850457, 654043794, 651144803, 648183823, 645455420, 642918527, 640125453, 636914790, 633711696, 630887866, 628323019, 625843942, 623411953, 621044397, 618876576, 617076755, 615589857, 613992929, 612040341, 610119700, 608671308, 607445121, 605769336, 603681326, 601923823, 600686014, 599533975, 598234475, 596822262, 595436871, 594280005, 593339145, 592501342, 591854572, 591493130, 591278970, 590972006, 590689242, 590667844, 590639472, 590327740, 590025008, 590062261, 590373039, 590827882, 591441929, 592173517, 592897952, 593631446, 594514012, 595521629, 596477270, 597541571, 598986030, 600534201, 601647556, 602276444, 602942467, 603992701, 605336845, 606628835, 607642353, 608677149, 609957576, 611227572]
3487.6F11227572J170695J264274J390874J410842J307011J246929J291752J245558
3504F21555507J182139J256287J459182J677930J633763J402915J341641J476466J644850
3522.3F34630680J566231J333177J405776J675963J797140J823008J766920J659274
3538.6F47658169J719475J774252J618325J474321J551330J647055J680255J782120
3554.9F60905302J842618J816511J737833J459121J199604J713812K539337K482295
3571.3F75696433K076387K037585K210557K351880K408862K184749J704991J760065
3587.6F92431509K469481K540707K186597K259969K460361K406656K350033K176106
3603.9G11281419J767397J714825K016902K091945K102553J960457J841724K320707
$$ y = [611227572, 612398267, 613662541, 615053415, 616464257, 617771268, 619018197, 620309949, 621555507, 622737646, 623993933, 625453115, 627131045, 628764808, 630167723, 631509364, 632985830, 634630680, 636196911, 637530088, 638935864, 640611827, 642408967, 644231975, 645998895, 647658169, 649377644, 651151896, 652770221, 654244542, 655795872, 657442927, 659123182, 660905302, 662747920, 664564431, 666302264, 667761385, 668960989, 670674801, 673214138, 675696433, 677772820, 679810405, 682020962, 684372842, 686781704, 688966453, 690671444, 692431509, 694900990, 697441697, 699628294, 701888263, 704348624, 706755280, 709105313, 711281419, 713048816, 714763641, 716780543, 718872488, 720975041, 722935498, 724777222, 727097929]
3620.2G27097929K482354J799822R21071Q74102K057373K420366J981556J662136J359939
3638.6G42656648J130700R65476M88282j98126O6161J523137J873493J152635R85026
3656.9G50643432J178742Q23617L99708J43409m03345p38620j14858k5094l57091N95092
3677.3G52144992J264394J016915O13153O6697l94523j65820O64353R76026O46413
3695.7G56832600J72078j92106j05023L61919K97130l58999p64787p0691R26733P60197
3716.1G57859051M77m91619m82500k01285J02461J74761k83718q48532o57916L75330
3736.5G55546510R26972K32100r33766j036942j4305j19508l08334O67393R21666K49029
3756.9G56130815o7115K59936K79486q1599k29955j76072J31428L33548Q0049k38895
$$ y = [727097929, 729580283, 731380105, 732301176, 733175278, 735232651, 737653017, 739634573, 741296709, 742656648, 743787348, 744752824, 745241106, 745042980, 745109141, 746632278, 748505771, 749658406, 750643432, 751822174, 752645791, 753045499, 753188908, 752785563, 752046943, 751932085, 751906991, 751549900, 752144992, 753409386, 754426301, 755039454, 755106151, 754711628, 754545808, 755210161, 756186187, 756832600, 757004678, 756812572, 756707549, 757069468, 757366598, 757007599, 756242812, 756172121, 757098854, 757859051, 757859528, 757367909, 756885409, 756684124, 756786585, 756961346, 756677628, 755829096, 755171180, 755546510, 756473482, 756705582, 755771816, 754734874, 754720569, 754601061, 754292727, 754960120, 755881786, 756130815, 756063700, 756323636, 756603122, 756521523, 756291568, 756115496, 756246924, 756580472, 756660521, 756421626]
3777.3G56421626k80083r4235r0241j17064N4241Q1539j06216m07993o37055o31988
3797.7G54192531p66396n17667K45869K65241L14117N39481O2168o59824p99834m67539
3818G52408147m58062R3401P29620L79264o4492l02970l83079l52800n78165n43952
3838.4G50926912J48535N82575N60880K83301l42369j290381j721442m9472J230419
3856.8G50328958O37233j83642n33104k83420j39773m02092j76728K85148L56615O5863
3877.2G49955058m03643k83122K921n8472O9976o6817k32399J22130R5845m89951q29100
3899.6G47882426o07193p5936M84943N85854J98365j44244l37541m72247l26515k4974
3920G47162938M7803l0100j729l3796j96397j01089J48534Q7202j63496l56972l47495
$$ y = [756421626, 756141543, 756047308, 755957067, 755840003, 755894244, 755975783, 755869567, 755461574, 754824519, 754192531, 753426135, 752908468, 753154337, 753419578, 753733695, 754273176, 754335344, 753675520, 752875686, 752408147, 751950085, 752043486, 752773106, 753152370, 753087878, 752784908, 752401829, 752049029, 751470864, 750926912, 751075447, 751658022, 752218902, 752502203, 752159834, 750869453, 749148011, 749098539, 750328958, 750966191, 750782549, 750249445, 749966025, 749826252, 749424160, 749247432, 749532580, 749889195, 749955058, 749551415, 749268293, 749271214, 749212742, 749282718, 749215901, 748983502, 749105632, 749201477, 748711526, 747882426, 747275233, 747199297, 747684240, 748270094, 748468459, 748324215, 747986674, 747514427, 747187912, 747162938, 747210741, 747180641, 747178912, 747145116, 746948719, 746847630, 746996164, 747083366, 746919870, 746562898, 746215403]
3942.5G46215403j15812l0339q1241M471J10626J02580M4286J5378l219n364j2815
3964.9G46243954l9757l4391q1540j58250j23024n7518n3466l0815j133p6890j42574
3987.3G45444596q4877k9266m9651j18017j39892
3997.5G45022893
$$ y = [746215403, 746099591, 746069252, 745988011, 745992482, 746103108, 746205688, 746249974, 746265352, 746262133, 746256769, 746243954, 746204197, 746169806, 746088266, 745930016, 745806992, 745749474, 745696008, 745665193, 745664060, 745587170, 745444596, 745359719, 745330453, 745280802, 745162785, 745022893]
##END=$$ End of the data block
