##TITLE=G08-52-SE $$ Begin of the data block
##JCAMP-DX=5.00 $$ ACD/SpecManager v 10.08
##SPECTROMETER/DATA SYSTEM=Alpha
##DATE=17 Oct 2013 10:58:30
##DATA TYPE=INFRARED SPECTRUM
##DATA CLASS=XYDATA
##ORIGIN=
##OWNER=
##NPOINTS=1765
##FIRSTX=399.75695801
##LASTX=3997.56933594
##MAXX=3997.56933594
##MINX=399.75695801
##MAXY=0.83274502
##MINY=0.34789515
##XFACTOR=1.0000000000
##YFACTOR=1.000000000000000e-9
##FIRSTY=0.59705007
##DELTAX=2.03957629
##XUNITS=1/CM
##YUNITS=ARBITRARY UNITS
##XYDATA=(X++(Y..Y))
399.8E97050071k592623k038897j241445n53966n18679l38912O53445J169622j21116
418.1E91467500j552582j175165p11501r72092j551509j763642j167178m93824m85301
436.5E81594706n13554K62082J534819J911342Q67665j45018k09272J44482j27077
454.8E85320175j382888k189457j596630j128673j719952k707600k713621j588762
471.1E70292592r99212j705170k226829j365185j21355o1929r50218j251578o67572
489.5E60943544m07159j239598k352596k312123j341343j154542k325773l257335k688110
507.9E43864965j641869j867533l006041l180444k010167r40680j137078j717389r90748
526.2E27373016N98311J080573M37617M89712J958251L241777K732456J194120L77416
$$ y = [597050071, 594457448, 592418551, 591177106, 590623140, 590104461, 589765549, 590418994, 591588616, 591467500, 589914918, 588739753, 588028252, 587056160, 585504651, 583741009, 582573831, 582080007, 581594706, 581081152, 581343234, 582878053, 584789395, 585657060, 585512042, 585302770, 585447252, 585320175, 583937287, 581747830, 580151200, 579022527, 577302575, 574594975, 571881354, 570292592, 569293380, 567588210, 565361381, 563996196, 563874841, 563812912, 562862694, 561611116, 560943544, 560536385, 559296787, 556944191, 554632068, 553290725, 552136183, 549810410, 546553075, 543864965, 542223096, 540355563, 537349522, 534169078, 532158911, 531218231, 530081153, 528363764, 527373016, 527971327, 529051900, 529489517, 529979229, 531937480, 535179257, 537911713, 539105833, 539483249]
544.6E39483249N56350M00543p75397j765012j595021r39727j074492k066374k601862
562.9E29622257k066732j596749j922786k015590r81689P16209J708508J476824J410246
581.3E26350498K415180L295303K834976J554429Q20637R34183R51589L32355m00424
599.6E39088726l15845M91381P49349J67132j83881K50519R81390J178980Q11815R80735
620E44200301K076805L027260K919138K260744K135277K479196K384245J763225J270711
638.4E64516902J276970J560092J552641J015127N46694O49035R44674Q31067K54691
656.7E73147893q5950L03805R12845J042247Q22842O59287J068950J552462J468659
675.1E80893040J057625J116395J589238J685977J058519L92914L54886M65035j12593
$$ y = [539483249, 540039599, 540440142, 539664745, 537899733, 536304712, 535364985, 534290493, 532224119, 529622257, 527555525, 525958776, 524035990, 522020400, 521038711, 521754920, 523463428, 524940252, 526350498, 528765678, 532060981, 534895957, 536450386, 537271023, 538205206, 539156795, 539489150, 539088726, 538772881, 539264262, 540013611, 540180743, 539996862, 540247381, 541228771, 542407751, 543219566, 544200301, 546277106, 549304366, 552223504, 554484248, 556619525, 559098721, 561482966, 563246191, 564516902, 565793872, 567353964, 568906605, 569921732, 570468426, 571117461, 572062135, 572893202, 573147893, 573061943, 573365748, 574278593, 575320840, 576143682, 576802969, 577871919, 579424381, 580893040, 581950665, 583067060, 584656298, 586342275, 587400794, 587793708, 588148594, 588613629, 588501036]
693.5E88501036j093566j398802o11365M23372Q09848P50780J183629K267421K974510
711.8E93806863K800941K630234L243089M242241M569352L872573L320754L679573
728.1F22165620M031658L282309J896799J247644J518607J504302M85599n49078n54740
746.5F35028720k2352j61409j137376j833916j499712p84219o97135r15230k09152
764.8F27768219J565933L088593L507018L499866M029393M802227M763484L807843
781.2F56832576K901315K684653K697647K219915J402021J203239J884341K582252
797.5F74407959K589047K216756K196431K509714K389967J415253M27603L31045N96761
815.8F89080536K79665o18994j389265j520634j529872k114236k826214k873898k293765
$$ y = [588501036, 587407470, 586008668, 585397303, 585820675, 586630523, 587381303, 588564932, 590832353, 593806863, 596607804, 599238038, 602481127, 606723368, 611292720, 615165293, 618486047, 622165620, 626197278, 629479587, 631376386, 632624030, 634142637, 635646939, 636132538, 635583460, 635028720, 635006368, 634844959, 633707583, 631873667, 630373955, 629589736, 628892601, 627977371, 627768219, 629334152, 632422745, 635929763, 639429629, 643459022, 648261249, 653024733, 656832576, 659733891, 662418544, 665116191, 667336106, 668738127, 669941366, 671825707, 674407959, 676997006, 679213762, 681410193, 683919907, 686309874, 687725127, 688152730, 688483775, 689080536, 689360201, 688741207, 687351942, 685831308, 684301436, 682187200, 679360986, 676487088, 674193323]
834.2F74193323j929045k302766k793729k517939j682043j216531j350939j484096
850.5F58916235j100183m12583j21653k08855M30346K325892M345298N105436M684210
868.9F73964143M092455L684580K791584R10818j208901k499223l007650l625214m637719
887.2F70464873n181491m667819l827393l669262m174709m483044m253388m200816
903.5F36006951m936397n945921o242633n769968n371809n325377m957974l771781
919.8E93685091k204836j164615r63926r94861o26803j23143j43290n97059q04663
938.2E86061895o08027q20279k277494m584729o590009p795751q592427r311199r679556
956.6E35802424r507299r175479r108305r218901r052068q350045p368535o498396
$$ y = [674193323, 672264278, 669961512, 667167783, 664649844, 662967801, 661751270, 660400331, 658916235, 657816052, 657403469, 657281816, 657072961, 657503307, 659829199, 664174497, 669279933, 673964143, 678056598, 681741178, 684532762, 685443580, 684234679, 681735456, 678727806, 675102592, 670464873, 665283382, 660615563, 656788170, 653118908, 648944199, 644461155, 640207767, 636006951, 631070554, 625124633, 618882000, 613112032, 607740223, 602414846, 597456872, 593685091, 591480255, 590315640, 589351714, 588356853, 587730050, 587606907, 587463617, 586866558, 586061895, 585453868, 584633589, 582356095, 577771366, 571181357, 563385606, 554793179, 545481980, 535802424, 526295125, 517119646, 508011341, 498792440, 489740372, 481390327, 474021792, 467523396]
972.9D67523396n657822m494101l131449k085388j547336j293332j061320q21024p49052
991.2D46682572q79138r11475o05970j20282J83940J06036k16216n13613p37011j073391
1011.6D41915452j471668j617074j454055j279265j405209j752705j968771j908481
1027.9D29058224j749635j775354j937240j927972j758307j681000j774311j806736
1044.3D14647669j589060j211643q13216m56810j1236O42359J290262J641095J801818
1062.6D15941238K011866K010166J243890k30879j375288j231819q9943J144856K107739
1081D21531826K878040L547937M026443M103809L819168L477544L222107K863855K237916
1099.3D51708645J509428J108139J230330J575261J822531K026558K353579K669364
$$ y = [467523396, 461865574, 457371473, 454240024, 452154636, 450607300, 449313968, 448252648, 447431624, 446682572, 445803434, 444891959, 444285989, 444165707, 444349647, 444455683, 444239467, 443725854, 442988843, 441915452, 440443784, 438826710, 437372655, 436093390, 434688181, 432935476, 430966705, 429058224, 427308589, 425533235, 423595995, 421668023, 419909716, 418228716, 416454405, 414647669, 413058609, 411846966, 411033750, 410576940, 410565704, 411208063, 412498325, 414139420, 415941238, 417953104, 419963270, 421207160, 420976281, 419600993, 418369174, 418279231, 419424087, 421531826, 424409866, 427957803, 431984246, 436088055, 439907223, 443384767, 446606874, 449470729, 451708645, 453218073, 454326212, 455556542, 457131803, 458954334, 460980892, 463334471, 466003835]
1115.6D66003835K634138K210796J783311J667202J830429K093523K389551K647012
1132D83259797K660036K298594J585066P10636K9654k89589m41641o01620o52819m23670
1152.4D88134444L6299N83500J150310J763254K469689L160566L622472L880441M225970
1170.7E09026945M793465N418539N858719O036401O094813O126345N978703N491495
1187E54825425M684508L711045K762794J867771Q96812k0385n28157o33120n92232
1205.4E66974461n27024m26769k25127K0146P3016j77920n23806p06136p71522j009167
1225.8E62700152j446008j717747j573562j248241j057744r14633n50508R3042P44522
1244.1E55029273J090765J256883J614034K066315K211332J994848J777649J879454
$$ y = [466003835, 468637973, 470848769, 472632080, 474299282, 476129711, 478223234, 480612785, 483259797, 485919833, 488218427, 489803493, 490514129, 490543783, 490254194, 489812553, 489210933, 488558114, 488134444, 488170743, 488754243, 489904553, 491667807, 494137496, 497298062, 500920534, 504800975, 509026945, 513820410, 519238949, 525097668, 531134069, 537228882, 543355227, 549333930, 554825425, 559509933, 563220978, 565983772, 567851543, 568748355, 568727970, 568199813, 567566693, 566974461, 566447437, 566020668, 565795541, 565815687, 565888703, 565710783, 565186977, 564480841, 563709319, 562700152, 561254144, 559536397, 557962835, 556714594, 555656850, 554742217, 554191709, 554284751, 555029273, 556120038, 557376921, 558990955, 561057270, 563268602, 565263450, 567041099, 568920553]
1260.4E68920553K119541K087116J812101J717627J886665J898826J487076R62019
1276.8E82891524P80821R78231J143158J007497Q18372Q49902Q90315N39660j30593
1295.1E89768887p04110r47416j058757j337528j684070j743078j446784j137256r99034
1313.5E78710854q09908l39150K43067M48823N5373o01649j129806j485825j814663
1331.8E73277116k075672j993955j525700r28461n71370n51820o00100n86450p13587
1350.2E63730001j085043j452922j573503j610399j991868k702355l164351l225088
1366.5E46924472l096938k733588k601684k773881k768397k858102l263057l444731
1382.8E23384094k862215j715004n81563p9453j95861k77817M7326M42207P38204R40322
$$ y = [568920553, 571040094, 573127210, 574939311, 576656938, 578543603, 580442429, 581929505, 582891524, 583672345, 584650576, 585793734, 586801231, 587619603, 588469505, 589359820, 589899480, 589768887, 589064777, 588117361, 587058604, 585721076, 584037006, 582293928, 580847144, 579709888, 578710854, 577900946, 577561796, 577804863, 578253686, 578309059, 577707410, 576577604, 575091779, 573277116, 571201444, 569207489, 567681789, 566753328, 566181958, 565630138, 565030038, 564443588, 563730001, 562644958, 561192036, 559618533, 558008134, 556016266, 553313911, 550149560, 546924472, 543827534, 541093946, 538492262, 535718381, 532949984, 530091882, 526828825, 523384094, 520521879, 518806875, 518225312, 518145859, 517949998, 517672181, 517719507, 518161714, 518899918, 519840240]
1403.2E19840240J246810J620532J705884J574815J452267J425803J560211J978934
1419.5E32405496K132773J902521J709938J386046Q05199J76430l87251q76189o95228
1437.9E38559735j8060K51650K92719L79205M77552M31657K17140K29656R28402K311409
1458.3E44061065K815485K467394K449035L042221L762067M725098O388486P206738
1474.6E76917589O388724N013525L476918K112329Q09729o48856k213717l268420l492535
1493E85095286m178345n335152n390465m815281m759729o440460r006977p829726o470144
1511.3E30869007o419003n701840m215181k706229k196491k005398j959086k206206
1527.6E03459573k047181j986474j972079j301766j013964j333416n34534Q15004J563012
$$ y = [519840240, 521087050, 522707582, 524413466, 525988281, 527440548, 528866351, 530426562, 532405496, 534538269, 536440790, 538150728, 539536774, 540341973, 540518403, 540131152, 539254963, 538559735, 538541675, 538793325, 539086044, 539465249, 539942801, 540374458, 540591598, 540821254, 541749656, 544061065, 546876550, 549343944, 551792979, 554835200, 558597267, 563322365, 569710851, 576917589, 583306313, 588319838, 591796756, 593909085, 594718814, 594069958, 591856241, 588587821, 585095286, 580916941, 575581789, 570191324, 565376043, 560616314, 554175854, 545168877, 537339151, 530869007, 524450004, 518748164, 514532983, 511826754, 509630263, 507624865, 505665779, 503459573, 501412392, 499425918, 497453839, 496152073, 495138109, 493804693, 493270159, 494085163, 495648175]
1546D95648175K041430K601444L241182L687501L689110M143655N216122M498780L675222
1564.3E28442621L292263K843618K669513K319634J720548J364291J171350P66278
1580.7E44590116K56717q7083m31776q54194j337707j779318k278983k833367l458082
1599E31786323m192055m888236n539000o305993p257581p866025q083641r249568j0909110
1617.4D67495114r836585r456247j1094093j1111140j0317743r801388q557528p986367
1633.7C89334023q192211n686194k541572r46850J997P87139J753152K154529K418220
1652C79082233L584563M065454M071177M692703N752146O632090O544649O920547P850289
1670.4D29195851P600397P725775Q374214Q005709P528722Q166641J0347277J0402828
$$ y = [495648175, 497689605, 500291049, 503532231, 507219732, 510908842, 515052497, 520268619, 524767399, 528442621, 531734884, 534578502, 537248015, 539567649, 541288197, 542652488, 543823838, 544590116, 544846833, 544759750, 544327974, 543473780, 542136073, 540356755, 538077772, 535244405, 531786323, 527594268, 522706032, 517167032, 510861039, 503603458, 495737433, 487653792, 478404224, 467495114, 457658529, 448202282, 437108189, 425997049, 415679306, 405877918, 397320390, 389334023, 381141812, 375455618, 372914046, 371967196, 371969193, 372756332, 374509484, 376664013, 379082233, 382666796, 386732250, 390803427, 395496130, 401248276, 407880366, 414425015, 421345562, 429195851, 436796248, 444522023, 452896237, 460901946, 468430668, 476597309, 486944586, 497347414]
1686.7D97347414R388686J0151624J0684610J2376845J4039516J4002562J5219092
1701E83210349J3229013J0861873J0283709Q855283P531941O545782N690932N431950
1717.3F51640832N241275M481852L723324L143787K510071K112984J783789J556098
1733.6F76194012J788020J857460J917898K425731K920806L244996L719568M598141
1749.9F98666632N468726N283356M859626M829705M748464M789471M488171L862082
1766.3G36996233L587842L481389L462374L371060K916395K599716K535642K344548
1782.6G61295199J975656J793683J734435J533449J500070J561463J495182J468182
1798.9G74357319J512051J399517J200497J198172J303554J271367J055896R33886
$$ y = [497347414, 506736100, 516887724, 527572334, 539949179, 553988695, 567991257, 583210349, 596439362, 607301235, 617584944, 626440227, 633972168, 640517950, 646208882, 651640832, 656882107, 661363959, 665087283, 668231070, 670741141, 672854125, 674637914, 676194012, 677982032, 679839492, 681757390, 684183121, 687103927, 690348923, 694068491, 698666632, 704135358, 709418714, 714278340, 719108045, 723856509, 728645980, 733134151, 736996233, 740584075, 744065464, 747527838, 750898898, 753815293, 756415009, 758950651, 761295199, 763270855, 765064538, 766798973, 768332422, 769832492, 771393955, 772889137, 774357319, 775869370, 777268887, 778469384, 779667556, 780971110, 782242477, 783298373, 784232259]
1815.2G84232259J085877J283229J084387O65545O43433R33527J036346R93193Q37743
1833.6G92795539P12156Q66056R07361N08785J88828N86450J001179Q50916N23925
1851.9G98941195L92795N60701P10606N97060L74496L02791L27647L62694M76659N20408
1872.3H03567052M97520N72264N76913L91901K87950M10497N27978M38333L30865L26753
1892.7H07928026M07040N50032M99188K73467J94668L27230L94285K64883J36077J87457
1913.1H11162353K94923K89679K32041J32680J63018L98994M31895J75953J2875J35660
1933.5H13430071L18646L01004L8743j62900Q6129M43280L58760N0128j2935K15292
1953.9H15066218L75986K15054q643M9889K63036K76863Q8096k7716Q4698K98202K94387
$$ y = [784232259, 785318136, 786601365, 787685752, 788351297, 788994730, 789928257, 790964603, 791957796, 792795539, 793507695, 794373751, 795281112, 795789897, 795978725, 796565175, 797566354, 798417270, 798941195, 799333990, 799894691, 800605297, 801202357, 801576853, 801879644, 802207291, 802569985, 803046644, 803567052, 804064572, 804636836, 805213749, 805605650, 805893600, 806304097, 806832075, 807270408, 807601273, 807928026, 808335066, 808885098, 809384286, 809657753, 809852421, 810179651, 810573936, 810838819, 810974896, 811162353, 811457276, 811746955, 811978996, 812111676, 812274694, 812673688, 813105583, 813281536, 813294411, 813430071, 813748717, 814049721, 814088464, 813925564, 814011693, 814454973, 814813733, 814863861, 814850926, 815066218, 815442204, 815657258, 815648615, 815698504, 815961540, 816238403, 816326499, 816298783, 816383481, 816681683, 816976070]
1976.3H16976070M5419p3433J24157K94029J55688j08123j40905J43587L31700J25527
1996.7H17873716j22010m1008J89840J89841r0062k71976j20283J00196Q285k65956
2017.1H17450583k87116p2598M7684r2328l00229k68280m9949m053j98126l24785j92583
2039.6H15708220J8299K4557j29044j87278m3988J06990N7459p7248n2869R6798J60277
2062H15682173O6817j0074Q2553J86741J41859J4723k802R8169J79946J70827P7188
2084.4H16688120K0147P9214J77086J79589J05023N2750R9719K01046J87039P5043
2104.8H17864776O8843J79291K19106J47105N9902O0738J26004J48117P7844o318K4497
2127.3H18969905J34230J78218J06692K7061M7862J46568J67728P1764K4497Q7917
$$ y = [816976070, 817021489, 816948056, 817072213, 817366242, 817521930, 817413807, 817272902, 817416489, 817748189, 817873716, 817751706, 817710698, 817900538, 818090379, 818000317, 817728341, 817608058, 817708254, 817716539, 817450583, 817163467, 817090869, 817138553, 817046225, 816745996, 816477716, 816427767, 816423714, 816225588, 815900803, 815708220, 815726519, 815751076, 815622032, 815434754, 815390766, 815497756, 815555215, 815477967, 815425098, 815521896, 815682173, 815748990, 815738916, 815821469, 816008210, 816150069, 816164792, 816161990, 816260159, 816440105, 816610932, 816688120, 816708267, 816787481, 816964567, 817144156, 817249179, 817301929, 817401648, 817602694, 817789733, 817864776, 817933619, 818112910, 818332016, 818479121, 818539023, 818599761, 818725765, 818873882, 818951726, 818945408, 818969905, 819104135, 819282353, 819389045, 819416106, 819463968, 819610536, 819778264, 819850028, 819874525, 819962442]
2147.7H19962442J55806J56224J18256R7871J68979K75135K39134J28150J58429K99275
2168H21759701L63648K89380K09093K70784L87430L79265K54214J83224K45929L49701
2188.4H24692369L51071K32339J67608K46704L21149K65718J76966J89066K83241L25144
2208.8H27251375K52425J52231J56581K72274L12090K08616J26839J58071K15531J88529
2229.2H29294562R2328O6459J51396K04325J35064K9683J6808R1851J74761J69337
2249.6H30426574N8233L696O3241J11281R4474N3048L9875Q4103R8705K7120j6451
2272.1H31043899N6982J48833R4056n9426j01030K5928J42932R5785l4213p2479R536
2294.5H31350803R4533P0215l6657n0068P7605J83761J28925j5736l1232J34408K48194
$$ y = [819962442, 820118248, 820274472, 820392728, 820490599, 820659578, 820934713, 821173847, 821301997, 821460426, 821759701, 822123349, 822412729, 822621822, 822892606, 823280036, 823659301, 823913515, 824096739, 824342668, 824692369, 825043440, 825275779, 825443387, 825690091, 826011240, 826276958, 826453924, 826642990, 826926231, 827251375, 827503800, 827656031, 827812612, 828084886, 828396976, 828605592, 828732431, 828890502, 829106033, 829294562, 829386890, 829453349, 829604745, 829809070, 829944134, 829973817, 829990625, 830082476, 830257237, 830426574, 830484807, 830488503, 830551744, 830663025, 830757499, 830810547, 830850422, 830934525, 831033230, 831060350, 831043899, 831100881, 831249714, 831343770, 831284344, 831183314, 831209242, 831352174, 831447959, 831413746, 831341267, 831350803, 831445336, 831515551, 831478894, 831428826, 831506431, 831690192, 831819117, 831803381, 831772149, 831906557, 832154751]
2316.9H32154751J49965J0193K4676J62244K06709L6478j76847j60218j1384m3392
2337.3H32353175k32637l28958m00722o01054m43875L6835L99232N51880M86612J89066
2357.7H32009554j95503m12345m93050o85692r29951r33826p51138o47426o51240o10709
2378.1H25698674n06103l75867k86997l02255l26812k85149k16782j97112k78056m02927
2398.5H22520614m12286k93433k72096m00245m64976l83973l12984l67045m96030n57661
2418.9H18559885m68671l67403m11451n27621n39481m37737m04238n10455o10470n90921
2439.3H13691437m78387m19557n19037n96702n21481m48644m81010n65827n96165n01156
2459.7H08563471m07577m55856n53489n56409m65512m21286n09441n97477n53012m49419
$$ y = [832154751, 832304716, 832314909, 832339585, 832501829, 832708538, 832745016, 832568169, 832407951, 832396567, 832353175, 832120538, 831791580, 831390858, 830789804, 830345929, 830382764, 830781996, 831333876, 831820488, 832009554, 831814051, 831401706, 830908656, 830222964, 829293013, 828359187, 827608049, 826960623, 826309383, 825698674, 825192571, 824816704, 824529707, 824227452, 823900640, 823615491, 823398709, 823201597, 822923541, 822520614, 822108328, 821814895, 821542799, 821142554, 820677578, 820293605, 819980621, 819613576, 819117546, 818559885, 818091214, 817723811, 817312360, 816784739, 816245258, 815807521, 815403283, 814892828, 814282358, 813691437, 813213050, 812793493, 812274456, 811677754, 811156273, 810707629, 810226619, 809660792, 809064627, 808563471, 808155894, 807700038, 807146549, 806590140, 806124628, 805703342, 805193901, 804596424, 804043412, 803593993]
2480.1H03593993m25458n07414n83768n37753m23312l95418m64200m94361m37618l94046
2500.5G98930645m36604m92215m67420m06086l77715m04000m66705m76181m12941l87371
2520.9G94603407m36365m95136n08785m71652m71115n31971n63920n32865m84229m91857
2541.3G89615512n49376n74052n28276m88937n36561n79357n36681m81367m61876m66824
2561.7G84412205m98533n24282n03600m79639n00083n30839n30600m96090m76479n24402
2582.1G79347658n58853n25296n00440n04077n27620n36382m96030m74274n10574n61773
2602.5G74152339n65053n39660n70714o44684p08938p41184p15971p10845p91311q55207
2622.9G67308772q24452p57277p93576r18865r55999q77440q10206q51750r37701r20832
$$ y = [803593993, 803168535, 802661121, 802077353, 801539600, 801116288, 800720870, 800256670, 799762309, 799324691, 798930645, 798494041, 798001826, 797534406, 797128320, 796750605, 796346605, 795879900, 795403719, 794990778, 794603407, 794167042, 793671906, 793163121, 792691469, 792220354, 791688383, 791124463, 790591598, 790107369, 789615512, 789066136, 788492084, 787963808, 787474871, 786938310, 786358953, 785822272, 785340905, 784879029, 784412205, 783913672, 783389390, 782885790, 782406151, 781906068, 781375229, 780844629, 780348539, 779872060, 779347658, 778788805, 778263509, 777763069, 777258992, 776731372, 776194990, 775698960, 775224686, 774714112, 774152339, 773587286, 773047626, 772476912, 771832228, 771123290, 770382106, 769666135, 768955290, 768163979, 767308772, 766484320, 765727043, 764933467, 764014602, 763058603, 762181163, 761370957, 760519207, 759581506, 758660674]
2643.3G58660674q26180q06749q94904r82165r40621q18968q09252r11474r29952q33094
2663.7G49907315p93219q49485r09567r03726q05795p01487p19845q32618q56399p63536
2684.1G41771638p20083p75874q24571p98106p31528p45535q56280r10818q80242q56340
2704.5G33672261q97527r82046j013159r69708r42350r64284r94801r81570r24646
2722.8G25002170r05991r15706r02057q80420q64565q37267p94887p84040p85351p80582
2743.2G16551304p92861p87497p87854q04782p77960p43687p39574p54833p64549p37250
2763.6G08860457p39276q10564q49605q13186q03649q75056r67562j000583r66907
2782G01034069r50336j034022j175403j203716j113296j106918j215159j295031j311302
$$ y = [758660674, 757834494, 757027745, 756132841, 755150676, 754210055, 753391087, 752581835, 751670361, 750740409, 749907315, 749114096, 748264611, 747355044, 746451318, 745645523, 744944036, 744224191, 743391573, 742535174, 741771638, 741051555, 740275681, 739451110, 738653004, 737921476, 737175941, 736319661, 735408843, 734528601, 733672261, 732774734, 731792688, 730779529, 729809821, 728867471, 727903187, 726908386, 725926816, 725002170, 724096179, 723180473, 722278416, 721397996, 720533431, 719696164, 718901277, 718117237, 717331886, 716551304, 715758443, 714970946, 714183092, 713378310, 712600350, 711856663, 711117089, 710362256, 709597707, 708860457, 708121181, 707310617, 706461012, 705647826, 704844177, 703969121, 703001559, 702000976, 701034069, 700083733, 699049711, 697874308, 696670592, 695557296, 694450378, 693235219, 691940188, 690628886]
2800.3F90628886j317858j382590j505077j577973j553893j519680j581013j687408
2816.6F78503394j723826j733482j838982k000272k083719k101779k181113k370953
2832.9F62469268k572775k770901l076792l550529m188657m867911n349755n439222
2849.3F30652726n010963m108608l017008k100050j703799j938641k535522l156960
2865.6F07081175l596068l707587l440321k905428k256036j625180j179040j006782
2881.9E87364733j011729j045406j092851j227081j412451j550853j667262j836359
2898.2E76520741k061248k305329k549588k834916l223837l685713m139185m556536
2914.5E51164389m843295m827142m420221l665566k702057j651109n96821L78490J318156
$$ y = [690628886, 689311028, 687928438, 686423361, 684845388, 683291495, 681771815, 680190802, 678503394, 676779568, 675046086, 673207104, 671206832, 669123113, 667021334, 664840221, 662469268, 659896493, 657125592, 654048800, 650498271, 646309614, 641441703, 636091948, 630652726, 625641763, 621533155, 618516147, 616416097, 614712298, 612773657, 610238135, 607081175, 603485107, 599777520, 596337199, 593431771, 591175735, 589550555, 588371515, 587364733, 586353004, 585307598, 584214747, 582987666, 581575215, 580024362, 578357100, 576520741, 574459493, 572154164, 569604576, 566769660, 563545823, 559860110, 555720925, 551164389, 546321094, 541493952, 537073731, 533408165, 530706108, 529054999, 528458178, 528836668, 530154824]
2932.9E30154824K272904L096640L656388L928661L874779L501773K887129K165914
2949.2E55539012J531422J071870Q83520J097322J617133K282441K961218L578186
2965.5E70562124M153073M613161M906118N048156N020261M878759M687727M376411
2981.8F08245790L956079L551305L197074K832353K362072J802862J281381P99298
2998.1F28028214K90036j75714n02050o93500p89583q31902q33929q06570q36730r61721
3018.5F21886551j138806j340747j522541j662552j740456j719594j684189j734793
3034.9F09342873j815975j870691j925886k003968k106368k177239k168953k132118
3051.2E93141675k152324k201080k202690k160132k055108j913369j808226j710892
$$ y = [530154824, 532427728, 535524368, 539180756, 543109417, 546984196, 550485969, 553373098, 555539012, 557070434, 558142304, 559025824, 560123146, 561740279, 564022720, 566983938, 570562124, 574715197, 579328358, 584234476, 589282632, 594302893, 599181652, 603869379, 608245790, 612201869, 615753174, 618950248, 621782601, 624144673, 625947535, 627228916, 628028214, 628318250, 628142536, 627640486, 626946986, 626157403, 625325501, 624491572, 623685002, 622848272, 621886551, 620747745, 619406998, 617884457, 616221905, 614481449, 612761855, 611077666, 609342873, 607526898, 605656207, 603730321, 601726353, 599619985, 597442746, 595273793, 593141675, 590989351, 588788271, 586585581, 584425449, 582370341, 580456972, 578648746, 576937854]
3067.5E76937854j629889j585781j523853j459777j421690j407802j390517j319289
3083.8E65199256j238585j188755j143753j110733j101613j084208j056075j085461
3100.1E56190073j177787j256347j278758j263499j285374j326442j356483j459598
3116.4E45785785j551390j581311j653671j689375j675606j710236j763224j809955
3132.8E32351017j814544j802862j858950j935422j967967j979649k011537k008259
3149.1E16971827j941801j960575k067685k123773k115429k078354k069175k097369
3165.4E00517666k107292k105415k120942k124935k110899k119928k130121k131790
3181.7D83566344k124429k085984k033114j998872k019703k070367k062291j992554
$$ y = [576937854, 575307965, 573722184, 572198331, 570738554, 569316864, 567909062, 566518545, 565199256, 563960671, 562771916, 561628163, 560517430, 559415817, 558331609, 557275534, 556190073, 555012286, 553755939, 552477181, 551213682, 549928308, 548601866, 547245383, 545785785, 544234395, 542653084, 540999413, 539310038, 537634432, 535924196, 534160972, 532351017, 530536473, 528733611, 526874661, 524939239, 522971272, 520991623, 518980086, 516971827, 515030026, 513069451, 511001766, 508877993, 506762564, 504684210, 502615035, 500517666, 498410374, 496304959, 494184017, 492059082, 489948183, 487828255, 485698134, 483566344, 481441915, 479355931, 477322817, 475323945, 473304242, 471233875, 469171584, 467179030]
3198D67179030j942456j914173j873672j833737j812696j806826j817167j821190j766771
3216.4D50590342j715958j732111j775771j814246j839847j835674j810670j841753
3232.7D36224312j950235k027511k048373k077759k095818k097935k143144k224088
3249D19559449k279282k301544k318978k340466k343267k311408k244145k164632k104402
3267.4C99151325k020001j916617j844943j769960j625568j443922j306832j208931
3283.7C86014551j101255r73821q60125p82371p31557o61999n71877n27322m96030
3302C79308194m07010l48598m04000m50433m04805l43442l15994l28689l33637k93881
3322.4C75677705l09318m02570m58747m60029m67986m98921n04136m91649n76734p17729
$$ y = [467179030, 465236574, 463322401, 461448729, 459614992, 457802296, 455995470, 454178303, 452357113, 450590342, 448874384, 447142273, 445366502, 443552256, 441712409, 439876735, 438066065, 436224312, 434274077, 432246566, 430198193, 428120434, 426024616, 423926681, 421783537, 419559449, 417280167, 414978623, 412659645, 410319179, 407975912, 405664504, 403420359, 401255727, 399151325, 397131324, 395214707, 393369764, 391599804, 389974236, 388530314, 387223482, 386014551, 384913296, 383939475, 383079350, 382296979, 381565422, 380903423, 380331546, 379804224, 379308194, 378901184, 378552586, 378148586, 377698153, 377293348, 376949906, 376633912, 376305223, 375971586, 375677705, 375368387, 374965817, 374507070, 374047041, 373579055, 373080134, 372575998, 372084349, 371507615, 370789886]
3342.8C70789886p80583p76052p50244p60138q54910r53495r45985q97646q96275q89570
3363.2C62284988q37028q09193q99225j054227j083285r69022q52347p72595p40052
3381.6C54268014p09682o35565n20527m01020m38809o24806o38604l60281j34348k71291
3402C49533081n01007m17530j78814q2165j17809j49011j31935n9665O7294K04414
3422.4C48166853L59267N08219O08713O24299O81191Q06481P47472N83977O50405Q85874
3442.8C54622751J045198J117170J139581J175523J263618J354218J436203J534581
3459.1C64688843J539350J516402J677364J800805J639933J436859J486778J658410
3475.4C77444744J862019J977742J849681J800865J946569J977533J924574J959413
$$ y = [370789886, 370009303, 369233251, 368483007, 367722869, 366867959, 365914464, 364968479, 364070833, 363174558, 362284988, 361447960, 360638767, 359739542, 358685315, 357602030, 356633008, 355780661, 355008066, 354268014, 353558332, 352922767, 352402240, 352001220, 351562411, 350937605, 350299001, 349938720, 349804372, 349533081, 349032074, 348614544, 348435730, 348353565, 348235756, 348086745, 347954810, 347895145, 347962439, 348166853, 348526120, 349034339, 349643052, 350267351, 350948542, 351755023, 352502495, 353086472, 353736877, 354622751, 355667949, 356785119, 357924700, 359100223, 360363841, 361718059, 363154262, 364688843, 366228193, 367744595, 369421959, 371222764, 372862697, 374299556, 375786334, 377444744, 379306763, 381284505, 383134186, 384935051, 386881620, 388859153, 390783727, 392743140]
3491.7C92743140K038509K124637K115727K064735K073973K041072K000391K062649
3508D09264833K177626K313763K360731K250075K225459K341270K456516K435148K322346
3526.4D30147767K347142K511799K648026K736330K754897K687722K747267K911389
3542.7D51492339K926886K746314K671451K811014K986282L103495L162473L233344
3559D75133598L269315L176719L087580L361285L808647L848016L673881L699035L850222
3577.4E06908298L992974M093588M052221L881932L885329M218637M302681M177570
3593.7E39513230M289747M477322M482567M426658M316032M052937M009485M227996
3610E73795974M347563M432678M337132M182458M470587M594684M172742L619671L541291
$$ y = [392743140, 394781649, 396906286, 399022013, 401086748, 403160721, 405201793, 407202184, 409264833, 411442459, 413756222, 416116953, 418367028, 420592487, 422933757, 425390273, 427825421, 430147767, 432494909, 435006708, 437654734, 440391064, 443145961, 445833683, 448580950, 451492339, 454419225, 457165539, 459836990, 462648004, 465634286, 468737781, 471900254, 475133598, 478402913, 481579632, 484667212, 488028497, 491837144, 495685160, 499359041, 503058076, 506908298, 510901272, 514994860, 519047081, 522929013, 526814342, 531032979, 535335660, 539513230, 543802977, 548280299, 552762866, 557189524, 561505556, 565558493, 569567978, 573795974, 578143537, 582576215, 586913347, 591095805, 595566392, 600161076, 604333818, 607953489, 611494780]
3628.4F11494780M197180M361093M086554L932655L773808L655494L553867L257215
3644.7F42312646K860069K931655L567636L726840L339588L267169L341139L037452
3661F68384194K775669K682209K315522J961112K265870K297163J911640K333522K705515
3679.4F89632416K458095K258778K073049J700938J503051J852035K132237J980424
3695.7G05591023J653075J301468J153171J386523J454532J069069O48141P79629J428485
3714G16465116J624822J313567R49741P45535P59720R22621J065016Q56757M76777
3732.4G25179672M11868Q14677J271844J112282K38836q8334Q53955Q76129K69830
3750.7G30940759P98404J405418J103402O45518P00772Q10086O00219M73201M80116
$$ y = [611494780, 615691960, 620053053, 624139607, 628072262, 631846070, 635501564, 639055431, 642312646, 645172715, 648104370, 651672006, 655398846, 658738434, 662005603, 665346742, 668384194, 671159863, 673842072, 676157594, 678118706, 680384576, 682681739, 684593379, 686926901, 689632416, 692090511, 694349289, 696422338, 698123276, 699626327, 701478362, 703610599, 705591023, 707244098, 708545566, 709698737, 711085260, 712539792, 713608861, 714257002, 715036631, 716465116, 718089938, 719403505, 720353246, 721098781, 721858501, 722781122, 723846138, 724702895, 725179672, 725591540, 726406217, 727678061, 728790343, 729029179, 728940845, 729794800, 730670929, 730940759, 731739163, 733144581, 734247983, 734893501, 735594273, 736404359, 737004578, 737477779, 737957895]
3769.1G37957895O60062R14037Q29577N31316L33548M23431N37574N01097N33223O01709
3789.5G43823469O24120N00679K87056K54750N3168J9550O34909O51657N02825Q62062
3809.9G48214245Q04722K13087p0691K14755R3460K13146P62165O62148M42863L18765
3830.3G51868665K68638L91662J58370j03295K51174N78702O35028O67691N13673j56582
3850.7G55073726j035034k50757J224220J087963L45946q9348P6115L51250J33932
3869G56918013J38283M41670N42760M64380R9003P1585K45333P1585K16604L14891
3889.4G59524107J39475L42667M37677L2008l12508k59757O2287N20289O97255M54843
3909.8G61638343J99795O6280q6724j05977P7605J41561J34468K36273K10941O6220
$$ y = [737957895, 738617957, 739531994, 740361571, 740892887, 741226435, 741649866, 742187440, 742688537, 743221760, 743823469, 744447589, 744948268, 745235324, 745490074, 745543242, 745562792, 746197701, 746849358, 747352183, 748214245, 749018967, 749232054, 749161363, 749376118, 749469578, 749682724, 750444889, 751107037, 751549900, 751868665, 752137303, 752528965, 752687335, 752584040, 752835214, 753413916, 754048944, 754716635, 755230308, 755073726, 754038692, 753787935, 755012155, 756100118, 756446064, 756356716, 756432831, 756784081, 756918013, 757056296, 757497966, 758040726, 758505106, 758604109, 758675694, 758921027, 758992612, 759209216, 759524107, 759663582, 760006249, 760443926, 760475934, 760163426, 759903669, 759965956, 760486245, 761183500, 761638343, 761838138, 761904418, 761817694, 761711717, 761789322, 761930883, 762065351, 762301624, 762512565, 762578785]
3930.2G62578785Q1242K00569K18272J63496Q6069K4498N1498R8169J50204K23040
3950.6G63875842K15769J16527N5015P4923Q7381J06930J25110J03057Q7023O0439
3971G64908016M0769Q9765J05381O6280J21177J82926J26422Q9943J32144J18613N1558
3993.4G66032994P8141J80722
3997.5G66291857
$$ y = [762578785, 762660027, 762860596, 763078868, 763242364, 763328433, 763352931, 763404429, 763502598, 763652802, 763875842, 764091611, 764208138, 764263153, 764338076, 764425457, 764532387, 764657497, 764760554, 764847577, 764908016, 764948785, 765038550, 765143931, 765210211, 765331388, 765514314, 765640736, 765730679, 765862823, 765981436, 766032994, 766111135, 766291857]
##END=$$ End of the data block
