##TITLE=G08-52-SE $$ Begin of the data block
##JCAMP-DX=5.00 $$ ACD/SpecManager v 10.08
##SPECTROMETER/DATA SYSTEM=Alpha
##DATE=17 Oct 2013 10:58:30
##DATA TYPE=INFRARED SPECTRUM
##DATA CLASS=XYDATA
##ORIGIN=
##OWNER=
##NPOINTS=1765
##FIRSTX=399.75695801
##LASTX=3997.56933594
##MAXX=3997.56933594
##MINX=399.75695801
##MAXY=0.83357942
##MINY=0.34752867
##XFACTOR=1.0000000000
##YFACTOR=1.000000000000000e-9
##FIRSTY=0.59553331
##DELTAX=2.03957629
##XUNITS=1/CM
##YUNITS=ARBITRARY UNITS
##XYDATA=(X++(Y..Y))
399.8E95533311k927601k238631q37922j58370l77118j38462O07908N97477l65854
$$ 595533311 592605710 590367079 589529157 589370787 588993669 588855207 589463115 590060592 589694738
418.1E89694738j121580q79884l53754o02781j831591k418101j476765l41356k41101
$$ 589694738 588573158 587693274 587339520 586736739 584905148 582487047 581010282 580668926 580427825
436.5E80427825m39107L18289J544177J786709Q56698j01865j87337K14636j10089
$$ 580427825 579988718 580307007 581851184 583637893 584494591 584392726 584205389 584420025 584309936
454.8E84309936j361430k164722j566469j060963j841605k802550k458275j363575
$$ 584309936 582948506 580783784 579217315 578156352 576314747 573512197 571053922 569690347
471.1E69690347j051128j777709k259910j381397j192J21414r04798j338542p44581
$$ 569690347 568639219 566861510 564601600 563220203 563219011 563340425 562435627 561097085 560352504
489.5E60352504m64141j210094k155721k080679j231372j263678k429784l130376k610326
$$ 560352504 559888363 558678269 556522548 554441869 553210497 551946819 549517035 546386659 543776333
507.9E43776333j814425k011597l040671l289879k064287r54867j187026j682580r03785
$$ 543776333 541961908 539950311 536909640 533619761 531555474 530600607 529413581 527731001 526827216
526.2E26827216O27875R92835M15146O13571K021014L262282K797186J174450K89023
$$ 526827216 527455091 528447926 528863072 529476643 531497657 534759939 537557125 538731575 539020598
544.6E39020598N75304M99606p52032j785993j503289p95186j026868k133012k741933
$$ 539020598 539595902 540095508 539343476 537557483 536054194 535259008 534232140 532099128 529357195
562.9E29357195k178907j515925j727641k031088j134813N93126J537561J431466J608729
$$ 529357195 527178288 525662363 523934722 521903634 520768821 521361947 522899508 524330974 525939703
581.3E25939703K633333L427327K877533J475573P03096Q51095R69946M69029k62797
$$ 525939703 528573036 532000363 534877896 536353469 537056565 537907660 538877606 539346635 539083838
599.6E39083838k73346M25696O75499J84060r9421L56317J086592J262903Q58605R37939
$$ 539083838 538810492 539236188 539911687 540095747 539996326 540352643 541439235 542702138 543560743 544498682
620E44498682J966119K923369K837301K220749K138675K588749K626001J953960J268089
$$ 544498682 546464801 549388170 552225471 554446220 556584895 559173644 561799645 563753605 565021694
638.4E65021694J168072J476169J554787J053512M76897N62906J019180R19103K20716
$$ 565021694 566189766 567665935 569220722 570274234 570751131 571314037 572333217 573252320 573473036
656.7E73473036p2002L92020R06407R80616Q13305P01428J078725J552582J501143
$$ 573473036 573401034 573793054 574699461 575680077 576493382 577194810 578273535 579826117 581327260
675.1E81327260J113832J163125J601815J661658J018465L41057K81632M63188k8968
$$ 581327260 582441092 583604217 585206032 586867690 587886155 588227212 588508844 588972032 588943064
693.5E88943064j041353j415491o45458L99708P48694P18117J274586K414703L087998
$$ 588943064 587901711 586486220 585840762 586240470 586989164 587707281 588981867 591396570 594484568
711.8E94484568K813220K563834L254354M321933M546225L795564L289401L625572
$$ 594484568 597297788 599861622 603115976 607437909 611984134 615779698 619069099 622694671
728.1F22694671L942549L217280J878560J297533J593352J525342M69387n69582n84424
$$ 622694671 626637220 629854500 631733060 633030593 634623945 636149287 636618674 636049092 635464668
746.5F35464668n3882j95563j193524j858353j449526p65323p09951q57115j34289
$$ 635464668 635410786 635215223 634021699 632163346 630713820 629948497 629238546 628381431 628247142
764.8F28247142J556575K996564L440917L530621M107595M859626M747271L671647
$$ 628247142 629803717 632800281 636241198 639771819 643879414 648739040 653486311 657157958
781.2F57157958K676844K587259K852261K373517J343309J054466J814902K616823
$$ 657157958 659834802 662422061 665274322 667647839 668991148 670045614 671860516 674477339
797.5F74477339K633095K241015K262771K546430K292692J317084M53890L54886O09994
$$ 674477339 677110434 679351449 681614220 684160650 686453342 687770426 688224316 688579202 689189196
815.8F89189196L61383n69404j410842j566231j557827k108454k834857k928734k410888
$$ 689189196 689550579 688981175 687570333 686004102 684446275 682337821 679502964 676574230 674163342
834.2F74163342k042532k306998k733112k507627j723647j204967j299143j497448
$$ 674163342 672120810 669813812 667080700 664573073 662849426 661644459 660345316 658847868
850.5F58847868j118481l97861j50919k29954M77016K379357M373134N140364M720509
$$ 658847868 657729387 657331526 657180607 656950653 657427669 659807026 664180160 669320524 674041033
868.9F74041033M086971L613055K700984Q79526j202583k513587l091514l736556m616380
$$ 674041033 678128004 681741059 684442043 685321569 684118986 681605399 678513885 674777329 670160949
887.2F70160949n058467m621864l870546l722489m206240m443586m181028m201770
$$ 670160949 665102482 660480618 656610072 652887583 648681343 644237757 640056729 635854959
903.5F35854959m982411n986750o272138n784511n379498n313277m909039l695190
$$ 635854959 630872548 624885798 618613660 612829149 607449651 602136374 597227335 593532145
919.8E93532145k139211j140415r76265j003086o18160j38104k01225o72102q21412
$$ 593532145 591392934 590252519 589276254 588273168 587655008 587516904 587315679 586643577 585822165
938.2E85822165n79476q41380k326667m594803o562829p781207q599937r301007r649456
$$ 585822165 585242689 584401309 582074642 577479839 570917010 563135803 554535866 545234859 535585403
956.6E35585403r479343r164274r112716r229839r065449q362979p368087o465555
$$ 535585403 526106060 516941786 507829070 498599231 489533782 481170803 473802716 467337161
972.9D67337161n620122m542559l232211k063513j435697j277655j130313q28832o78540
$$ 467337161 461717039 457174480 453942269 451878756 450443059 449165404 448035091 447206259 446527719
991.2D46527719q12351q88765o16968j46597J41382Q3148j91033m84377p48485j105458
$$ 446527719 445715368 444826603 444209635 444063038 444204420 444287568 444096535 443612158 442863673 441758215
1011.6D41758215j489251j613111j427591j262635j412779j775980j997292j909643
$$ 441758215 440268964 438655853 437228262 435965627 434552848 432776868 430779576 428869933
1027.9D28869933j748145j772493j891672j889617j754403j671851j767635j835614
$$ 428869933 427121788 425349295 423457623 421568006 419813603 418141752 416374117 414538503
1044.3D14538503j624286j181692p78467m79966K354O94990J284153J596838J781881
$$ 414538503 412914217 411732525 410954058 410474092 410476446 411171436 412455589 414052427 415834308
1062.6D15834308K000332J986026J227051j90228j301765j237363j41978J122623K083064
$$ 415834308 417834640 419820666 421047717 420857489 419555724 418318361 418176383 419299006 421382070
1081D21382070K868443L570676M048795M112571L807873L466844L240496K879709K201617
$$ 421382070 424250513 427821189 431869984 435982555 439790428 443257272 446497768 449377477 451579094
1099.3D51579094J461506J104474J255005J602084J855910K086192K389103K625615
$$ 451579094 453040600 454145074 455400079 457002163 458858073 460944265 463333368 465958983
1115.6D65958983K585798K230317J819908J693160J865267K098680K353549K617359
$$ 465958983 468544781 470775098 472595006 474288166 476153433 478252113 480605662 483223021
1132D83223021K668500K326101J586258O86646K7329k64108m28200o04064o60538m30405
$$ 483223021 485891521 488217622 489803880 490490526 490517855 490253747 489825547 489221483 488560945 488130540
1152.4D88130540M6312N95451J162052J788050K477944L130972L584683L860712M192591
$$ 488130540 488176852 488772303 489934355 491722405 494200349 497331321 500916004 504776716 508969307
1170.7E08969307M736245N397200N898297O088138O086230O062031N936205N490422
$$ 508969307 513705552 519102752 525001049 531089187 537175417 543237448 549173653 554664075
1187E54664075M681409L700614K760172J835763Q48949m2140n48423o21736n18441
$$ 554664075 559345484 563046098 565806270 567642033 568490982 568448842 567900419 567278683 566760242
1205.4E66760242m73320m29988k26438M0888P0751k21074n49435p00295p77781j013696
$$ 566760242 566286922 565856934 565630496 565671384 565742135 565521061 564971626 564271331 563493550 562479854
1225.8E62479854j436413j705885j561463j227557j015485q98897n68807J02639P71284
$$ 562479854 561043441 559337556 557776093 556548536 555533051 554634154 554065347 554167986 554939270
1244.1E54939270J117945J290381J611769K032518K189100J974166J773893J913429
$$ 554939270 556057215 557347596 558959365 560991883 563180983 565155149 566929042 568842471
1260.4E68842471K155959K117992J831114J700222J869381J900256J469552R50217
$$ 568842471 570998430 573116422 574947536 576647758 578517139 580417395 581886947 582837164
1276.8E82837164P97213R83595J137913J021921Q57771Q81314Q91209N26666j49965
$$ 582837164 583634377 584617972 585755885 586777806 587635577 588516891 589408100 589934766 589784801
1295.1E89784801p19845r51469j056373j328230j667142j717687j408577j090586r81033
$$ 589784801 589064956 588113487 587057114 585728884 584061742 582344055 580935478 579844892 578863859
1313.5E78863859q27849l53336K14934L89099N186o06716j091599j452506j812279
$$ 578863859 578036010 577682674 577897608 578286707 578291893 577685177 576593578 575141072 573328793
1331.8E73328793k064109j955271j493573r35137o10411n83172n93424n64992p27833
$$ 573328793 571264684 569309413 567815840 566880703 566270292 565687120 565093696 564528704 563800871
1350.2E63800871j117289j461148j569867j603007j952351k655088l207148l320753
$$ 563800871 562683582 561222434 559652567 558049560 556097209 553442121 550234973 546914220
1366.5E46914220l116071k665043k531469k783656k835810k878786l227531l415704
$$ 546914220 543798149 541133106 538601637 535817981 532982171 530103385 526875854 523460150
1382.8E23460150k833724j695276o17086j02103j35958k19286M0054M26710P34925
$$ 523460150 520626426 518931150 518314064 518211961 518076003 517856717 517896771 518323481 519058406
1401.2E19058406R57907J252174J587570J691520J582205J476586J514733J690626
$$ 519058406 520016313 521268487 522856057 524547577 526129782 527606368 529121101 530811727
1417.5E30811727K002776K044499J827657J648187J355231Q19981J81854l65615q11875
$$ 530811727 532814503 534859002 536686659 538334846 539690077 540510058 540691912 540326297 539514422
1435.9E39514422p00950r3520K19107L12269M10974M82976M08471K25544L47614J127362
$$ 539514422 538813472 538719952 538939059 539251328 539662302 540145278 540553749 540779293 541126907 542254269
1456.2E42254269K317250K625346K359390K446175L000259L717542M812121O490469
$$ 542254269 544571519 547196865 549556255 552002430 555002689 558720231 563532352 570022821
1472.6E70022821P135630O245017M913330L407836K057076Q31186n22136k128661l370047
$$ 570022821 577158451 583403468 588316798 591724634 593781710 594612896 594090760 591962099 588592052
1490.9E88592052l613054m157126n288899n434931m856646m669845o176829q870244
$$ 588592052 584978998 580821872 575532973 570098042 565241396 560571551 554394722 545524478
1507.2E45524478q005679o597995o416917n640447m134477k613306k128064k031803
$$ 545524478 537518799 530920804 524503887 518863440 514728963 512115657 509987593 507955790
1523.6E07955790k011002k263307k078533j911164j886516j270235q84205j129747
$$ 507955790 505944788 503681481 501602948 499691784 497805268 496535033 495650828 494521081
1539.9D94521081n05507P14362J478255K024740K613336L259420L781080L905416M346311
$$ 494521081 494015574 494729936 496208191 498232931 500846267 504105687 507886767 511792183 516138494
1558.2E16138494N045533M199326L540397L286004K875566K623380K267956J776815
$$ 516138494 521184027 525383353 528923750 532209754 535085320 537708700 539976656 541753471
1574.5E41753471J373231J042128O58333K06173j05441m24027q48532j359761j802564
$$ 541753471 543126702 544168830 544827163 545033336 544927895 544503868 543655336 542295575 540493011
1592.9E40493011k276718k833784l471136m198730m881680n509198o268620p247210
$$ 540493011 538216293 535382509 531911373 527712643 522830963 517321765 511053145 503805935
1609.2E03805935p858753q009851r128183j0908961r932995r453267j1047780j1135519
$$ 503805935 495947182 487937331 478809148 467900187 457967192 448513925 437466145 426330626
1625.5D26330626j0363132r839982q557379p897764q139909n796790k651512r50754
$$ 426330626 415967494 406127512 397570133 389672369 381532460 375735670 373084158 372133404
1641.8C72133404J04666R42051J818985K163470K496570L569990L912986M011094M748673
$$ 372133404 372238070 373180121 374999106 377162576 379659146 383229136 387142122 391153216 395901889
1660.2C95901889N819946O621897O523043O945879P852584P577926P719040Q331716
$$ 395901889 401721835 408343732 414866775 421812654 429665238 437243164 444962204 453293920
1676.5D53293920P970511P614822Q339613J0373086J0261923R304166J0109842J0686457
$$ 453293920 461264431 468879253 477218866 487591952 497853875 507158041 517267883 527954340
1692.8E27954340J2445748J4110446J4095187J5204966J3063610J0751784J0224223
$$ 527954340 540400088 554510534 568605721 583810687 596874297 607626081 617850304
1707.1F17850304Q835673P588565O652952N852103N538404N115151M308284L670811
$$ 617850304 626685977 634274542 640927494 646779597 652318001 657433152 661741436 665412247
1723.4F65412247L163338K565563K198696J908302J645982J697958J775801J925051
$$ 665412247 668575585 671141148 673339844 675248146 676894128 678592086 680367887 682292938
1739.7F82292938K402961K909601L301561L786564M598081N376458N207956M855037
$$ 682292938 684695899 687605500 690907061 694693625 699291706 704668164 709876120 714731157
1756.1G14731157M852235M796207M774451M384637L820122L650546L618300L532826
$$ 714731157 719583392 724379599 729154050 733538687 737358809 741009355 744627655 748160481
1772.4G48160481L246487K778589K596438K595306K358258J923859J729667J783728
$$ 748160481 751406968 754185557 756781995 759377301 761735559 763659418 765389085 767172813
1788.7G67172813J706720J582146J476347J419604J459420J503050J362681J169503
$$ 767172813 768879533 770461679 771938026 773357630 774817050 776320100 777682781 778852284
1805G78852284J201332J326859J262605J018345R21667J087069J268864J104414P53165
$$ 778852284 780053616 781380475 782643080 783661425 784583092 785670161 786939025 788043439 788796604
1823.4G88796604P07626R34839J019061R34541P56383O56724Q40127R45509O57737
$$ 788796604 789504230 790439069 791458130 792392671 793149054 793805778 794645905 795591414 796249151
1841.7G96249151L39031N72324R04024P78019M74871L62098N45084P08580N99444L82126
$$ 796249151 796588182 797160506 798064530 798842549 799317420 799679518 800224602 800933182 801532626 801914752
1862.1H01914752L54051M25518M17232M16339M27186M62830N76556N83410L99828K95103
$$ 801914752 802268803 802694321 803111553 803527892 803955078 804417908 804994464 805577874 805977702 806272805
1882.5H06272805M15802N53369M64499L15309K98679L85582N26011M79996K50876J62721
$$ 806272805 806688607 807241976 807706475 808021784 808320463 808706045 809232056 809712052 809962928 810125649
1902.9H10125649L13878M30942L06129J13607J47521L30389L72886K72095J48595J66833
$$ 810125649 810439527 810870469 811176598 811290205 811437726 811768115 812141001 812413096 812561691 812728524
1923.3H12728524L62754L95000J62244N305J16110K92301K79724N9843q0645J32680
$$ 812728524 813091278 813486278 813648522 813653827 813769937 814062238 814341962 814401805 814321160 814453840
1943.7H14453840M02987K99096K4557m76K38895L68476J82986j2517P7904K93135K92242
$$ 814453840 814856827 815155923 815180480 815180004 815418899 815787375 815970361 815957844 816035748 816328883 816621125
1966.1H16621125Q1897l7492R1195L15965L01241L9220p8380J15991K81393J47641
$$ 816621125 816703022 816665530 816756725 817072690 817373931 817413151 817334771 817450762 817732155 817879796
1986.5H17879796r3639j04964J45316K94030J00732j26719n2095J75357J97470o2585
$$ 817879796 817786157 817681193 817826509 818120539 818221271 818094552 818042457 818217814 818415284 818352699
2006.9H18352699k35378r7275Q7023n97k38835k59161p7129K1279j15275l08812k64168
$$ 818352699 818117321 818020046 818107069 818106472 817867637 817608476 817531347 817552626 817437351 817128539 816864371
2029.4H16864371m7028q166k00569l28839k03729J7405L8922j29223j95980k9445J21415
$$ 816864371 816817343 816809177 816608608 816279769 816076040 816093445 816132367 816003144 815807164 815777719 815899134
2051.8H15899134M1485j05799o0498J29103K21610J03832l8982K7895J65701J51575
$$ 815899134 815940619 815834820 815774322 815903425 816125035 816228867 816189885 816217780 816383481 816535056
2072.2H16535056L1113J2696J01328J71542J68562Q1360K5273R1552J91987J66953
$$ 816535056 816566169 816578865 816680193 816851735 817020297 817101657 817126930 817218482 817410469 817577422
2092.6H17577422O4790L8028J26004K39730K16663Q0645M6670J50323K04325J32382
$$ 817577422 817642212 817680240 817806244 818045974 818262637 818343282 818389952 818540275 818744600 818876982
2113H18876982N4180Q2255J61826J71006P4744q404M2081J52886J68621P4685L576
$$ 818876982 818931162 819013417 819175243 819346249 819420993 819412589 819454670 819607556 819776177 819850862 819854438
2135.4H19854438M8697J55509J76191R6738M7088R3103J68085J70111J04070P9572
$$ 819854438 819903135 820058644 820234835 820331573 820378661 820471764 820639849 820809960 820914030 820993602
2155.8H20993602J61648K58446K29299J30534J61707L07441L79980L03685K12253K57611
$$ 820993602 821155250 821413696 821642995 821773529 821935236 822242677 822622657 822926342 823138595 823396206
2176.2H23396206L80278M16994K91705J62124K00868L27766L52323K38955J73628K65301
$$ 823396206 823776484 824193478 824485183 824647307 824848175 825175941 825528264 825767219 825940847 826206148
2196.6H26206148L58998K89441J61647J60098K73765L45945K69413J32024J23441K62559
$$ 826206148 826565146 826854587 827016234 827176332 827450097 827796042 828065455 828197479 828320920 828583479
2217H28583479L33548K32756J38640J66237K32280K08556P8321L2246J44541K27690
$$ 828583479 828917027 829149783 829288423 829454660 829686940 829895496 829973817 830006063 830150604 830378294
2237.4H30378294J56999K4557j3054O2585J65880J87159R3579P808L1531R8526R4533
$$ 830378294 830535293 830559850 830546796 830609381 830775261 830962420 831055999 831063807 831095338 831193864 831288397
2259.8H31288397L9816M7982J18434J11521J0788k4438O3122J38103Q0288n9903j07228
$$ 831288397 831328213 831376195 831494629 831606150 831616938 831592500 831655622 831793725 831874013 831814110 831706882
2282.3H31706882K8312J52349R2030m0055o2346M3452J19567M4942o7652j9312J20879
$$ 831706882 831735194 831887543 831979573 831939518 831877172 831920624 832040191 832085133 832017481 831998169 832119048
2304.7H32119048J64747R4533M768J7941J62184K62619J59680j6272j728K19285L04878
$$ 832119048 832283795 832378328 832383096 832401037 832563221 832825840 832985520 832969248 832967520 833186805 833491683
2327.1H33491683Q7738j90020k10106m5657m4406j90079k63273m27843p25448n23329
$$ 833491683 833579421 833389401 833179295 833133638 833089232 832899153 832635880 832208037 831482589 830959260
2347.5H30959260P3493N28693O38068M03166N9604k23040l51310m36366o76274r38594
$$ 830959260 831032753 831561446 832199514 832602680 832662284 832439244 832087934 831651568 830975294 830036700
2367.9H30036700r98616q52704o37889n60403o16193n83947m12345k91764l26336l75569
$$ 830036700 829038084 828185380 827547491 826987088 826370895 825786948 825374603 825082839 824756503 824380934
2388.3H24380934l07083j97530k00331l02970l80040l61859k86937k87950l86775m36902
$$ 824380934 824073851 823876321 823675990 823373020 822992980 822631121 822344184 822056234 821669459 821232557
2408.7H21232557l77774l17514l59714m94420n66066m68075l53038l90828n09501n29527
$$ 821232557 820854783 820537269 820177555 819683135 819117069 818648994 818295956 817905128 817395627 816866100
2429.1H16866100m66347m55856n16594n85854n72502m68254m31598n35547o08147n32031
$$ 816866100 816399753 815943897 815427303 814841449 814268947 813800693 813369095 812833548 812225401 811693370
2449.5H11693370m38809m65095n66483o00814n05627m14610m56392n56350n64516m76837
$$ 811693370 811254561 810789466 810222983 809622169 809116542 808701932 808245540 807689190 807124674 806647837
2469.9H06647837m28617m79340n45800n27322m47333m34697n26130n72026m91500m07755
$$ 806647837 806219220 805739880 805194080 804666758 804219425 803784728 803258598 802686572 802195072 801787317
2490.3H01787317m31895n12898n12183m26233l77417m26650n06579m96567l98040l39448
$$ 801787317 801355422 800842524 800330341 799904108 799526691 799100041 798593462 798096895 797698855 797359407
2510.7G97359407l90828m77254n00620m65691m41312m49896m59016m45902m36068m78923
$$ 797359407 796968579 796491325 795990705 795525014 795083702 794633806 794174790 793728888 793292820 792813897
2531.1G92813897n50330n69880n21183m73558m90249n58197n78702n16116m89593n20170
$$ 792813897 792263567 791693687 791172504 790698946 790208697 789650500 789071798 788555682 788066089 787545919
2551.5G87545919n21302n25892n22136m73261m80831n36918n25952m63068m40836n00381
$$ 787545919 787024617 786498725 785976589 785503328 785022497 784485579 783959627 783496559 783055723 782555342
2571.9G82555342n60224n26727m60624m73857n50628n62251m97221m81070n08964n31733
$$ 782555342 781995118 781468391 781007767 780533910 779983282 779421031 778923810 778442740 777933776 777402043
2592.3G77402043n47051n15163m63903m83990n56826n81503n59092n64813o30856p20739
$$ 777402043 776854992 776339829 775875926 775391936 774835110 774253607 773694515 773129702 772498846 771778107
2612.7G71778107p44403o93321o97434p92622q48234q07882p57396q07047r12547r46462
$$ 771778107 771033704 770340383 769642949 768850327 768002093 767194211 766436815 765629768 764717221 763770759
2633.1G63770759q92341q40366q81195r40204q78453p77006q02934r12965r76800r38356
$$ 763770759 762878418 762038052 761156857 760216653 759338200 758561194 757758260 756845295 755868495 754930139
2653.5G54930139q46029q20815q84652r12905q48353q20220q70823r05276q69512p90120
$$ 754930139 754084110 753263295 752378643 751465738 750617385 749797165 748926342 748021066 747151554 746361434
2673.9G46361434p28428p27057p86543q15928p72476p59125p95126q01981p85648p60377
$$ 746361434 745633006 744905949 744119406 743303478 742531002 741771877 740976751 740174770 739389122 738628745
2694.3G38628745p71820q49247q81374q61585q60036q90195r50456r85682r74595r69172
$$ 738628745 737856925 737007678 736126304 735264719 734404683 733514488 732564032 731578350 730603755 729634583
2714.6G29634583r78470r88006r70543r24826r10282r12010r06229r05991q75711q17895
$$ 729634583 728656113 727668107 726697564 725772738 724862456 723950446 723044217 722138226 721262515 720444620
2735G20444620p97510q15034q07584p84814p65920p49469p59542p73191p67410p70747
$$ 720444620 719647110 718832076 718024492 717239678 716473758 715724289 714964747 714191556 713424146 712653399
2755.4G12653399p83563p89106p69675p41720p62880p99537p99298p97450q20399q71360
$$ 712653399 711869836 711080730 710311055 709569335 708806455 708006918 707207620 706410170 705589771 704718411
2775.8G04718411r31978r57668r46581r72689j074314j153886j118541j077294j167774
$$ 704718411 703786433 702828765 701882184 700909495 699835181 698681295 697562754 696485460 695317686
2794.2F95317686j282871j297057j277923j302541j396179j514077j560271j535594
$$ 695317686 694034815 692737758 691459835 690157294 688761115 687247038 685686767 684151173
2810.5F84151173j524806j591802j698852j735627j747012j862705k009809k081037
$$ 684151173 682626367 681034565 679335713 677600086 675853074 673990369 671980560 669899523
2826.8F69899523k105117k175152k370775k617061k818882l070116l522456m170835
$$ 669899523 667794406 665619254 663248479 660631418 657812536 654742420 651219964 647049129
2843.1F47049129m844308n336285n452811n035818m134238l037572k108752j689732
$$ 647049129 642204821 636868536 631415725 626379907 622245669 619208097 617099345 615409613
2859.5F15409613j904905k511740l166795l627658l740429l477395k934396k251566
$$ 615409613 613504708 610992968 607826173 604198515 600458086 596980691 594046295 591794729
2875.8E91794729j614094j192390j016200j012802j065254j117766j230955j401186
$$ 591794729 590180635 588988245 587972045 586959243 585893989 584776223 583545268 582144082
2892.1E82144082j547277j681209j850843k047539k275586k531231k821386l217935
$$ 582144082 580596805 578915596 577064753 575017214 572741628 570210397 567389011 564171076
2908.4E64171076l703177m170954m567862m807711m782557m425168l711939k744257
$$ 564171076 560467899 556296945 551729083 546921372 542138815 537713647 534001708 531257451
2924.7E31257451j647652n59210L91304J281500K220929L095269L684819L919541L849924
$$ 531257451 529609799 529050589 529441893 530723393 532944322 536039591 539724410 543643951 547493875
2943.1E47493875L492355K902687K215981J556278J038015Q58903J120746J670181
$$ 547493875 550986230 553888917 556104898 557661176 558699191 559558094 560678840 562349021
2959.4E62349021K327264K976298L595650M174829M610479M889905N044341N054355
$$ 562349021 564676285 567652583 571248233 575423062 580033541 584923446 589967787 595022142
2975.7E95022142M936159M725098M395008L978432L596186L224254K811432K351343
$$ 595022142 599958301 604683399 609078407 613056839 616653025 619877279 622688711 625040054
2992F25040054J827181J305341P94232L02375j04070m53651p10487q04842q12352q02159
$$ 625040054 626867235 628172576 628966808 629269183 629165113 628711462 628000975 627196133 626383781 625581622
3012.4F25581622p97927q53181r63867j126528j337528j509309j623928j693368j695812
$$ 625581622 624783695 623930514 622966647 621840119 620502591 618993282 617369354 615675986 613980174
3030.8F13980174j696467j743853j801372j859009j927972k000272k074361k136529
$$ 613980174 612283707 610539854 608738482 606879473 604951501 602951229 600876868 598740339
3047.1E98740339k161026k171874k194643k189576k183319k174496k057314j897156
$$ 598740339 596579313 594407439 592212796 590023220 587839901 585665405 583608091 581710935
3063.4E81710935j812816j752257j668334j572013j480103j430154j400530j395822
$$ 581710935 579898119 578145862 576477528 574905515 573425412 571995258 570594728 569198906
3079.7E69198906j404821j325608j219690j174151j145900j131773j110792j075864
$$ 569198906 567794085 566468477 565248787 564074636 562928736 561796963 560686171 559610307
3096E59610307j088500j142382j202584j253247j258850j232207j259148j330376j375496
$$ 559610307 558521807 557379425 556176841 554923594 553664744 552432537 551173389 549843013 548467517
3114.4E48467517j433075j511752j595199j687050j705945j702726j752555j772702
$$ 548467517 547034442 545522690 543927491 542240441 540534496 538831770 537079215 535306513
3130.7E35306513j793444j833677j841664j870454j928806j966357j990557k012968
$$ 535306513 533513069 531679392 529837728 527967274 526038468 524072111 522081554 520068586
3147E20068586j976609j910925j975060k126276k161801k089858k063930k107144k134502
$$ 520068586 518091977 516181052 514205992 512079716 509917915 507828057 505764127 503656983 501522481
3165.4E01522481k122432k097129k088130k104163k124816k148181k160937k153575
$$ 501522481 499400049 497302920 495214790 493110627 490985811 488837630 486676693 484523118
3181.7D84523118k130449k098352k066553k056747k078623k085656k049297j996815
$$ 484523118 482392669 480294317 478227764 476171017 474092394 472006738 469957441 467960626
3198D67960626j936972j861573j838356j887023j904041j852870j801848j802564j808137
$$ 467960626 466023654 464162081 462323725 460436702 458532661 456679791 454877943 453075379 451267242
3216.4D51267242j755744j712203j760036j834571j853436j829624j824618j866728
$$ 451267242 449511498 447799295 446039259 444204688 442351252 440521628 438697010 436830282
3232.7D36830282j947999k005100k002537k039939k142758k193808k184004k220452
$$ 436830282 434882283 432877183 430874646 428834707 426691949 424498141 422314137 420093685
3249D20093685k284944k304822k296001k308130k329647k322346k286464k216369k110064
$$ 420093685 417808741 415503919 413207918 410899788 408570141 406247795 403961331 401744962 399634898
3267.4C99634898j998216j941651j889080j748681j572907j428634j333416j263171
$$ 399634898 397636682 395695031 393805951 392057270 390484363 389055729 387722313 386459142
3283.7C86459142j155525j002193q73834p99328p13438o14941n58227n40584n25117
$$ 386459142 385303617 384301424 383427590 382628262 381914824 381299883 380741656 380201072 379675955
3302C79675955m47303l77357m21763m56721l90529l44724l67611l66688l47048l47108
$$ 379675955 379228652 378851295 378429532 377972811 377582282 377237558 376869947 376503259 376156211 375809103
3322.4C75809103l47912l76672m41044m85450m88460m81636m85956n41419o57827p16924
$$ 375809103 375461191 375084519 374643475 374158025 373669565 373187929 372701973 372160554 371502727 370785803
3342.8C70785803p29770p70122p76410q22067r48072r71108q56489p93338q65728r54061
$$ 370785803 370056033 369285911 368509501 367687434 366739362 365768254 364911765 364118427 363252699 362298638
3363.2C62298638r43780q92759r32991j060873j077414r52929q54910p87347p48128
$$ 362298638 361354858 360462099 359529108 358468235 357390821 356437892 355582982 354795635 354047507
3381.6C54047507p02769o03050m94599m27902n17666o66767o07342l48776j51992k60890
$$ 354047507 353344738 352741688 352247089 351819187 351301521 350634754 350027412 349678636 349526644 349265754
3402C49265754n12808m70609k13682p9275p7068j31369j75715p6562J13189K46168
$$ 349265754 348752946 348282337 348068655 347989380 347912312 347780943 347605228 347528666 347641855 347888023
3422.4C47888023L75449N20856O07788O06597O65128P98344P68274O42658O70999Q42303
$$ 347888023 348263472 348784328 349392116 349998713 350663841 351462185 352230459 352873117 353544116 354386419
3442.8C54386419J013339J119941J149207J174570J249164J354426J474649J531511
$$ 354386419 355399758 356519699 357668906 358843476 360092640 361447066 362921715 364453226
3459.1C64453226J466871J493245J723528J848012J641125J382887J448721J699984
$$ 364453226 365920097 367413342 369136870 370984882 372626007 374008894 375457615 377157599
3475.4C77157599J945048K038420J881420J801133J931340J979559J944781J998186
$$ 377157599 379102647 381141067 383022487 384823620 386754960 388734519 390679300 392677486
3491.7C92677486K057880K082408K077549K097875K133668K050459J958728K023190
$$ 392677486 394735366 396817774 398895323 400993198 403126866 405177325 407136053 409159243
3508D09159243K150625K328664K444297K313912K202928K331287K542198K515882K323478
$$ 409159243 411309868 413638532 416082829 418396741 420599669 422930956 425473154 427989036 430312514
3526.4D30312514K334684K538890K695084K760768K748072K691209K775431K921134
$$ 430312514 432647198 435186088 437881172 440641940 443390012 446081221 448856652 451777786
3542.7D51777786K914220K757043K731025K889395L027230L104270L186047L296733
$$ 451777786 454692006 457449049 460180074 463069469 466096699 469200969 472387016 475683749
3559D75683749L325492L226966L141403L397166L802062L789752L634781L748178L910184
$$ 475683749 479009241 482236207 485377610 488774776 492576838 496366590 500001371 503749549 507659733
3577.4E07659733M000783M155100M181265L981293L928959M215777M308403M222750
$$ 507659733 511660516 515815616 519996881 523978174 527907133 532122910 536431313 540654063
3593.7E40654063M359961M541874M473507M374445M352510M182577M104614M273951
$$ 540654063 545014024 549555898 554029405 558403850 562756360 566938937 571043551 575317502
3610E75317502M402578M460394M379690M268408M450857M471362M133999L734231L672243
$$ 575317502 579720080 584180474 588560164 592828572 597279429 601750791 605884790 609619021 613291264
3628.4F13291264M179298M255414L987372L923774L831566L663957L575384L408373
$$ 613291264 617470562 621725976 625713348 629637122 633468688 637132645 640708029 644116402
3644.7F44116402L100693L061891L452003L532290L206730L189862L302753L008663
$$ 644116402 647217095 650278986 653730989 657263279 660470009 663659871 666962624 669971287
3661F69971287K730012K692282K448321K118766K301276K271652J892269K227306K559722
$$ 669971287 672701299 675393581 677841902 679960668 682261944 684533596 686425865 688653171 691212893
3679.4F91212893K369523K247333K169967J844644J539231J773417K012968J832902
$$ 691212893 693582416 695829749 697999716 699844360 701383591 703157008 705169976 707002878
3695.7G07002878J556814J358688J252949J358867J417458J188278Q33869P88450J257479
$$ 707002878 708559692 709918380 711171329 712530196 713947654 715135932 715969801 716758251 718015730
3714G18015730J498044J300514J014709Q68917Q20696Q22902R93609R76086O69539
$$ 718015730 719513774 720814288 721828997 722697914 723518610 724341512 725335121 726311207 726980746
3732.4G26980746M77373O85573J126885J131535L92795K8252Q57175Q95500K58148
$$ 726980746 727458119 728143692 729270577 730402112 730794907 730823159 731680334 732575834 732833982
3750.7G32833982O06417J162648R86040O64234P47144Q20518O16312M91798M64082
$$ 732833982 733440399 734603047 735589087 736253321 737000465 737820983 738437295 738929093 739393175
3769.1G39393175N87165Q05438P99298O05225M27902M52221M66406M18723N05805O01112
$$ 739393175 739980340 740785778 741585076 742190301 742618203 743070424 743536830 743955553 744461358 745062470
3789.5G45062470O38247N28693L30925L48330K25782J34409N56528N26369L75330P17461
$$ 745062470 745700717 746229410 746560335 746908665 747134447 747268856 747825384 748351753 748727083 749444544
3809.9G49444544P83146L32713K4378K58446J57833J76370O61671O34551M52280L66509
$$ 749444544 750227690 750560403 750584781 750843227 751001060 751177430 751839101 752473652 752925932 753292441
3830.3G53292441L26097M01676J40309j37209K07841N11825N57005O38724N98311O0022
$$ 753292441 753618538 754020214 754160523 754023314 754231155 754742980 755299985 755938709 756537020 756597042
3850.7G56597042q54313m07696R41992J007378M40419M3273J40726L69191J50264O5088
$$ 756597042 755742729 755335033 756277025 757284403 757724822 757768095 757908821 758278012 758428276 758493364
3871.1G58493364L06308M91381N24580J81794R8408K69651Q4996J46807K55286J04606
$$ 758493364 758799672 759291053 759815633 759997427 760095835 760365486 760450482 760597289 760852575 760957181
3891.5G60957181K69056M21285J20283j94788j28210J08302L31402M77433M17173K65479
$$ 760957181 761226237 761647522 761767805 761573017 761444807 761553109 761884511 762361944 762779117 763044596
3911.9G63044596J08719p8202q0585J11937J48237J05560J92761K23935R0718K2769
$$ 763044596 763153315 763075113 762994528 763106465 763254702 763360262 763553023 763776958 763867676 763890445
3932.3G63890445J27197J73389J25409R5427Q2850J34170J50383Q5890R1255J27852
$$ 763890445 764017642 764191031 764316440 764411867 764494717 764628887 764779270 764865160 764956415 765084267
3952.7G65084267J37627J49309J44661J39534R9898M9889O3956R4294J13726J14977
$$ 765084267 765221894 765371203 765515864 765655398 765755296 765805185 765869141 765963435 766077161 766192138
3973.1G66192138J23322J11044L1888J9431J12891J83940J71721J25587R3162Q8275
$$ 766192138 766315460 766426504 766458392 766477823 766590714 766774654 766946375 767071962 767165124 767253399
3993.4G67253399J28388J65761
$$ 767253399 767381787 767547548
3997.5G67547548
$$ 767547548
##END=$$ End of the data block
