##TITLE=G08-52-SE $$ Begin of the data block
##JCAMP-DX=5.00 $$ ACD/SpecManager v 10.08
##SPECTROMETER/DATA SYSTEM=Alpha
##DATE=17 Oct 2013 10:58:30
##DATA TYPE=INFRARED SPECTRUM
##DATA CLASS=XYDATA
##ORIGIN=
##OWNER=
##NPOINTS=1765
##FIRSTX=399.75695801
##LASTX=3997.56933594
##MAXX=3997.56933594
##MINX=399.75695801
##MAXY=0.83388281
##MINY=0.34754699
##XFACTOR=1.0000000000
##YFACTOR=1.000000000000000e-9
##FIRSTY=0.59636950
##DELTAX=2.03957629
##XUNITS=1/CM
##YUNITS=ARBITRARY UNITS
##XYDATA=(X++(Y..Y))
399.8 596369505 593425989 591205418 590243697 589939713 589536667 589248240 589758396 590506792 590151072
418.1 590151072 588769019 587817252 587497830 586812615 585063159 582963765 581693649 581036031 580152273
436.5 580152273 579530239 580082893 581800163 583744645 584739864 584736407 584769666 585300505 585353732 583754241
456.9 583754241 581204772 579508901 578451872 576639295 573885441 571389973 569843173 568538666
473.2 568538666 566624701 564429998 563129604 563126922 563346744 562693954 561526537 560721219 560092390
491.5 560092390 558688641 556337714 554159641 552944303 551733911 549307287 546148062 543543518
507.9 543543518 541789114 539899707 537142515 534137070 532020211 530856967 529587388 527998626
524.2 527998626 527268410 527977943 529000223 529353440 529857755 531873941 535048962 537644804 538757384
542.5 538757384 539181471 539896011 540356874 539472759 537569880 535967946 535129905 534104645 532003403
560.9 532003403 529374242 527363539 525857091 523931563 521759808 520586133 521235049 523065925 524742246
579.2 524742246 526212513 528574884 531981289 535079956 536687016 537348926 538209438 539231539 539601326
597.6 539601326 539150417 538846016 539405644 540213943 540360630 540104270 540402472 541491270 542716563
616 542716563 543564022 544613421 546750784 549745381 552567840 554835081 557049870 559562802 561977863
634.3 561977863 563776910 565094531 566464007 568106234 569701731 570752561 571272790 571855664 572794020
652.7 572794020 573581874 573760152 573761165 574244559 575140774 575960875 576604903 577374935 578613102 580206990
673.1 580206990 581667185 582688212 583793402 585440040 587163866 588205516 588592649 588960171 589444220
691.4 589444220 589383364 588325918 586930335 586394906 586891890 587610364 588251173 589488208 591847777
709.8 591847777 594816446 597577989 600189626 603434145 607691050 612245262 616108835 619441390
726.1 619441390 623078406 627060890 630329072 632180870 633427560 635047793 636598408 637012661 636420965
744.4 636420965 635893464 635844052 635580420 634340048 632445276 630915225 630072176 629338801 628485084
762.8 628485084 628346741 629909277 632986188 636543572 640122473 644198954 649010181 653745830 657435536
781.2 657435536 660182059 662833691 665625334 667944252 669361293 670517683 672374010 674962640
797.5 674962640 677597642 679883242 682105482 684607446 686961710 688339770 688782871 689085305 689628720
815.8 689628720 689941227 689336896 687892318 686336398 684816599 682709515 679853737 676909983 674475968
834.2 674475968 672389209 670051515 667314351 664781153 663060129 661907434 660594881 659052789
850.5 659052789 657957137 657604039 657448888 657184005 657645524 660011351 664356589 669482708 674211860
868.9 674211860 678303421 681929111 684644997 685467601 684182525 681649745 678584576 674887002 670278132
887.2 670278132 665171802 660498083 656608522 652887344 648685932 644205570 639964402 635740399
903.5 635740399 630749166 624798775 618619323 612868309 607459605 602139473 597225606 593498766
919.8 593498766 591355503 590245962 589284182 588266551 587641537 587532341 587365687 586702466 585860491
938.2 585860491 585252523 584402502 582077622 577463686 570868373 563077688 554490566 545213759 535580158
956.6 535580158 526095271 516924322 507809341 498570144 489488631 481121719 473769248 467338651
972.9 467338651 461742222 457212269 454026967 451970220 450460076 449168265 448136926 447369993 446651906
991.2 446651906 445772141 444848269 444249541 444122404 444251418 444290847 444042891 443537831 442791939 441717267
1011.6 441717267 440291941 438701481 437261701 436003000 434568167 432760984 430804580 428952247
1027.9 428952247 427198499 425380200 423434585 421534836 419821858 418186784 416437030 414589852
1044.3 414589852 412944883 411762714 411012352 410586178 410596699 411259860 412537336 414138764 415921360
1062.6 415921360 417916387 419904649 421137124 420905322 419563800 418378741 418326586 419499993 421590865
1081 421590865 424412191 427926302 431949764 436036527 439837486 443305105 446507812 449371576 451616645
1099.3 451616645 453110486 454216212 455482721 457095534 458933473 460987300 463360637 466001928
1115.6 466001928 468603283 470810294 472614199 474330246 476213872 478320628 480683416 483310074
1132 483310074 485987246 488306850 489875674 490575343 490631223 490353674 489885151 489252925 488598824 488185823
1152.4 488185823 488222331 488817960 490000516 491783530 494234413 497355908 500952482 504819453 509008586
1170.7 509008586 513746917 519143105 525006890 531036198 537091732 543157220 549108267 554626167
1187 554626167 559334815 563033938 565771759 567591727 568430424 568401337 567887604 567252040 566660464
1205.4 566660464 566136181 565718591 565515697 565552115 565608084 565383434 564840853 564155281 563407063 562419057
1225.8 562419057 560984552 559276998 557739377 556532085 555489361 554574549 554050684 554198742 554965556
1244.1 554965556 556033134 557276011 558887899 560943782 563152373 565161526 566972196 568881214
1260.4 568881214 571022272 573157728 575014532 576708257 578522623 580376267 581868947 582866192
1276.8 582866192 583702326 584714592 585830927 586815417 587656796 588512480 589385569 589924991 589790940
1295.1 589790940 589065194 588108659 587080657 585793018 584151566 582445085 581023812 579909384 578936279
1313.5 578936279 578131139 577769637 577960193 578334153 578330159 577722907 576645434 575209498 573398829
1331.8 573398829 571328878 569391787 567932487 566995919 566364110 565774441 565154970 564553142 563828528
1350.2 563828528 562732995 561274290 559698701 558112860 556195199 553539753 550295651 546953440
1366.5 546953440 543813109 541113615 538600922 535863519 533029318 530115187 526850998 523435950
1382.8 523435950 520638168 518978715 518368483 518271327 518189549 518047988 518116832 518499672 519175291 520131588
1403.2 520131588 521409512 522978246 524637699 526221454 527709603 529249728 531002879 533037901
1419.5 533037901 535040081 536827505 538466871 539832950 540658236 540825605 540487111 539741099 539030790
1437.9 539030790 538857758 539011657 539305568 539744377 540247023 540648937 540907502 541352451 542579770
1456.2 542579770 544859529 547363639 549677730 552118182 555077374 558799267 563701332 570262372
1472.6 570262372 577364326 583517790 588341355 591700673 593744576 594591379 594120026 592023551 588614881
1490.9 588614881 584959507 580829859 575582981 570112288 565183342 560518384 554502130 545798182
1507.2 545798182 537734687 531020045 524578154 519006431 514959216 512414157 510321259 508253455
1523.6 508253455 506200075 503912091 501795769 499898225 498091340 496875763 496067405 495080322 494615972
1541.9 494615972 495244026 496618211 498586953 501203239 504507422 508386433 512440264 516932011
1558.2 516932011 521917343 525944471 529400229 532666147 535555363 538186789 540443242 542246044
1574.5 542246044 543605506 544528067 545094669 545276880 545167267 544733822 543861449 542477846 540672362
1592.9 540672362 538396537 535541475 532047927 527857125 522992551 517481446 511210263 503980398
1609.2 503980398 496146142 488158256 479072809 468207806 458264947 448790699 437735826 426576704
1625.5 426576704 416172892 406298786 397749901 389913857 381816983 375970125 373261452 372308195
1641.8 372308195 372457504 373482138 375366002 377582669 380172491 383731574 387497842 391406715
1658.2 391406715 396142304 401999235 408645958 415203452 422223538 430117399 437680513 445372313
1674.5 445372313 453650922 461573303 469202310 477635324 488058716 498206884 507384419 517430604
1690.8 517430604 528119326 540643215 554845214 568984985 584164858 597169220 607902408
1705.1 607902408 618113995 626912832 634498239 641241252 647242248 652856648 657901108 662094951
1721.4 662094951 665697277 668823659 671380103 673633814 675655007 677400410 679068565 680780888
1737.7 680780888 682710826 685124576 688026190 691350579 695212364 699867368 705192029 710312188
1754 710312188 715117216 719922245 724689603 729487181 733908296 737765551 741458058 745120943 748668253
1772.4 748668253 751844406 754534841 757104278 759709775 762055039 763956785 765701294 767544329
1788.7 767544329 769334495 770940244 772343993 773701549 775174499 776704133 778026164 779123366
1805 779123366 780294478 781647980 782945633 783947945 784821510 785881341 787165046 788318098 789120913
1823.4 789120913 789860427 790831804 791863084 792728901 793435335 794127941 794986129 795888960 796519220
1841.7 796519220 796857238 797400832 798271358 799043119 799527347 799902916 800462425 801174462 801758051 802118838
1862.1 802118838 802476704 802959263 803441644 803842545 804196000 804620445 805214643 805810332 806184232 806458414
1882.5 806458414 806888103 807472050 807957292 808258355 808543682 808949411 809479058 809940457 810199261 810397208
1902.9 810397208 810734332 811157823 811445832 811562181 811724007 812045276 812395871 812649012 812779784 812941730
1923.3 812941730 813304782 813690960 813835621 813821495 813938379 814250410 814552605 814657807 814635694 814770401
1943.7 814770401 815127373 815398276 815413594 815404117 815632701 816011012 816217005 816197395 816261828 816577017
1964.1 816577017 816897511 816965044 816886127 816946685 817241371 817543805 817601085 817529798 817659020 817949235
1984.5 817949235 818079650 817981839 817908525 818081021 818367481 818456173 818343580 818313658 818467438 818616748
2004.9 818616748 818552971 818350136 818263531 818337083 818308711 818046808 817793190 817738354 817777276 817667127 817349970
2027.3 817349970 817071855 817027926 817039430 816852272 816536605 816354811 816377997 816396654 816251397 816032112
2047.7 816032112 815953195 816057622 816152155 816103220 816033661 816124022 816334724 816463768 816468716 816512406 816651285
2070.2 816651285 816776276 816795766 816789031 816878140 817062259 817247689 817340672 817378998 817477167 817668676 817845225
2092.6 817845225 817911863 817942917 818080366 818311274 818497121 818568587 818613172 818777919 819025397 819204152
2113 819204152 819276989 819342494 819487989 819657564 819734097 819733441 819787204 819942653 820107698 820171893 820161104
2135.4 820161104 820215702 820392728 820577919 820644736 820650518 820761144 820971727 821143746 821235836 821312606 821488142
2157.9 821488142 821771264 822005570 822121263 822260737 822558880 822944582 823245704 823447704 823699355 824067473
2178.2 824067473 824443102 824697912 824887514 825165570 825537682 825865626 826071382 826248169 826524734 826864302
2198.6 826864302 827122211 827285349 827489197 827799082 828118801 828348160 828496218 828658640 828931987 829254866
2219 829254866 829473555 829594314 829742134 829948723 830136776 830232680 830293477 830452681 830690563 830846608
2239.4 830846608 830863357 830860138 830945373 831115544 831273437 831331432 831350446 831429482 831558645 831655264 831672966
2261.9 831672966 831684113 831783235 831910431 831939578 831904411 831950724 832080364 832134843 832064331 831995130 832049668
2284.3 832049668 832193732 832291424 832267404 832186341 832206607 832350731 832455218 832428396 832377672 832460880 832663953
2306.7 832663953 832787752 832762778 832757115 832912922 833186388 833394587 833419919 833394766 833537161 833780289
2327.1 833780289 833882809 833773136 833635807 833581567 833481610 833266079 832949817 832464755 831794679 831345856
2347.5 831345856 831399798 831852973 832482338 832956672 832998574 832656622 832284808 831958771 831394494 830518126
2367.9 830518126 829538763 828697562 828031301 827376246 826698005 826127887 825740218 825449646 825109065 824711323
2388.3 824711323 824383676 824182689 824014664 823741913 823334396 822939098 822686791 822442591 822028756 821535707
2408.7 821535707 821143806 820839405 820470095 819964409 819428384 818990707 818628132 818214595 817677498 817106009
2429.1 817106009 816627383 816207886 815713882 815116942 814538777 814073205 813638031 813114941 812529504 811999977
2449.5 811999977 811553836 811075449 810498297 809898734 809389353 808971763 808520734 807971835 807415724 806948841
2469.9 806948841 806523681 806026101 805453122 804922283 804494798 804081142 803566933 802973509 802449346 802057087
2490.3 802057087 801671743 801194191 800696790 800269723 799884081 799446702 798957705 798513055 798129499 797738671
2510.7 797738671 797290623 796793580 796310663 795893192 795510173 795081556 794593215 794110119 793659866 793176889
2531.1 793176889 792608380 792017221 791511118 791077375 790605247 790060639 789502978 788976729 788452804 787895679
2551.5 787895679 787331223 786792576 786302686 785860240 785403371 784877539 784326732 783826053 783358455 782854974
2571.9 782854974 782312512 781804323 781362176 780901074 780348301 779772639 779261172 778787315 778285921 777723968
2592.3 777723968 777156532 776676536 776236296 775716662 775117099 774532497 774004936 773471534 772846103 772113323
2612.7 772113323 771371901 770706713 770032108 769222379 768329859 767513275 766793132 766004384 765082002 764140069
2633.1 764140069 763256848 762424827 761574686 760649800 759731352 758917451 758132577 757234097 756232440
2651.4 756232440 755290806 754483879 753691614 752807260 751894712 751068652 750281215 749408722 748476148 747603655
2671.8 747603655 746833742 746105909 745341837 744519591 743694842 742930889 742200673 741437078 740638077 739846230
2692.2 739846230 739089549 738319933 737469673 736580968 735712767 734845579 733937144 732972860 731983900 731035888
2712.6 731035888 730108798 729129970 728124678 727157414 726233184 725319505 724408567 723502636 722604513
2731 722604513 721730530 720897734 720087409 719258547 718434513 717643976 716872871 716110289 715357423 714632154
2751.4 714632154 713938296 713222742 712439001 711617708 710825920 710073411 709316850 708534300 707727849 706910253
2771.8 706910253 706076264 705201983 704272687 703293324 702315927 701344430 700287879 699142337 698024809
2790.1 698024809 696937799 695759714 694471061 693170786 691908002 690623403 689248145 687782109
2806.4 687782109 686257362 684708714 683152556 681549311 679865539 678133309 676357806 674484074
2822.7 674484074 672495246 670434535 668352723 666199028 663827896 661203921 658381283 655297399
2839.1 655297399 651745498 647541881 642699778 637410939 632004559 626984239 622845232 619789958
2855.4 619789958 617645144 615900517 613934517 611377597 608213484 604621589 600903392 597437322
2871.7 597437322 594507158 592237711 590612531 589434147 588419914 587395132 586335480 585233688
2888 585233688 583996177 582564116 580988646 579297900 577460229 575427532 573133707 570557892 567717195
2906.4 567717195 564526618 560848057 556664765 552076042 547251284 542452395 538028598 534332573
2922.7 534332573 531609237 529964685 529375196 529743075 531039596 533306777 536440670 540124178 544029236
2941 544029236 547885180 551388919 554276407 556457043 558002710 559073567 559964776 561082006 562734663
2959.4 562734663 565057516 568059027 571694791 575883567 580491245 585408926 590506971 595576704
2975.7 595576704 600486636 605195045 609590471 613586485 617200911 620429695 623260379 625647962
2992 625647962 627514243 628876746 629718006 630000591 629852414 629399657 628721714 627939343 627119601 626291633
3012.4 626291633 625487447 624663532 623734891 622643352 621344626 619834423 618169069 616459548 614795685
3030.8 614795685 613140106 611410320 609593213 607690096 605720937 603712916 601630151 599481881
3047.1 599481881 597345352 595216811 593049228 590866804 588693380 586534500 584453762 582509458
3063.4 582509458 580699205 578999400 577379227 575810015 574283063 572819591 571422160 570047498
3079.7 570047498 568690121 567367136 566057265 564802885 563664079 562586725 561510742 560423076
3096 560423076 559310198 558167100 556988001 555778563 554540277 553254366 551926076 550587177 549230635
3114.4 549230635 547800601 546276808 544679940 543019652 541324615 539609790 537857533 536086798
3130.7 536086798 534279764 532428920 530585170 528710604 526750624 524756670 522786558 520820379
3147 520820379 518855155 516910434 514907241 512791395 510650873 508571088 506533563 504448831 502279639
3165.4 502279639 500092626 497964174 495882362 493788153 491664737 489495397 487316757 485205621
3181.7 485205621 483131438 481029689 478930593 476877540 474836260 472764015 470713347 468745917
3198 468745917 466803253 464859635 462971181 461128503 459258139 457361549 455520093 453744084 451978326
3216.4 451978326 450186849 448377907 446542174 444662213 442790896 440970153 439167708 437334031
3232.7 437334031 435413748 433380693 431287915 429198831 427096516 424929619 422708452 420463115
3249 420463115 418193668 415883869 413539410 411190659 408837527 406514108 404279709 402105093 399965435
3267.4 399965435 397915155 395963252 394080758 392312944 390729696 389317483 388004631 386764497
3283.7 386764497 385639399 384654820 383785576 383010715 382297754 381621003 380987555 380383641 379831940
3302 379831940 379418164 379102021 378737986 378311634 377879769 377470940 377107829 376762033 376403034 376036555
3322.4 376036555 375661165 375248671 374782473 374312639 373864055 373397082 372881621 372298121 371617258 370852441
3342.8 370852441 370068550 369312376 368583500 367807388 366916090 365943611 364990115 364111215 363214910 362241894
3363.2 362241894 361310393 360455841 359550118 358518571 357466191 356516302 355629414 354785055 354026824
3381.6 354026824 353325188 352668941 352173001 351822853 351358682 350716293 350129098 349767327 349563122 349246919
3402 349246919 348724872 348289669 348087937 347970217 347825855 347657353 347546995 347562850 347678810 347875267
3422.4 347875267 348208517 348688424 349279374 349925399 350655764 351477534 352195829 352778584 353460073 354362249
3442.8 354362249 355422854 356552541 357684106 358852118 360119969 361485094 362929702 364435881
3459.1 364435881 365929604 367428869 369120002 370982617 372682095 374076456 375474513 377147108
3475.4 377147108 379092366 381109715 382984459 384812325 386765242 388749480 390691131 392678887
3491.7 392678887 394718766 396790564 398884028 401008189 403147787 405197293 407182813 409248799
3508 409248799 411437869 413787663 416206956 418468595 420662820 423028052 425594836 428149134 430535525
3526.4 430535525 432927370 435483187 438145041 440905005 443693370 446376234 449118048 452073604
3542.7 452073604 455084026 457890332 460589081 463462561 466507614 469592929 472748786 476051599
3559 476051599 479418755 482708961 485918999 489331752 493050456 496816069 500537455 504301608 508194804
3577.4 508194804 512265086 516447723 520623505 524705231 528726459 532902837 537174881 541444540
3593.7 541444540 545853615 550392032 554871500 559295058 563679457 567886293 572072268 576422811
3610 576422811 580811739 585229874 589623690 593932331 598364174 602815092 607026041 610871255 614599466
3628.4 614599466 618724406 622888267 626845479 630728424 634503126 638197958 641865134 645350933
3644.7 645350933 648506522 651592493 654987872 658418238 661584795 664751530 667961955 670912266
3661 670912266 673678577 676432908 678937376 681103051 683426738 685748518 687682390 689819336 692236364
3679.4 692236364 694524765 696762264 698959649 700875819 702497005 704216719 706085920 707876623
3695.7 707876623 709515333 710943699 712195337 713520169 714920104 716157079 717113733 717983067 719185352
3714 719185352 720569909 721811652 722841799 723689497 724445164 725244224 726244390 727284133 728100657
3732.4 728100657 728687882 729357958 730405152 731507123 731984377 732082307 732863605 733688474 733967543
3750.7 733967543 734583437 735716879 736685812 737286091 737900317 738659203 739342332 739911556 740372539
3769.1 740372539 740912974 741681933 742454946 743074417 743539870 743955612 744380713 744806588 745289385 745860994
3789.5 745860994 746510804 747081339 747476697 747881889 748118401 748205066 748719096 749251366 749616683 750315368
3809.9 750315368 751109183 751470208 751556873 751903474 752123654 752269328 752834201 753393173 753781974 754120469
3830.3 754120469 754495263 754985213 755233586 755147457 755296409 755722046 756188273 756753504 757379293 757613599
3850.7 757613599 756965697 756565690 757370770 758269548 758685648 758758843 758895278 759216547 759348750 759433925
3871.1 759433925 759725630 760123014 760559142 760771990 760959446 761283636 761370003 761470437 761735320 761888146
3891.5 761888146 762127161 762503624 762668610 762576699 762476027 762515187 762765110 763142467 763456166 763694048
3911.9 763694048 763873219 763880432 763819456 763926685 764086604 764176726 764340639 764567494 764659107 764644921 764722586
3934.3 764722586 764903247 765085757 765176773 765193939 765284240 765422761 765551686 765733123 765930176 766068161
3954.7 766068161 766157329 766242385 766323507 766384602 766472816 766619921 766756713 766821325 766857266 766953230 767108798
3977.1 767108798 767233789 767297566 767372370 767498970 767606199 767673790 767748952 767846167 767993569 768175542
3997.5 768175542
##END=$$ End of the data block
