##TITLE=G08-52-CE $$ Begin of the data block
##JCAMP-DX=5.00 $$ ACD/SpecManager v 10.08
##SPECTROMETER/DATA SYSTEM=Alpha
##DATE=17 Oct 2013 10:58:30
##DATA TYPE=INFRARED SPECTRUM
##DATA CLASS=XYDATA
##ORIGIN=
##OWNER=
##NPOINTS=1765
##FIRSTX=399.75695801
##LASTX=3997.56933594
##MAXX=3997.56933594
##MINX=399.75695801
##MAXY=0.85026568
##MINY=0.40048730
##XFACTOR=1.0000000000
##YFACTOR=1.000000000000000e-9
##FIRSTY=0.65995330
##DELTAX=2.03957629
##XUNITS=1/CM
##YUNITS=ARBITRARY UNITS
##XYDATA=(X++(Y..Y))
399.8F59953296l076136l78370J065969k23517j770079q76367J206159J400411r93132
418.1F56308234l105045j609861R90211R44198j798690l153503j274526R34482N44667
436.5F48780167j677394k036750Q28564L231764J769066j225114j802087K5690J243710
454.8F49137616k08795k926230k932251m63843M43756j599729l587663k828538k92242
473.2F34742081O23942j282633k852022j575172Q36253J129269j148879k856732j680433
491.5F25935674N46157K61724k402961l693044j952649L4750q02219l234565l785074
509.9F10907793j782834j52469j104117l180623l276705r98259Q23319K29478j377404
528.3F00088179j186371J045466K610445J675784M8876L38555J984596K278268J87278
$$ y = [659953296, 656877160, 656498790, 657564759, 657341242, 655571163, 654694796, 655900955, 657301366, 656308234, 653203189, 651593328, 652583539, 653527737, 651729047, 648575544, 647301018, 648235500, 648780167, 647102773, 645066023, 645894587, 649126351, 650895417, 649670303, 647868216, 647893906, 649137616, 648928821, 646002591, 643070340, 642606497, 643050253, 641450524, 637862861, 635034323, 634742081, 635366023, 634083390, 631231368, 629656196, 630492449, 631621718, 630472839, 627616107, 625935674, 626481831, 626743555, 624340594, 620647550, 618694901, 618729651, 617927432, 614692867, 610907793, 609124959, 608972490, 607868373, 604687750, 601411045, 600412786, 601236105, 601465583, 600088179, 598901808, 599947274, 602557719, 604233503, 604282379, 604620934, 606605530, 608883798, 609071076]
546.6F09071076j965344j537681L67999P21574j111746k711117k024710k92420n9665
565F00457966j756489l133118k056718M32909J513183M83930k64049J163483L278553
583.3F00119650L404618J416027j43051M71830J777292J421928l91066j271963m053
601.7F06801212J545369J164556n60641j230538K7180J560151J400709L4988j40786
620F10602200J605630L370464L101349J411438P08699J795828K923668K194047L84092
638.4F28097415j02460J280605K506435J668036k50339p88629N60939J876414J225173
656.7F36073589n58316r17554O16252J415193o795r95815Q81374K184987K743006K022743
677.1F43458664L30449j1862J482070K507388J389921m85599p57098N47051J246810
$$ y = [609071076, 607105732, 605568051, 605936050, 606657624, 605545878, 602834761, 600810051, 600517631, 600457966, 598701477, 595568359, 593511641, 593944550, 595457733, 595941663, 595677614, 596841097, 600119650, 603524268, 604940295, 604797244, 605269074, 607046366, 608468294, 608077228, 606805265, 606801212, 608346581, 609511137, 608950496, 607719958, 607747138, 609307289, 610707998, 610742986, 610602200, 612207830, 615578294, 618679643, 620091081, 620799780, 622595608, 625519276, 627713323, 628097415, 627994955, 629275560, 631781995, 633450031, 633199692, 632411063, 632972002, 634848416, 636073589, 635515273, 634597719, 635213971, 636629164, 636622369, 635626554, 636507928, 638692915, 641435921, 643458664, 643789113, 643777251, 645259321, 647766709, 649156630, 648671031, 647913933, 648460984, 649707794]
695.5F49707794J20580j350641r26971J269817K731681J988828N42998P53105K697289
713.8F57534480L968477K990783J433611J858592L818452M736602L363192J352847
730.2F81057036J206219K712369L329098J715184l24786m09842J127720J838505M43757
748.5F92695260j460552j446605K23458R47773l61859j890421j355112R48191K421975
766.9F90722108J812935R59396J935840M093528M915058L419101J577497J646161L083766
785.2G14165390L342628J590788j19745L44216K262891L002465J735389N69939J354695
803.6G28248656L061473L263831J360894m21286N901J683712J890778p0333j890659
821.9G37132967j506329L5465J29401j539588k725780j940846l39508j05798j593411
$$ y = [649707794, 649828374, 648477733, 647550762, 648820579, 651552260, 653541088, 654084086, 654837191, 657534480, 661502957, 664493740, 665927351, 667785943, 671604395, 676340997, 679704189, 681057036, 682263255, 684975624, 688304722, 690019906, 689695120, 689285278, 690412998, 692251503, 692695260, 691234708, 689788103, 690011561, 690959334, 690597475, 688707054, 687351942, 688300133, 690722108, 692535043, 693494439, 695430279, 699523807, 704438865, 707857966, 709435463, 711081624, 714165390, 717508018, 719098806, 718979061, 719323277, 721586168, 724588633, 726324022, 726893961, 728248656, 731310129, 734573960, 735934854, 735513568, 735519469, 737203181, 739093959, 739023626, 737132967, 735626638, 735662103, 735791504, 734251916, 731526136, 729585290, 729245782, 729139984, 727546573]
840.3G27546573k722323j764715J42872N38946r11117j949906r57787P59124J109422
858.7G21791089K93612L30567K290011M608512M836619L007710J525163J768232K364337
877G42815852J216352j498818l408551l076315j954735k246499l772616m459858l312409
895.4G20302403j787126j918376l573000m685998m161000l262580l702759n202234
911.7F92009330n849123m717410l043115k427697k741635k540946j210392J06156L8088
930F69623256j050532j519621o78122L45111P4506j439094k857924l463566l999412
948.4F55034602n450845p388771q353233p851481p050932p283866q357466q875429
964.7E94422579q178652p167756o907404p180929o832063n348742l657818k893686
$$ y = [727546573, 724824250, 723059535, 723202407, 723741353, 722830236, 720880330, 719922543, 720681667, 721791089, 722084701, 722415268, 724705279, 729313791, 734150410, 737158120, 738683283, 740451515, 742815852, 744032204, 742533386, 739124835, 736048520, 734093785, 731847286, 728074670, 723614812, 720302403, 718515277, 716596901, 713023901, 708337903, 704176903, 700914323, 697211564, 692009330, 686160207, 681442797, 678399682, 675971985, 673230350, 670689404, 669479012, 669585168, 669623256, 668572724, 667053103, 666374981, 666720092, 666794598, 665355504, 662497580, 659034014, 655034602, 649583757, 642194986, 633841753, 625990272, 618939340, 611655474, 603298008, 594422579, 586243927, 579076171, 572168767, 564987838, 558155775, 552807033, 549149215, 546255529]
981E46255529k921581k708316j785338q82864r17614j639485j885533j138687j43409
999.4E32232702J03175m72903j010120r34362p39455j175523k066851k465606j944124
1017.7E21526933j235962j297116k036155k492785k151609j552820j505196k021670
1034.1E07233620k337277j971066j418412j443982j934618k102077j544148o58303
1050.4D93823737j29312q7738L5077O85662J551807J981169J781493J324594Q03471
1068.7E01769960R7036o62684j004696m75198Q95709K464831L423929L581583L484547
1087.1E13575017L687144M059136L947079L141582K256215J877665J829326J571119
1103.4E35944283J098394J022220J618445K437890K807498K514243K057314K010464
$$ y = [546255529, 543333948, 540625632, 538840294, 537957430, 537039816, 535400331, 533514798, 532376111, 532232702, 532335877, 531862974, 530852854, 529918492, 529179037, 528003514, 525936663, 523471057, 521526933, 520290971, 518993855, 516957700, 514464915, 512313306, 510760486, 509255290, 507233620, 504896343, 502925277, 501506865, 500062883, 498128265, 496026188, 494482040, 493823737, 493694425, 493606687, 493641764, 494327426, 495879233, 497860402, 499641895, 500966489, 501769960, 501866996, 501204312, 500199616, 499724418, 500620127, 503084958, 506508887, 510090470, 513575017, 517262161, 521321297, 525268376, 528409958, 530666173, 532543838, 534373164, 535944283, 537042677, 538064897, 539683342, 542121232, 544928730, 547442973, 549500287, 551510751]
1119.7E51510751K276361K256751J780331J485348J998723K870738L024578K144039
1136E69347620R94384M28498L89159J91271m24206r13978p02500K2709N65708O49750
1156.4E70548415Q17180J667201K911985L687740L704905L598213M107535N129159
1172.7E96172333N792439N611002N187571N277217N682468N541623M525542L320634
1189.1F37110829K657891K346038J651884M05669o70135q93772n36322l70980o42478
1207.4F41058624q52108n40793m17P1466m93646j066566j100182q31306q67784j384199
1227.8F33993089j859724j734734j168907p64489p86543q14676k89977O17683J236499
1246.2F28428221J273691J149476J401126J916826K108157J756251J338422J397371
$$ y = [551510751, 553787112, 556043863, 557824194, 559309542, 561308265, 564179003, 567203581, 569347620, 570342004, 570770502, 571159661, 571350932, 570926726, 570012748, 569310248, 569332957, 569898665, 570548415, 571365595, 573032796, 575944781, 579632521, 583337426, 586935639, 591043174, 596172333, 601964772, 607575774, 612763345, 618040562, 623723030, 629264653, 633790195, 637110829, 639768720, 642114758, 643766642, 644172311, 643502176, 642608404, 642072082, 641701102, 641058624, 640206516, 639665723, 639665306, 639736772, 639243126, 638176560, 637076378, 636245072, 635377288, 633993089, 632133365, 630398631, 629229724, 628465235, 627678692, 626864016, 626574039, 627191722, 628428221, 629701912, 630851388, 632252514, 634169340, 636277497, 638033748, 639372170, 640769541]
1262.5F40769541J840592K078414J788139J317561J189947J342058J260757P79272
1278.8F52366281L59237M92573J020133J285613R40561L70860J15454J02043k16245
1297.2F56836510r31979j518547j599670j348912j224458j400531j519918j161278
1313.5F46131217m41968J24931K46883J24454N5075l8207m76062j244843j846731j880526
1333.9F40754223j480103j100659r16600p67589n16236k52545k52842o46115j136243
1352.2F33685291j330674j230657j268923j759827k422810k768457k800703k706766
1368.5F17396474k446413k333522k424479k430379k555013k964913l227056k763509
1384.9E96251190j660824n73158j64569l22580m43936j75237K50876N78522P49469
$$ y = [640769541, 642610133, 644688547, 646476686, 647794247, 648984194, 650326252, 651587009, 652366281, 652725518, 653218091, 654238224, 655523837, 656464398, 656835258, 656950712, 657052755, 656836510, 655904531, 654385984, 652786314, 651437402, 650212944, 648812413, 647292495, 646131217, 645689249, 645814180, 646061063, 646185517, 646240592, 646202385, 645726323, 644481480, 642634749, 640754223, 639274120, 638173461, 637256861, 636489272, 635973036, 635720491, 635467649, 634821534, 633685291, 632354617, 631123960, 629855037, 628095210, 625672400, 622903943, 620103240, 617396474, 614950061, 612616539, 610192060, 607761681, 605206668, 602241755, 599014699, 596251190, 594590366, 594017208, 593852639, 593530059, 593086123, 592910886, 593161762, 593740284, 594489753]
1403.2E94489753J007736J367033J598894J650393J500547J336396J534700K161443
1419.5F06646895K262772J839876J500547J195073Q98301M50492k45094q42452o67334
1437.9F13039076K6644L51071K79844J77264L54528N65768M37140L30866R87231K392590
1458.3F18942022K844155K556563K513706K793312L338993M509807O302177O701649
1474.6F50502384N482137M293382L262103K116978O49512q58724k071977k797365l171742
1493F57406688m080177n287706n288244m653752m643559o217897q569479p548988o281376
1511.3F04835510o269097n741596m415214k845466k150119k053141k197803k498567
1527.6E76664507k304852k050042j941502j553237j400173j449287n08010O61194J210928
$$ y = [594489753, 595497489, 596864522, 598463416, 600113809, 601614356, 602950752, 604485452, 606646895, 608909667, 610749543, 612250090, 613445163, 614343464, 614793956, 614548862, 613706410, 613039076, 613065720, 613416791, 613696635, 613873899, 614228427, 614794195, 615231335, 615562201, 616549432, 618942022, 621786177, 624342740, 626856446, 629649758, 632988751, 637498558, 643800735, 650502384, 655984521, 660277903, 663540006, 665656984, 666306496, 665447772, 663375795, 660578430, 657406688, 653326511, 648038805, 642750561, 638096809, 633453250, 627235353, 618665874, 611116886, 604835510, 598566413, 592824817, 588409603, 585564137, 583414018, 581360877, 579163074, 576664507, 574359655, 572309613, 570368111, 568814874, 567414701, 565965414, 565457404, 566118598, 567329526]
1546E67329526J559377K099037K770841L209054L155709L613054M534007L688514K965689
1564.3E94924808K622187K149760J995564J719952J284062R49204N12600Q4699j96517
1582.7F06046319l77774q10504j428366j921952k178311k525806l109754l824830m479169
1601.1E85389853m911244n312682o035506p057965p633448p665753q504331r985090
1617.4E28283834r208083q879959j0187567j0115891r498298r195775q120209p439465
1633.7D55638587p404476n136788k376348r04739J38373J223772K190292K247632K681196
1652D48297501M259258M431307M196763M803569N900859O773264O637662P093519P972986
1670.4E00366688P499039P680833Q470774P996321P359147P997930J0318756J0272086
$$ y = [567329526, 568888903, 570987940, 573758781, 576967835, 580123544, 583736598, 588270605, 591959119, 594924808, 597546995, 599696755, 601692319, 603412271, 604696333, 605645537, 606158137, 606242836, 606046319, 605668545, 604858041, 603429675, 601507723, 599329412, 596803606, 593693852, 589869022, 585389853, 580478609, 575165927, 569130421, 562072456, 554439008, 546773255, 538268924, 528283834, 519075751, 510195792, 500008225, 489892334, 480394036, 471198261, 463078052, 455638587, 448234111, 443097323, 440720975, 439816236, 439954609, 441178381, 443368673, 445616305, 448297501, 452556759, 456988066, 461184829, 465988398, 471889257, 478662521, 485300183, 492393702, 500366688, 507865727, 515546560, 524017334, 532013655, 539372802, 547370732, 557689488, 567961574]
1686.7E67961574R112715R674967R978830J1712432J3421715J3188004J3841927J1406958
1703F60299122R208322Q977890P620454O066978M981875M482687M724741M406213L249407
1721.4G14017689K511740K306104K097666J789391J305521J262128J728475J813829
1737.7G28832543J906574K152800K458811K967000L596246M253924M579365M203558
1754G54950821M122675M333556M150807M009128L663063L295958L239513L072261K935470
1772.4G87773252K783298K451360K315939K172708J786471J500070J513123J503885
1788.7H03800106J338184J276374J197755J133442J213193J280427J106381Q62241
1805H13208103Q74043J053929J107454Q94070P05063P95842J002073R17792N96762
$$ y = [567961574, 577074289, 586749256, 596728086, 608440518, 621862233, 635050237, 648892164, 660299122, 669507444, 678485334, 686105788, 692172766, 697154641, 701637328, 706362069, 710768282, 714017689, 716529429, 718835533, 720933199, 722722590, 724028111, 725290239, 727018714, 728832543, 730739117, 732891917, 735350728, 738317728, 741913974, 746167898, 750747263, 754950821, 759073496, 763407052, 767557859, 771566987, 775230050, 778526008, 781765521, 784837782, 787773252, 790556550, 793007910, 795323849, 797496557, 799283028, 800783098, 802296221, 803800106, 805138290, 806414664, 807612419, 808745861, 809959054, 811239481, 812345862, 813208103, 814082146, 815136075, 816243529, 817137599, 817842662, 818638504, 819640577, 820558369, 821155131]
1823.4H21155131M31061N50568Q38399R90450P30515M14967N01931P23004N99563L05236
1843.8H27240825L04341N54025P70152P15375L94702J90437L08215N73993N80132K44021
1864.2H31876218n1677J21892N86390O49273L13044R9361K58744N21838N05686K22922
1884.6H35103691L0219J73807N17249N59688K23935K4378J88589M32074M06027J16050
1904.9H37775707o1214J30534M03583L24965l993j09256J55688L77833L28005J16586
1925.3H39438438k0921R6977K74360K21968k206r6559J1921J60456K04861O6817p5698
1947.8H40280414K4378K26915K25782N0783m4286O2525K20836J91092p570r4771K2769
1970.2H41158867J83284K13921O5387p7248k4080J49190J68264j6391j68503j07526
$$ y = [821155131, 821586192, 822136760, 822975159, 823965609, 824696124, 825111091, 825613022, 826336026, 826935589, 827240825, 827545166, 828099191, 828869343, 829584718, 829979420, 830169857, 830478072, 831052065, 831632197, 831876218, 831824541, 831946433, 832532823, 833182096, 833495140, 833594501, 833853245, 834375083, 834880769, 835103691, 835133910, 835307717, 835824966, 836384654, 836608589, 836632967, 836821556, 837253630, 837659657, 837775707, 837714493, 837845027, 838248610, 838573575, 838569582, 838460326, 838616014, 838993847, 839321852, 839438438, 839417517, 839514494, 839788854, 840010822, 840008616, 839912057, 839923978, 840084434, 840289295, 840356112, 840280414, 840304792, 840531707, 840757489, 840808272, 840763986, 840826511, 841047347, 841238439, 841230869, 841136098, 841158867, 841342151, 841556072, 841621459, 841544211, 841520131, 841669321, 841837585, 841821194, 841652691, 841545165]
1990.6H41545165J03056K01881N2452j38402r8646Q4222J22249n2154k07186j65403
2011H41447234k5391%j36197k51353j96695l1114J9193j26958k87533k52664o2525
2033.4H40095997K4199j22487k89440k08617J7763Q5413p2539k07841j30832O9439
2053.8H39261055J45376K980j49548o2943J70827K21134K5808j37269l6299J72555
2074.2H39613676J96695L3617r0479k9862J57833K40862R5844n8055k0861J52886K24650
2096.7H40516806R4890l4749J5020J62840K12014J12652o794Q821J41084J87874N5611
2119.1H41466069p4804m0948J19746K15649J17481l1292l2783J04070J79767R6560
2139.5H42119515j8358j4961J12235K12193J49071p450k4319J36971K44081J68145
$$ y = [841545165, 841648221, 841850102, 841902554, 841764152, 841665506, 841749728, 841871977, 841819823, 841612637, 841447234, 841421843, 841421843, 841285646, 841034293, 840837598, 840806484, 840825677, 840698719, 840411186, 840158522, 840095997, 840120196, 839997709, 839708269, 839499652, 839517415, 839602828, 839530289, 839322448, 839191616, 839261055, 839406431, 839409411, 839259863, 839196920, 839367747, 839588881, 839614689, 839477420, 839441121, 839613676, 839810371, 839843988, 839753509, 839723647, 839881480, 840122342, 840218186, 840160131, 840139270, 840292156, 840516806, 840611696, 840576947, 840591967, 840754807, 840966821, 841079473, 841072679, 841081500, 841222584, 841410458, 841466069, 841391265, 841350317, 841470063, 841685712, 841803193, 841771901, 841739118, 841843188, 842022955, 842119515, 842101157, 842086196, 842198431, 842410624, 842559695, 842552245, 842527926, 842664897, 842908978, 843077123]
2159.9H43077123M6134O6579K12609L00050K41876J43587J54913K82049L48508K29121
2180.3H45102549Q3983J18792K49505L11195K44797J01387Q4222K36868L21031K19584
2200.7H47073913R4235J11997K21848K67744J98484J00851J13427K13683K32458J26779
2221.1H48755419K1398O5446J86146J86622P8678O556O2049J50740J32918N0664R418
2243.5H49706054M1067Q0586M8220o974k4438j7047K1160M8935M0174J6034l696Q106
2268H49958181K2054K4259K3484R895L0398J00792R6619k5988j59025k28226k50221
2290.4H49602222k78353l00050k81930k83659l19302l53813m51922n95451o77049o52790
2310.8H45407903n42342n39899p97391j084745j094699q73268o66082o66976p17401
$$ y = [843077123, 843123257, 843189836, 843402445, 843702495, 843944371, 844087958, 844242871, 844524920, 844873428, 845102549, 845186532, 845305324, 845554829, 845866024, 846110821, 846212208, 846296430, 846533298, 846854329, 847073913, 847168148, 847280145, 847501993, 847769737, 847968221, 848069072, 848182499, 848396182, 848628640, 848755419, 848776817, 848842263, 849028409, 849215031, 849293709, 849300265, 849362314, 849513054, 849645972, 849696636, 849706054, 849747121, 849827707, 849875927, 849868953, 849844515, 849827468, 849848628, 849897563, 849937737, 849953771, 849950075, 849958181, 849980235, 850004494, 850027978, 850037873, 850068271, 850169063, 850265682, 850239694, 850080669, 849852443, 849602222, 849323869, 849023819, 848741889, 848458230, 848138928, 847785115, 847333193, 846737742, 846060693, 845407903, 844865561, 844325662, 843528271, 842443526, 841348827, 840475559, 839809477, 839142501, 838425100]
2329.2H38425100n17905k98142l54231n03480n26309l14176L10242J226187J190841
2347.5H38638127j39058j634180k339483k048850j387775o88433m8638N13137J085937
2365.9H31950784J470208J562834J607179J625181J490712J300335J179814J013815
2382.2H43200862P03097L40998O4194r9599j73569j95324k21849k61545k99096l11494
2402.6H42746675k58446k17497k90752l81886l59655k77579k79784l75748m51982m22895
2423H39430451l17514k82824l77714m74215m36127l13818k95401m19378m94540m23014
2443.4H35595906l23475l24547m37260n29944m88520l59059k89678l69549n00619n00977
2463.8H31472278l77059l14355l98934n10514m55499l05652l10600m44055n10096m25458
$$ y = [838425100, 837907195, 837609053, 837254822, 836751342, 836225033, 835910857, 836221099, 837447286, 838638127, 838499069, 836864889, 834525406, 832476556, 831088781, 830400348, 830351710, 830864847, 831950784, 833420992, 834983826, 836591005, 838216186, 839706898, 841007233, 842187047, 843200862, 843903959, 844244957, 844309151, 844209552, 844035983, 843840659, 843618810, 843357265, 843058169, 842746675, 842488229, 842270732, 841979980, 841598094, 841238439, 840960860, 840681076, 840305328, 839853346, 839430451, 839112937, 838830113, 838452399, 837978184, 837542057, 837228239, 836932838, 836513460, 836018920, 835595906, 835272431, 834947884, 834510624, 833980680, 833492160, 833133101, 832843423, 832473874, 831973255, 831472278, 831095219, 830780864, 830381930, 829871416, 829415917, 829110265, 828799665, 828355610, 827845514, 827420056]
2484.2H27420056l06845l20434m22538m68194l88801k69652k77042m07934n06819m37200
2504.6H23614597k80976k70307l99590m70399l94047k62975k62440m16815n03182m04358
2525H19949508k88964l11911m33624n01096m40418l49820l56257m63605n34058m64975
2545.4H15804780l73304l77775m14729m17351l91126l68714l87669m39107m79877m37975
2565.8H11717153l14415k82049m22478n35071m69982l48091l26932m14431n01156m73440
2586.2H07629108l37839k80499l95894n09978m91619l93569l37064m17173n39482n45978
2606.6H03380013m60208m24087n19872o53803o60062n35786m81427o05464p56502p67350
2626.9G97515452o60598o17743o99639p70152p53939o77407o28412p09891q29100q00491
$$ y = [827420056, 827113211, 826792777, 826370239, 825902045, 825513244, 825243592, 824966550, 824558616, 824051797, 823614597, 823333621, 823063314, 822663724, 822193325, 821799278, 821536303, 821273863, 820857048, 820353866, 819949508, 819660544, 819348633, 818915009, 818413913, 817973495, 817623675, 817267418, 816803813, 816269755, 815804780, 815431476, 815053701, 814638972, 814221621, 813830495, 813461781, 813074112, 812635005, 812155128, 811717153, 811402738, 811120689, 810698211, 810163140, 809693158, 809345067, 809018135, 808603704, 808102548, 807629108, 807291269, 807010770, 806614876, 806104898, 805613279, 805219710, 804882646, 804465473, 803925991, 803380013, 802919805, 802495718, 801975846, 801322043, 800661981, 800126195, 799644768, 799039304, 798282802, 797515452, 796854854, 796237111, 795537472, 794767320, 794013381, 793335974, 792707562, 791997671, 791168571, 790368080]
2647.3G90368080o70135o34193p26939q01503p64072o62208o04033o45995p31469p47621
2667.7G83379912o47723n55158o22570p65205p71284o25849n38409n99026o74665o79553
2688.1G76900470o26862n97179o75022p55608p16627o26147o14047p15315q19087q09729
2708.5G69944847p32363p08758p77185q59619q49127p47264o70373o93739p82847q06153
2728.9G62317419p01725o15061o47783p20203p29859o52790n66125n85615o81341o85692
2749.3G55731225n92947n46873n86271o55830o96420o46294n81026o28113p13528p27176
2769.7G49356747o82175o50526p12514q32557q91328q31902p49767q13186r59098r92299
2790.1G41241395r35375r20773j008212j137257j179755j127004j101852j170993j274824
$$ y = [790368080, 789697945, 789063752, 788336813, 787535310, 786771238, 786109030, 785504997, 784859002, 784127533, 783379912, 782732189, 782177031, 781554461, 780789256, 780017972, 779392123, 778853714, 778254688, 777580023, 776900470, 776273608, 775676429, 775001407, 774245799, 773529172, 772903025, 772288978, 771573663, 770754576, 769944847, 769212484, 768503726, 767726541, 766866922, 766017795, 765270531, 764600158, 763906419, 763123572, 762317419, 761615694, 761000633, 760352850, 759632647, 758902788, 758249998, 757683873, 757098258, 756416917, 755731225, 755138278, 754591405, 754005134, 753349304, 752652884, 752006590, 751425564, 750797451, 750083923, 749356747, 748674572, 748024046, 747311532, 746478975, 745587647, 744755745, 744005978, 743192792, 742233694, 741241395, 740306020, 739385247, 738377035, 737239778, 736060023, 734933019, 733831167, 732660174, 731385350]
2808.5G31385350j342058j357794j336813j343965j436472j529217j520634j513302
2824.8G20005095j654625j875162j983643j976311k051353k305091k738058l262520
2841.1G02158332l726006m199087m699827m894852m453659l454507k347290j558006
2857.4F72825098j272261j409829j787662k300501k790153l003717k774775k238452
2873.7F55247748j702368j301885j046419q81970p79927q31485j010835j205385j334309
2892.1F45153165j395643j533925j800180k036631k144158k276719k585649l003120
2908.4F28377140l435553l861963m253507m497230m454017m055679l311693k371490
2924.7E98136008j380027m07576M42743J247227K107740K845049L310203L536284L490985
$$ y = [731385350, 730043292, 728685498, 727348685, 726004720, 724568248, 723039031, 721518397, 720005095, 718350470, 716475308, 714491665, 712515354, 710464001, 708158910, 705420852, 702158332, 698432326, 694233239, 689533412, 684638560, 680184901, 676730394, 674383104, 672825098, 671552837, 670143008, 668355346, 666054845, 663264692, 660260975, 657486200, 655247748, 653545380, 652243495, 651197076, 650315106, 649535179, 648703694, 647692859, 646487474, 645153165, 643757522, 642223597, 640423417, 638386786, 636242628, 633965909, 631380260, 628377140, 624941587, 621079624, 616826117, 612328887, 607874870, 603819191, 600507498, 598136008, 596755981, 596348405, 596791148, 598038375, 600146115, 602991164, 606301367, 609837651, 613328636]
2943.1F13328636L126383K516090J819671J216471P87616O22749Q09431J260102J829982
2961.4F27317131K440273L038705L529727L894568M173338M293263M219651M070938
2977.8F56977594L872454L527939L137410K828240K526522K178788J758099J264453
2994.1F78071499Q59439N31495J12951l02971n82695p11858p33316p50661q03113q54194
3014.5F74836576q59439q69632r99570j223564j431585j525640j481652j416564j413346
3032.8F63615584j476407j568019j622200j664460j757443j860261j878082j821816
3049.1F49966896j817048j896441j926005j860678j782060j721143j676262j577854
3065.5F35709405j407147j322805j346767j349688j248300j093984j084029j173199
$$ y = [613328636, 616455019, 618971109, 620790780, 622007251, 622794867, 623417616, 624227047, 625487149, 627317131, 629757404, 632796109, 636325836, 640220404, 644393742, 648687005, 652906656, 656977594, 660850048, 664377987, 667515397, 670343637, 672870159, 675048947, 676807046, 678071499, 678930938, 679462433, 679575384, 679272413, 678689718, 677977860, 677244544, 676493883, 675690770, 674836576, 673977137, 673107505, 672107935, 670884371, 669452786, 667927146, 666445494, 665028930, 663615584, 662139177, 660571158, 658948958, 657284498, 655527055, 653666794, 651788712, 649966896, 648149848, 646253407, 644327402, 642466724, 640684664, 638963521, 637287259, 635709405, 634302258, 632979453, 631632686, 630282998, 629034698, 627940714, 626856685, 625683486]
3081.8F25683486j176774j113117r93788q75711q95322r87291r87232r20951r21071
3100.1F16812229j011073j116515j138150j067400j065553j146137j178384j205266
3116.4F07883751j283586j418292j557112j589596j530409j473606j500606j615703
3132.8E95914841j710832j703144j667976j714945j796782j850366j869142j817108
3149.1E81784546j749873j811266j961708k010405j958787j926065j938402j992465
3165.4E66435575k043962k029240j997590k008081k034723k060056k045751k032220
3181.7E50183952k081216k090632k016664j954734j961649j993775k010167k021372
3198E34053743j979292j902639j875580j843929j791835j762032j752675j775622j797974
$$ y = [625683486, 624506712, 623393595, 622399807, 621524096, 620628774, 619641483, 618654251, 617733300, 616812229, 615801156, 614684641, 613546491, 612479091, 611413538, 610267401, 609089017, 607883751, 606600165, 605181873, 603624761, 602035165, 600504756, 599031150, 597530544, 595914841, 594204009, 592500865, 590832889, 589117944, 587321162, 585470796, 583601654, 581784546, 580034673, 578223407, 576261699, 574251294, 572292507, 570366442, 568428040, 566435575, 564391613, 562362373, 560364783, 558356702, 556321979, 554261923, 552216172, 550183952, 548102736, 546012104, 543995440, 542040706, 540079057, 538085282, 536075115, 534053743, 532074451, 530171812, 528296232, 526452303, 524660468, 522898436, 521145761, 519370139, 517572165]
3216.4E17572165j806736j819253j806438j786530j814187j861691j850903j821042
3232.7E03005385j913726k033770k028227k034604k092898k126098k172977k226919
3249D86376166k255380k283364k305597k305836k284199k254903k249688k246082k183467
3267.4D66007650k044231j902520j807601j740366j675904j551717j375526j230181
3283.7D52679604j149922j084239r49770q16971p84278p79658p43330o76036n62012
3302D45133388m34458m26680n35935n99683o25073o24180n51105m95106n14090n61356
3322.4D39765722o04839o80059p30544p04944p10637p45982p58558q11428r14007r89497
3342.8D32115227j041919j073450j031697j059323j211852j271665j198232j131296
$$ y = [517572165, 515765429, 513946176, 512139738, 510353208, 508539021, 506677330, 504826427, 503005385, 501091659, 499057889, 497029662, 494995058, 492902160, 490776062, 488603085, 486376166, 484120786, 481837422, 479531825, 477225989, 474941790, 472686887, 470437199, 468191117, 466007650, 463963419, 462060899, 460253298, 458512932, 456837028, 455285311, 453909785, 452679604, 451529682, 450445443, 449495673, 448678702, 447894424, 447114766, 446371436, 445695400, 445133388, 444698930, 444272250, 443736315, 443136632, 442511559, 441887379, 441336274, 440841168, 440327078, 439765722, 439160883, 438480824, 437750280, 437045336, 436334699, 435588717, 434830159, 434018731, 433104724, 432115227, 431073308, 429999858, 428968161, 427908838, 426696986, 425425321, 424227089, 423095793]
3359.1D23095793j163275j233130j184076j123071j236737j368582j308471j175702
3375.5D13302749j119077j080781j041919r76771q61585p11501n68896o21170q16733
3393.8D05504316p91341n07981l23921m78506p05898o29485m26828l21657k47538k16991
3414.2D00854170k21878j35601r387R6589K55585L73959M44174N42551P02054Q28802
3434.6D03731018P36744N68568O08772Q24839J021534J134068J160443J183659J281053
3453D12250698J408726J529544J620740J584083J597017J843095J988470J786620J485914
3471.3D27094907J461327J697927J983017K098322J964599J902908K042979K079010
3487.6D42324996J996100K003431K076298K179206K197772K174824K221466K136915
$$ y = [423095793, 421932518, 420699388, 419515312, 418392241, 417155504, 415786922, 414478451, 413302749, 412183672, 411102891, 410060972, 409084201, 408222616, 407511115, 406942219, 406321049, 405504316, 404712975, 404204994, 403881073, 403402567, 402696669, 402067184, 401640356, 401318699, 401071161, 400854170, 400632292, 400496691, 400487304, 400583893, 400839478, 401213437, 401657611, 402200162, 402902216, 403731018, 404467762, 405036330, 405645102, 406469941, 407491475, 408625543, 409785986, 410969645, 412250698, 413659424, 415188968, 416809708, 418393791, 419990808, 421833903, 423822373, 425608993, 427094907, 428556234, 430254161, 432237178, 434335500, 436300099, 438203007, 440245986, 442324996, 444321096, 446324527, 448400825, 450580031, 452777803, 454952627, 457174093, 459311008]
3504D59311008K016694K139211K322554K417654K374738K219111K263218K483994K641201
3522.3D80189383K568841K375811K415151K614856K689361K744526K794713K708375
3538.6E01101017K771318K994835L063739K905488K780854K894164L046512L066421
3554.9E24624348L095805L231526L277957L126145L147006L622532L910899L702700
3571.3E51738918L574669L660739L775060L920436M007637L903866L805518L990710
3587.6E82377553M217088M100323L998578M112005M236817M277170M256546M092574
3603.9F15668654L878534M010916M258513M235983M087925L849388L917396M296422
3620.2F48203731M092216L486872L226816L807366M405260L975332L646255L562689
$$ y = [459311008, 461327702, 463466913, 465789467, 468207121, 470581859, 472800970, 475064188, 477548182, 480189383, 482758224, 485134035, 487549186, 490164042, 492853403, 495597929, 498392642, 501101017, 503872335, 506867170, 509930909, 512836397, 515617251, 518511415, 521557927, 524624348, 527720153, 530951679, 534229636, 537355781, 540502787, 544125319, 548036218, 551738918, 555313587, 558974326, 562749386, 566669822, 570677459, 574581325, 578386843, 582377553, 586594641, 590694964, 594693542, 598805547, 603042364, 607319534, 611576080, 615668654, 619547188, 623558104, 627816617, 632052600, 636140525, 639989913, 643907309, 648203731, 652295947, 655782819, 659009635, 662817001, 667222261, 671197593, 674843848, 678406537]
3636.5F78406537L403663L337562L197789K846301K710462L219247L610134L081202
3652.8G03812897K704561K977908K975762K563536K298236K114951J845122J854062
3669.2G23147035K071976J903177J948177K246261K124012J897633J721322J563966
3685.5G38623559J574755J643956J601279J565456J469612J227975R94980J037836
3701.8G49739408J203895J095235Q21293P96616J171768J345873J024544O97553N87284
3720.1G58483469N58019N64754O72221P04110N45204M99546Q10623J171649R82344
3738.5G64991939L97801J22071M82797P45774N24699O37591R47297Q47757O17862N35786
3758.9G70851374N47945N17488M80413M56631M61102N24521N50806N22495M86970M13119
$$ y = [678406537, 681810200, 685147762, 688345551, 691191852, 693902314, 697121561, 700731695, 703812897, 706517458, 709495366, 712471128, 715034664, 717332900, 719447851, 721292973, 723147035, 725219011, 727122188, 729070365, 731316626, 733440638, 735338271, 737059593, 738623559, 740198314, 741842270, 743443549, 745009005, 746478617, 747706592, 748701572, 749739408, 750943303, 752038538, 752859831, 753656447, 754828215, 756174088, 757198632, 757896185, 758483469, 759041488, 759606242, 760278463, 760982573, 761527777, 762027323, 762837946, 764009595, 764991939, 765389740, 765511811, 765994608, 766740382, 767265081, 767902672, 768849969, 769697726, 770315588, 770851374, 771399319, 771916807, 772397220, 772853851, 773314953, 773839474, 774390280, 774912775, 775399745, 775812864]
3779.3G75812864L26157L16799L97145M67360M39644L38733K48671K12848J05798R001
3799.7G78675020K70784N36263N17368N73277M89355K04503L2008J10030J92344J75417
3820.1G81776369M33087O03259M08113J86264J07527J37627J26779J16587K40445L72469
3840.5G84508526M59493N31017L66450n5254m88877m32253M97758R16720M73857P5400
3860.9G86852837N9783K18272J30475J4365J63018L24846L80754K42174M6670R7990
3881.3G88531184K02656K33293J73270L0101R0003K62916J75357r4355k23994p1525
3901.7G89308906K47001M79400M15445K19643N7459k6047J6629J30892J94609J16468
3922.1G91160405M6432Q0704N3227p271P0393J76131J45257P2300K6286J4901O4612
$$ y = [775812864, 776139021, 776455820, 776852965, 777320325, 777759969, 778098702, 778347373, 778560221, 778666019, 778675020, 778945804, 779482067, 779999435, 780572712, 781062067, 781266570, 781298578, 781408608, 781600952, 781776369, 782209456, 782812715, 783220828, 783407092, 783514619, 783652246, 783779025, 783895612, 784136057, 784508526, 784968019, 785499036, 785865486, 785810232, 785321355, 784889102, 785386860, 786303580, 786777437, 786852837, 786912620, 787130892, 787261367, 787275732, 787438750, 787763596, 788144350, 788386524, 788433194, 788531184, 788733840, 788967133, 789140403, 789170504, 789260507, 789523423, 789698780, 789604425, 789380431, 789308906, 789555907, 790035307, 790450752, 790670395, 790727854, 790701807, 790718436, 790849328, 791043937, 791160405, 791206837, 791287541, 791340768, 791333497, 791403890, 791580021, 791725278, 791797578, 791823864, 791838765, 791903377]
3944.5G91903377J09672J26064J06692N9307R1672J49369J21892Q4638O6996N6386
3964.9G92876065P8857R2387O5148L9935M8518P8380Q7083P9691R8705Q5235L1173
3987.3G93661177M0829N7400M8935R4175J33753
3997.5G94036269
$$ y = [791903377, 792013049, 792139113, 792245805, 792305112, 792396784, 792546153, 792668045, 792752683, 792819679, 792876065, 792954922, 793047309, 793112457, 793152392, 793200910, 793279290, 793366373, 793446064, 793544769, 793630004, 793661177, 793702006, 793759406, 793808341, 793902516, 794036269]
##END=$$ End of the data block
