##TITLE=G08-52-CE $$ Begin of the data block
##JCAMP-DX=5.00 $$ ACD/SpecManager v 10.08
##SPECTROMETER/DATA SYSTEM=Alpha
##DATE=17 Oct 2013 10:58:30
##DATA TYPE=INFRARED SPECTRUM
##DATA CLASS=XYDATA
##ORIGIN=
##OWNER=
##NPOINTS=1765
##FIRSTX=399.75695801
##LASTX=3997.56933594
##MAXX=3997.56933594
##MINX=399.75695801
##MAXY=0.85118604
##MINY=0.39989746
##XFACTOR=1.0000000000
##YFACTOR=1.000000000000000e-9
##FIRSTY=0.66070354
##DELTAX=2.03957629
##XUNITS=1/CM
##YUNITS=ARBITRARY UNITS
##XYDATA=(X++(Y..Y))
399.8 660703540 657250047 656560123 657443762 657157600 655181468 654066324 655292988 657177031 656662464
418.1 656662464 653402090 651759326 652880430 653587103 651523113 648267627 647026539 647914588 648151755
436.5 648151755 646533489 645053446 646113873 649109662 650803149 649686992 647983491 648163557 649432003
454.8 649432003 648990273 645703852 642554760 642093182 642555714 640970290 637557447 635090351 635059357
473.2 635059357 635596752 634141088 631299555 629745483 630430818 631245434 629865408 627132297 625743032
491.5 625743032 626381218 626482248 624090731 620689988 618812680 618619323 617657363 614548862 611076593
509.9 611076593 609434724 609182835 607957840 604637861 601297736 600416720 601394475 601588130 599876285
528.3 599876285 598351657 599256575 601812482 603451729 603491604 603925884 606138706 608639896 609004319
546.6 609004319 607103586 605459630 605736434 606425405 605332553 602659523 600614846 600294530 600169182
565 600169182 598337591 595259011 593356967 593852401 595261872 595660865 595500529 596786857 600120783
583.3 600120783 603585243 604988158 604839385 605324566 607030213 608393550 608011723 606749892 606687069
601.7 606687069 608119130 609236538 608770549 607683957 607821643 609462023 610854506 610790908 610599995
620 610599995 612300277 615873694 619094074 620403826 621005058 622864187 625883579 628123939 628525138
638.4 628525138 628436267 629719317 632204235 633915246 633716226 632925391 633521199 635399818 636555254
656.7 636555254 635985196 635100782 635704994 637175262 637377381 636465490 637289226 639554977 642325997
675.1 642325997 644186020 644392014 644422889 645999432 648518443 649878442 649406552 648661375 649172664
693.5 649172664 650306463 650272012 648891866 648068905 649378479 652071059 654054880 654634833 655430734
711.8 655430734 658126950 662029266 664991796 666483402 668367088 672163665 676888108 680252314
728.1 680252314 681621909 682838142 685511053 688772500 690474331 690168440 689745009 690833449 692642331
746.5 692642331 693069160 691618085 690241694 690560043 691557348 691128016 689128518 687786698 688781321
764.8 688781321 691133738 692832887 693731844 695678055 699807107 704727292 708165646 709804595 711480021
783.2 711480021 714540243 717871010 719445467 719314694 719730854 722064495 725045323 726746082 727346778
801.6 727346778 728773177 731836557 734993935 736274183 735892594 735965848 737614095 739417434 739343464
819.9 739343464 737533212 736100793 736110508 736128151 734486103 731680453 729707837 729417443 729319394 727643132
840.3 727643132 724897444 723176003 723284900 723758340 722891331 721062005 720181406 720949471 722000360
858.7 722000360 722179472 722471416 724825144 729455769 734257281 737239122 738749802 740508258 742870927
877 742870927 744081438 742576122 739176571 736077249 734051347 731765151 727994382 723510027 720161438
895.4 720161438 718367577 716447234 712859273 708171785 704055309 700853407 697161436 691918254
911.7 691918254 686004519 681246161 678234518 675863206 673135757 670586824 669374824 669459462 669475257
930 669475257 668440580 666931689 666226029 666540504 666617751 665202081 662390769 658998430 655016422
948.4 655016422 649512529 642076015 633725226 625909448 618855715 611502290 603080451 594198406
964.7 594198406 586049795 578919113 572032452 564865470 558072448 552758992 549123406 546271265
981 546271265 543365240 540621758 538800299 537907064 537017643 535414457 533517897 532347739 532197237
999.4 532197237 532304108 531832814 530829251 529892623 529124320 527923048 525873601 523457766 521535337
1017.7 521535337 520247698 518884540 516841590 514394164 512302816 510778427 509259284 507208407
1034.1 507208407 504851937 502869725 501445889 500032902 498143077 496072650 494567782 493920565
1050.4 493920565 493738472 493593395 493630439 494360596 495933503 497893870 499651164 500956833 501749992
1068.7 501749992 501848698 501187801 500187695 499726862 500639260 503106773 506531656 510098159 513558984
1087.1 513558984 517271578 521373689 525326252 528448701 530674815 532529414 534370601 535975814
1103.4 535975814 537103891 538138926 539752960 542181551 544989288 547514796 549586713 551625907
1119.7 551625907 553929925 556168616 557908893 559396863 561436474 564317226 567304671 569442749
1136 569442749 570486486 570947111 571334839 571527183 571082592 570115566 569389939 569434643 570020378 570681810
1156.4 570681810 571527004 573226988 576137066 579787552 583451450 587014258 591092527 596204519
1172.7 596204519 601985812 607599616 612799168 618062854 623700380 629202485 633721292 637050629
1189.1 637050629 639712334 642053246 643694639 644110501 643474758 642604768 642076492 641705811 641040921
1207.4 641040921 640143573 639561355 639549375 639654875 639224529 638193727 637092650 636267602 635420442
1225.8 635420442 634049296 632183969 630454481 629320920 628576934 627778649 626977146 626729727 627346635
1244.1 627346635 628533483 629788756 630977035 632410347 634314537 636386037 638120532 639470041
1260.4 639470041 640892029 642749250 644825757 646601498 647921860 649125993 650475025 651739419
1276.8 651739419 652513862 652879655 653409898 654459953 655734301 656628489 656966209 657093346 657207787
1295.1 657207787 656984389 656058848 654552400 652961433 651635110 650426924 649013281 647474468 646329165
1313.5 646329165 645930052 646082759 646320522 646413803 646445870 646392703 645903826 644651830 642811358 640958846
1333.9 640958846 639522851 638475955 637567818 636728883 636134923 635841072 635574758 634940565 633829534
1352.2 633829534 632526517 631300628 630036056 628345311 625969529 623113394 620226443 617538154
1368.5 617538154 615141690 612841547 610406280 607920885 605337679 602384508 599168539 596442640
1384.9 596442640 594842613 594253302 594038963 593745291 593359411 593209505 593473911 594049633 594789684
1403.2 594789684 595779240 597121894 598715067 600364983 601880133 603295863 604944766 607110620
1419.5 607110620 609272301 611041725 612521827 613743424 614680946 615132689 614924252 614157200 613444149
1437.9 613444149 613361835 613674581 613976717 614218473 614624500 615186930 615624189 616030157 617143095 619477272
1458.3 619477272 622122407 624611557 627160370 629922986 633224189 637832701 644282639 650967956
1474.6 650967956 656305075 660475135 663672328 665745020 666394532 665611267 663595498 660700023 657385468
1493 657385468 653282762 648034751 642726600 638040006 633478999 627510190 619100273 611408830 604986846
1511.3 604986846 598723650 593072236 588725388 585944414 583893538 581872642 579650700 577107847
1527.6 577107847 574769557 572764814 570877969 569341540 568071842 566872239 566461742 567035973 568101168
1546 568101168 569579363 571697295 574533165 577849746 581166565 584900856 589251339 592674017 595544219
1564.3 595544219 598200321 600413918 602381349 604034960 605337501 606279075 606675267 606668174 606417477
1582.7 606417477 605978489 605139315 603718877 601770878 599539220 596990287 593874931 590048075 585594237
1601.1 585594237 580696106 575338840 569263697 562216282 554626584 547054529 538678110 528715909
1617.4 528715909 519429743 510536611 500377953 490245759 480704963 471468240 463352859 456000686
1633.7 456000686 448669493 443455130 440979570 440097034 440378994 441782385 444038093 446278244 449029356
1652 449029356 453293949 457573384 461662024 466474593 472444266 479243070 485925883 493113428 501084268
1670.4 501084268 508520365 516194284 524639845 532580614 539976537 548124194 558503687 568667233
1686.7 568667233 577679515 587273777 597235978 609047115 622574568 635821044 649633884 660957575
1703 660957575 670145988 679081321 686612248 692684531 697830498 702545106 707355499 711599588 714665413
1721.4 714665413 717107296 719426215 721604586 723513424 724963427 726346970 728022635 729738533
1737.7 729738533 731623352 733784318 736252785 739241540 742904603 747204542 751689851 755784333
1754 755784333 759916842 764301658 768464863 772399127 775955439 779281437 782657743 785840690 788773775
1772.4 788773775 791435778 793797910 796117365 798313320 800091982 801572382 803084314 804645121
1788.7 804645121 806096554 807400286 808498979 809570312 810809970 812105894 813150346 813954711
1805 813954711 814846992 815957487 817076921 817915022 818574667 819369555 820365131 821281910 821939766 822461188
1825.4 822461188 823071659 823915422 824823022 825449944 825835884 826368690 827134728 827808678 828204513 828507543
1845.8 828507543 828965485 829626322 830274463 830643833 830834091 831174374 831762254 832316816 832572639 832596600
1866.2 832596600 832787156 833361208 833951175 834224761 834305167 834564626 835101366 835595608 835785210 835818410
1886.6 835818410 836041152 836579442 837102890 837284148 837294519 837504745 837958038 838359594 838477254 838438809
1907 838438809 838590741 839002669 839343309 839374781 839302063 839466333 839827001 840118289 840183854 840125442 840208709
1929.4 840208709 840478063 840685487 840676665 840602458 840657830 840869904 841086507 841120660 841020763 841031730 841231287
1951.9 841231287 841435373 841487229 841442943 841507256 841743529 841956019 841962159 841859460 841871023 842055202 842270076
1974.3 842270076 842333198 842251062 842209399 842348278 842541754 842568099 842430294 842337072 842433929 842615187 842662454
1996.7 842662454 842519104 842387736 842449665 842578173 842513680 842278600 842123866 842137337 842160285 842025459
2017.1 842025459 841775000 841591060 841572344 841580391 841417432 841112614 840885520 840848207 840860844 840711892
2037.5 840711892 840425730 840246618 840278268 840368509 840309024 840108335 839988470 840069771 840198815 840169251
2057.9 840169251 840018988 839976668 840131342 840328753 840378225 840282440 840253949 840397179 840576530 840622485
2078.3 840622485 840548992 840526879 840671003 840883553 840959609 840900064 840893090 841051579 841271460 841374040 841359138
2100.7 841359138 841395736 841566861 841761291 841844738 841823518 841840208 841991484 842204392 842294514 842208743 842145979
2123.2 842145979 842273653 842477739 842562139 842536986 842550933 842682421 842850924 842922807 842892349 842905223 843073070
2145.6 843073070 843300223 843413055 843395412 843394339 843540132 843783915 843952835 844000876 844074965 844308615
2166 844308615 844627082 844841123 844927609 845056593 845350623 845720947 845965147 846051216 846172273 846444130
2186.4 846444130 846765697 846996188 847108305 847220182 847456396 847753763 847949028 848036885 848157585 848370194
2206.8 848370194 848605514 848785222 848911345 849057138 849269271 849492073 849617720 849643528 849709213 849892497
2227.2 849892497 850100040 850220621 850253642 850296080 850397944 850503564 850555778 850561917 850593269 850683033 850750148
2249.6 850750148 850764394 850770056 850765765 850762665 850790739 850846589 850893855 850913525 850929081 850947917 850972533 850985825
2274.1 850985825 850973845 851001203 851106167 851186037 851140857 851000905 850824773 850631356 850412965 850159645
2294.5 850159645 849909663 849668324 849377155 849025488 848614395 848112881 847530127 846969068 846503735 846028090
2314.9 846028090 845342875 844378293 843379021 842636228 842046022 841349423 840634167 840155303 839850724 839492857
2335.3 839492857 839030921 838549137 838267386 838592291 839740694 840806723 840658426 839203358 837144971
2353.6 837144971 835274339 833918393 833232522 833207309 833716214 834693909 835965514 837340534 838765860
2372 838765860 840164661 841421247 842513859 843495250 844324589 844905198 845192373 845207274 845052242 844865203
2392.4 844865203 844685495 844479322 844225228 843902349 843571663 843333542 843132377 842838287 842467487 842131257
2412.8 842131257 841863930 841598272 841239393 840773046 840328753 840002000 839714825 839360893 838919103 838472486
2433.2 838472486 838119864 837813139 837415338 836930335 836498797 836169481 835833907 835391462 834870040 834394574
2453.6 834394574 834058821 833758414 833337069 832839072 832399607 832048476 831708193 831299186 830814898 830366552
2474 830366552 830047429 829738855 829295278 828775644 828335881 828022718 827713430 827277958 826787055 826417089
2494.4 826417089 826181710 825906396 825463235 824945331 824544489 824287772 824023068 823623121 823126554 822692156
2514.8 822692156 822400391 822138608 821756482 821297467 820915818 820612133 820253134 819776416 819258630 818816066
2535.2 818816066 818499506 818209887 817772686 817212939 816733062 816379189 816021323 815581560 815104485 814680815
2555.6 814680815 814343691 814012051 813573420 813059270 812627435 812335670 812056363 811648488 811133802 810649991
2576 810649991 810277164 809955060 809573054 809110641 808658421 808300257 807970941 807536900 807021916 806560814
2596.4 806560814 806209207 805884778 805446744 804886937 804346561 803906620 803482175 802950084 802300334 801651776
2616.8 801651776 801111400 800606370 799990714 799239278 798472166 797818720 797226369 796544433 795751095 794965148
2637.1 794965148 794287622 793673456 792983949 792192161 791427135 790764928 790121615 789376676 788548827 787787735
2657.5 787787735 787158310 786569297 785893857 785116196 784363508 783737659 783160567 782485366 781732082 781029165
2677.9 781029165 780443549 779913068 779297590 778584421 777901471 777314842 776745379 776081204 775336206 774620652
2698.3 774620652 773969173 773305476 772557795 771749258 770957887 770226836 769517422 768743277 767913401 767113447
2718.7 767113447 766367912 765641630 764907539 764141500 763353527 762641072 762022972 761384130 760679841 759980381
2739.1 759980381 759345949 758758128 758131683 757439077 756768525 756172717 755614877 755026340 754368603 753696561
2759.5 753696561 753092647 752523601 751866400 751099944 750353217 749704301 749070287 748349607 747519314 746634603
2779.9 746634603 745804667 745058417 744268298 743333459 742339790 741400123 740489185 739486575 738346159
2798.3 738346159 737160981 736019731 734924912 733792424 732529581 731180370 729846656 728541970
2814.6 728541970 727200806 725731254 724154115 722595990 721054018 719398022 717563808 715618849
2830.9 715618849 713656187 711610675 709274828 706487179 703218997 699491918 695272148 690565348
2847.2 690565348 685655653 681166232 677691698 675360560 673838198 672607660 671209276 669372380
2863.5 669372380 667010784 664176047 661131561 658356726 656156659 654466629 653153121 652104974
2879.9 652104974 651211560 650420487 649607658 648589313 647343993 646001220 644609094 643077314 641296387
2898.2 641296387 639262199 637089491 634807765 632247686 629233122 625760972 621899426 617657900
2914.5 617657900 613146365 608695328 604675353 601384699 599019289 597644866 597234011 597683728 598958313
2932.9 598958313 601090252 603954494 607275546 610790551 614268780 617419243 619950056 621776283
2949.2 621776283 623009622 623795390 624405503 625226140 626513362 628377736 630824149 633828580 637374043
2967.6 637374043 641305387 645444095 649727702 654029429 658179998 662077904 665606797 668748796
2983.9 668748796 671606421 674168527 676348329 678106964 679409087 680307984 680873692 681024790 680742860
3002.2 680742860 680161655 679439127 678699613 677959204 677180231 676361561 675527155 674674273 673684716 672449708
3022.6 672449708 671013951 669503808 668040037 666625202 665169775 663634360 662050009 660464764
3038.9 660464764 658842087 657083690 655190468 653288126 651483893 649712861 647835553 645903587
3055.3 645903587 644036293 642215252 640450418 638803005 637273073 635847986 634505391 633178711
3071.6 633178711 631836712 630561173 629420280 628327608 627187908 626029611 624913633 623899341
3087.9 623899341 622990131 622081876 621144295 620228529 619318128 618382692 617381513 616277993 615141749
3106.2 615141749 614059389 612969279 611790121 610562861 609315932 608031988 606664777 605159044
3122.6 605159044 603577018 602016568 600499809 598986924 597392201 595710099 594031751 592359304
3138.9 592359304 590611100 588785410 586932302 585073948 583251894 581477165 579636693 577645302
3155.2 577645302 575605273 573628366 571689785 569711626 567663491 565608978 563618958 561665237
3171.5 561665237 559684217 557642579 555552065 553480744 551441550 549383342 547296703 545235693
3187.8 545235693 543235064 541230083 539179087 537142396 535145879 533175230 531260788 529395163
3204.1 529395163 527525127 525654614 523845077 522103071 520338595 518512309 516663909 514812529
3220.5 514812529 512970567 511128128 509268045 507433593 505635023 503795266 501813293 499716103
3236.8 499716103 497653157 495638520 493577987 491428763 489207387 486960530 484713465 482436925
3253.1 482436925 480133921 477845550 475557953 473269939 470989734 468714803 466509908 464463592
3269.4 464463592 462573200 460776657 459046364 457400948 455887496 454499722 453200310 452001959
3285.7 452001959 450930506 450009376 449190378 448381037 447607905 446911275 446254700 445652574 445149004
3304.1 445149004 444660753 444071382 443427980 442823380 442239910 441649646 441075712 440524459 439977139 439391673
3324.5 439391673 438700795 437933445 437184691 436461866 435731083 434958845 434093267 433113188 432078212
3342.8 432078212 431017518 429915071 428853780 427809626 426612854 425298631 424045801 422884345
3359.1 422884345 421699911 420448959 419234097 418068498 416821361 415435791 414048254 412823230
3375.5 412823230 411703795 410598576 409560144 408621520 407749802 407013923 406469285 405884951 405073524
3393.8 405073524 404260188 403722793 403351128 402817547 402097613 401498586 401125491 400857747 400612742 400334060
3414.2 400334060 400059789 399914801 399897456 399958611 400162309 400545239 401082277 401668489 402328908 403164834
3434.6 403164834 403960317 404539526 405101240 405873656 406897962 408092529 409328431 410590112 411923617
3453 411923617 413327277 414813936 416396767 417981505 419578671 421387106 423363715 425188661 426740676
3471.3 426740676 428286433 430038691 432003111 434075534 436059922 438010007 440089732 442152739
3487.6 442152739 444124818 446182609 448367000 450603336 452802122 455007106 457277685 459421486
3504 459421486 461406648 463533431 465897888 468357116 470751315 473011702 475317568 477830082 480507284
3522.3 480507284 483117253 485545605 488005757 490634322 493339628 496113539 498947740 501719594
3538.6 501719594 504558921 507620573 510755181 513706744 516507506 519415081 522469699 525544167
3554.9 525544167 528672516 531974673 535356700 538600504 541852355 545552790 549478412 553134441
3571.3 553134441 556671143 560369313 564252675 568249404 572266400 576254129 580264032 584368765
3587.6 584368765 588528991 592589498 596637130 600815594 605092049 609432817 613777101 617923677
3603.9 617923677 621873438 625985801 630300939 634571850 638696790 642597198 646612585 650971711
3620.2 650971711 655056953 658599019 662010193 665946066 670198917 673956454 677498639 681030393
3636.5 681030393 684471786 687870979 691087365 693957150 696774960 700142086 703733385 706649780
3652.8 706649780 709270656 712225556 715147138 717676461 719928861 722027063 724036038 726114571
3669.2 726114571 728207469 730021536 731903255 734001219 735920310 737706006 739449799 741121829
3685.5 741121829 742867410 744604111 746073067 747468889 748869479 750094950 751150668 752232313
3701.8 752232313 753376067 754434288 755366087 756351769 757565022 758739948 759603024 760268569 760914445
3720.1 760914445 761590123 762294412 763015330 763674319 764265418 764947593 765845656 766859055 767630756
3738.5 767630756 767989457 768228471 768762052 769461453 770034909 770670831 771440685 772157013 772742212 773248971
3758.9 773248971 773747921 774249256 774769604 775257885 775700748 776181221 776681483 777164876 777625203 778020501
3779.3 778020501 778347850 778679848 779076636 779485166 779874146 780259669 780564845 780795038 780990899 781176865
3799.7 781176865 781533360 782012045 782472253 782957554 783325613 783504725 783636510 783847570 784065962 784287930
3820.1 784287930 784682572 785116911 785413265 785580516 785720229 785960853 786253333 786467612 786693394 787027955
3840.5 787027955 787382603 787728667 787971199 787964225 787740171 787643492 788145483 788847089 789193988 789221704
3860.9 789221704 789237201 789447844 789667428 789773881 789940178 790166199 790398419 790613592 790794969 791001201
3881.3 791001201 791203082 791373491 791467726 791529298 791711390 791951597 792076290 792033017 791907251 791886628
3901.7 791886628 792078614 792402387 792676330 792822063 792855442 792833924 792849243 792980552 793160081 793225646
3922.1 793225646 793222249 793262541 793312728 793367743 793501496 793694675 793856978 793951809 793986022 794012725 794081926
3944.5 794081926 794184029 794277906 794370532 794483781 794590890 794686317 794771910 794836521 794887245 794924974 794955790
3966.9 794955790 795023680 795114756 795176744 795227647 795300245 795396507 795498312 795605242 795696974 795766652 795870721
3989.4 795870721 795970023 796007276 796063006 796203256
3997.5 796203256
##END=$$ End of the data block
