##TITLE=G08-52-CE $$ Begin of the data block
##JCAMP-DX=5.00 $$ ACD/SpecManager v 10.08
##SPECTROMETER/DATA SYSTEM=Alpha
##DATE=17 Oct 2013 10:58:30
##DATA TYPE=INFRARED SPECTRUM
##DATA CLASS=XYDATA
##ORIGIN=
##OWNER=
##NPOINTS=1765
##FIRSTX=399.75695801
##LASTX=3997.56933594
##MAXX=3997.56933594
##MINX=399.75695801
##MAXY=0.85144275
##MINY=0.39929008
##XFACTOR=1.0000000000
##YFACTOR=1.000000000000000e-9
##FIRSTY=0.65796834
##DELTAX=2.03957629
##XUNITS=1/CM
##YUNITS=ARBITRARY UNITS
##XYDATA=(X++(Y..Y))
399.8F57968342l691196n03004J361490L10957j449287r23455J064122J225650j344978
$$ 657968342 654277146 653774142 655135632 655446589 653997302 653073847 654137969 655363619 654018641
418.1F54018641l153444j013458J449228R15646j871824l197193j412869P24137K69354
$$ 654018641 650865197 649851739 651300967 652216613 650344789 647147596 645734727 646458864 646728218
436.5F46728218j605392j509607J103997L114284J707494j287699j812339L54409J534582
$$ 646728218 645122826 643613219 644717216 647831500 649538994 648251295 646438956 646793365 648327947
454.8F48327947k88844k882541k701461n82695J38581j659453l538013k796471l17573
$$ 648327947 648039103 645156562 642455101 641872406 642010987 640351534 636813521 634017050 633699477
473.2F33699477M12821j430988k698958j348793P79330Q66473j108169k348662j326740
$$ 633699477 634112298 632681310 629982352 628633559 629412889 630279362 629171193 626822531 625495791
491.5F25495791K82646q5056k365649l427148j807153j21534j012266l256619l573238
$$ 625495791 625778437 625693381 623327732 619900584 618093431 617971897 616959631 613703012 610129774
509.9F10129774j563371j26063j165033l327727l429711r24468J055539K83658j533806
$$ 610129774 608566403 608440340 607275307 603947580 600517869 599593401 600648940 600932598 599398792
528.3E99398792j347661Q80003K403438J495242J12057O96480K403855K491057K29895
$$ 599398792 598051131 598931134 601334572 602829814 602941871 603638351 606042206 608533263 608763158
546.6F08763158j814425j471281P2956L93689j105666k596438k094090l53336n6148
$$ 608763158 606948733 605477452 605550408 605944097 604838431 602241993 600147903 599794567 599738419
565E99738419j863301l131509j776814N93483J329601L30568j46568J287699L246307
$$ 599738419 597875118 594743609 592966795 593560278 594889879 595220447 595073879 596361578 599607885
583.3E99607885L415108J576960j1027M65870J749634J446188k89917j156390m1365
$$ 599607885 603022993 604599953 604588926 605054796 606804430 608250618 607960701 606804311 606762946
601.7F06762946J364469J027584n20289j066506K41042J703262J362979l7074j61052
$$ 606762946 608127415 609154999 608634710 607568204 607809246 609512508 610875487 610838413 610677361
620F10677361J609147L418982L139198J424313Q28981K025545L039658K152443L20434
$$ 610677361 612286508 615705490 618844688 620269001 621097982 623123527 626163185 628315628 628636062
638.4F28636062j11997J294792K434969J624822j37746o22869O98686J857936J059056
$$ 628636062 628524065 629818857 632253826 633878648 633740902 633118033 633816719 635674655 636733711
656.7F36733711o33180q91686O10650J425326Q7380r38475Q92818K274692K798617
$$ 636733711 636100531 635208845 635819495 637244821 637332201 636393726 637286544 639561236 642359853
675.1F42359853J955330K26498p4923J495242K618730J532316m25160p77721N00560
$$ 642359853 644315183 644541681 644466758 645962000 648580730 650113046 649687886 648910165 649410725
693.5F49410725J192867N9605j387596r08494J304209K740979J970351N31435P67887
$$ 649410725 650603592 650663197 649275601 648367107 649671316 652412295 654382646 654914081 655681968
711.8F55681968K693236L923714K990484J531363J947104L808141M685164L363847
$$ 655681968 658375204 662298918 665289402 666820765 668767869 672576010 677261174 680625021
728.1F80625021J384378J204014K602935L154873J691878k06589k96116J181304J769602
$$ 680625021 682009399 683213413 685816348 688971221 690663099 690456510 690160394 691341698 693111300
746.5F93111300K90990j511693j363277K41756Q49665m55857j894116j272440R78410
$$ 693111300 693402290 691890597 690527320 690769076 691618741 691162884 689268768 687996328 688974738
764.8F88974738K333880J707613R14335J996637M227876M957915L307938J429320J564562
$$ 688974738 691308618 693016231 693930566 695927203 700155079 705112994 708420932 709850252 711414814
783.2G11414814L085077L389180J651048n5432L60906K229452L003419J748144N01096
$$ 711414814 714499891 717889071 719540119 719484687 719845593 722075045 725078464 726826608 727327704
801.6G27327704J247168L021479L335952J480759l62993L5107J683593J747370k86221
$$ 727327704 728574872 731596351 734932303 736413062 736050069 736085176 737768769 739516139 739229918
819.9G39229918j914800j302957J51098M0531j665294k830685k000630l07381j22785
$$ 739229918 737315118 736012161 736163259 736203790 734538496 731707811 729707181 729399800 729277015
838.3G29277015j727462k774179j711309J61350N18739r08315j888991q90076P79450
$$ 729277015 727549553 724775374 723064065 723225415 723744154 722835839 720946848 720056772 720836222
856.6G20836222J068413K22505L46481K349198M566729M763007L003955J575768J780749
$$ 720836222 721904635 722127140 722473621 724822819 729389548 734152555 737156510 738732278 740513027
875G40513027K255678J084506j541972l374338k999723j930714k330482l876388m505753
$$ 740513027 742768705 743853211 742311239 738936901 735937178 734006464 731675982 727799594 723293841
893.3G23293841l319442j799882j918733l543675m642904m121482l271759l774821
$$ 723293841 719974399 718174517 716255784 712712109 708069205 703947723 700675964 696901143
909.6F96901143n303801n904197m652739k908289k353668k769769k596974j245201
$$ 696901143 691597342 685693145 681040406 678132117 675778449 673008680 670411706 669166505
926F69166505J01269O8843j026392j554847p25984L52919R6798j451671k856672l430963
$$ 669166505 669267774 669336617 668310225 666755378 666029394 666382313 666479111 665027440 662170768 658739805
946.4F58739805m005790n496799p431686q361221p808089p029176p319033q378386
$$ 658739805 654734015 649237216 641805530 633444309 625636220 618607044 611288011 602909625
962.7F02909625q863032q164943p149875o909966p210732o844103n334437l611386
$$ 602909625 594046593 585881650 578731775 571821809 564611077 557766974 552432537 548821151
979E48821151k831876k902985k726197j789749q85427r22381j610518j826227j075863
$$ 548821151 545989275 543086290 540360093 538570344 537684917 536762536 535152018 533325791 532249928
997.3E32249928j13011P1347n38588j052379r45092p49707j177668k038122k426266
$$ 532249928 532136917 532208264 531669676 530617297 529672205 528922498 527744830 525706708 523280442
1015.7E23280442j933694j260579j341104k098084k536416k128362j489699j446724
$$ 523280442 521346748 520086169 518745065 516646981 514110565 511982203 510492504 509045780
1032E09045780j958907k290308k023101j527965j467258j862288k021223j499474o35296
$$ 509045780 507086873 504796565 502773464 501245499 499778241 497915953 495894730 494395256 493759960
1050.4D93759960j26779j01566L9488O94066J525015J919537J705587J262576Q20160
$$ 493759960 493633181 493531615 493571103 494265169 495790184 497709721 499415308 500677884 501498044
1068.7E01498044J76012o21855r93550m62264Q78543K432823L406465L561497L483951
$$ 501498044 501674056 501052201 500058651 499596387 500474930 502907753 506314218 509875715 513359666
1087.1E13359666L732502M100859L971518L165721K247274J850188J833737J616478
$$ 513359666 517092168 521193027 525164545 528330266 530577540 532427728 534261465 535877943
1103.4E35877943J156926J024306J546144K376080K820611K565563K088964K019763
$$ 535877943 537034869 538059175 539605319 541981399 544802010 547367573 549456537 551476300
1119.7E51476300K288580K263605J763523J478970K021074K887428L024221K161383
$$ 551476300 553764880 556028485 557792008 559270978 561292052 564179480 567203701 569365084
1136E69365084J037419M61757L90530J64509m48466r23216o98507M7505N86331O54936
$$ 569365084 570402503 570864260 571254790 571419299 570970833 570047617 569349110 569396615 569982946 570637882
1156.4E70637882Q28266J686096K925038L664852L621399L510594M082561N113602
$$ 570637882 571466148 573152244 576077282 579742134 583363533 586874127 590956688 596070290
1172.7E96070290N725979N541146N179346N317807N689383N490601M495263L360569
$$ 596070290 601796269 607337415 612516761 617834568 623523951 629014552 633509815 636870384
1189.1F36870384K712667K343774J612485L85761o61135q64088n09978l74615o64413
$$ 636870384 639583051 641926825 643539310 643925071 643263936 642399848 641889870 641515255 640850842
1207.4F40850842q72672n65767k2232R7751m26650j024127j091301q41499q88586j374602
$$ 640850842 639978170 639412403 639390171 639487922 639061272 638037145 636945844 636104345 635215759 633841157
1227.8F33841157j825810j707553j133860p25925p55012p81238k65956O16909J207172
$$ 633841157 632015347 630307794 629173934 628448009 627692997 626911759 626645803 627262712 628469884
1246.2F28469884J240611J143337J408398J902580K076447J744390J350760J417577
$$ 628469884 629710495 630853832 632262230 634164810 636241257 637985647 639336407 640753984
1262.5F40753984J849115K060950J769841J333058J229405J371086J273870P74622
$$ 640753984 642603099 644664049 646433890 647766948 648996353 650367439 651641309 652415931
1278.8F52415931L47972N06103J051426J293004R13500L41773J01984J15454j62065
$$ 652415931 652763903 653270006 654321432 655614436 656527936 656869709 656971693 657087147 656925082
1297.2F56925082q81910j520097j609326j322627j199543j411081j526892j115203
$$ 656925082 656043172 654523075 652913749 651591122 650391579 648980498 647453606 646338403
1313.5F46338403l67880J55092J96755M8935J8954m9829m87685j253486j855135j872897
$$ 646338403 645970523 646125615 646322370 646371305 646390259 646340430 645852745 644599259 642744124 640871227
1333.9F40871227j430094j028002q91387q10743n79059l22282l13938o51717j080036
$$ 640871227 639441133 638413131 637521744 636711001 636131942 635809660 635495722 634844005 633763969
1352.2F33763969j258195j215577j277089j702428k390265k857864k891839k725541
$$ 633763969 632505774 631290197 630013108 628310680 625920415 623062551 620170712 617445171
1368.5F17445171k419055k273798k416312k494455k584457k964497l252804k758920
$$ 617445171 615026116 612752318 610336006 607841551 605257094 602292597 599039793 596280873
1384.9E96280873j608908n65052j79768k65300l33905r3580K67685N54025P61747J021743
$$ 596280873 594671965 594106913 593927145 593661845 593327940 593234360 593502045 594056070 594817817 595839560
1405.3E95839560J342595J603305J667857J528382J451493J705587K197206K145350
$$ 595839560 597182155 598785460 600453317 601981699 603433192 605138779 607335985 609481335
1421.6F09481335J738012J455068J209140R09865M11808k05397p26521p19428j46866
$$ 609481335 611219347 612674415 613883555 614793420 615205228 614999831 614273310 613553882 613407016
1439.9F13407016K76685L28540K98441M51267N75125M34875M25279J156450K331853
$$ 613407016 613683701 614012241 614310682 614761949 615337074 615771949 616197228 617353678 619685531
1458.3F19685531K582311K418280K490282K731502L295660M603088O416678O645382
$$ 619685531 622267842 624686122 627176404 629907906 633203566 637806654 644223332 650868714
1474.6F50868714N324244M158199L175080K064407O51479p74861k006769k928436l359139
$$ 650868714 656192958 660351157 663526237 665590644 666242123 665467262 663460493 660532057 657172918
1493F57172918m098832n227983n320549m708529m557371n920589q355021p684350o434799
$$ 657172918 653074086 647846103 642525554 637817025 633259654 627339065 618984044 611299694 604864895
1511.3F04864895o264567n611956m277945k727985k040804k050161k249658k543926
$$ 604864895 598600328 592988372 588710427 585982442 583941638 581891477 579641819 577097893
1527.6E77097893k307713j967192j868427j505613j220405j187384m29631N73993J068533
$$ 577097893 574790180 572822988 570954561 569448948 568228543 567041159 566611528 567185521 568254054
1546E68254054J502513K167106K845347L290057L345371L789961M302382L368318K869785
$$ 568254054 569756567 571923673 574769020 578059077 581404448 585194409 589496791 592865109 595734894
1564.3E95734894K659858K210080J958549J653075J314819R24468L55363j3411k20358
$$ 595734894 598394752 600604832 602563381 604216456 605531275 606455743 606811106 606797695 606577337
1582.7F06577337m27604q77798j481473j982868k228260k564788l152191l826618m434050
$$ 606577337 606149733 605271935 603790462 601807594 599579334 597014546 593862355 590035737 585601687
1601.1E85601687m896283n353689o044626o998956p559181p572174q372247r942472
$$ 585601687 580705404 575351715 569307089 562308133 554748952 547176778 538804531 528862059
1617.4E28862059r281635q903206j0181367j0165006r552687r229571q112341p352054
$$ 528862059 519580424 510677218 500495851 490330845 480778158 471548587 463436246 456084192
1633.7D56084192p362247n268275k487332q67307K92241J408428K267361K283215K819777
$$ 456084192 448721945 443453670 440966338 440099031 440391272 441799700 444067061 446350276 449170053
1652D49170053M285216M239560M060626M813224N990415O828428O706387P198780P972837
$$ 449170053 453455269 457694829 461755455 466568679 472559094 479387522 486093909 493292689 501265526
1670.4E01265526P434487P664502Q434415P947087P401407Q139789J0359406J0122001
$$ 501265526 508700013 516364515 524798930 532746017 540147424 548287213 558646619 568768620
1686.7E68768620Q979500R594142R967923J1792005J3517081J3258517J3780713J1278272
$$ 568768620 577748120 587342262 597310185 609102190 622619271 635877788 649658501 660936773
1703F60936773R187698Q976102P590532O106139N149424M745960M879832M260659L028810
$$ 660936773 670124471 679100573 686691105 692797244 697946668 702692628 707572460 711833119 714861929
1721.4G14861929K418817K320408K198220J938641J467645J378238J651824J702189
$$ 714861929 717280746 719601154 721799374 723738015 725205660 726583898 728235722 729937911
1737.7G29937911J892149K163113K463400L025472L724873M302085M441797M083932
$$ 729937911 731830060 733993173 736456573 739482045 743206918 747509003 751950800 756034732
1754G56034732M137814M364788M151106L947139L566563L337503L380060L157020K903103
$$ 756034732 760172546 764537334 768688440 772635579 776202142 779539645 782919705 786076725 788979828
1772.4G88979828K654016K360404K317667K198875J774609J461029J507461J599670
$$ 788979828 791633844 793994248 796311915 798510790 800285399 801746428 803253889 804853559
1788.7H04853559J494705J293004J054942J053989J262784J323760J034796P75635
$$ 804853559 806348264 807641268 808696210 809750199 811012983 812336743 813371539 814147174
1805H14147174Q69811J089930J103878Q26717O56247Q11815J029849R58681O82414
$$ 814147174 815016985 816106915 817210793 818037510 818693757 819505572 820535421 821494102 822176516
1823.4H22176516N12302N99742Q28802Q63433N97060M00484N52118P63058O75440M00960
$$ 822176516 822688818 823288560 824117362 824980795 825577855 825978339 826530457 827293515 827968955 828369915
1843.8H28369915K96057M65989O87897O51360L47316J90377L61860O09100N56171K32935
$$ 828369915 828665972 829131961 829819858 830471218 830818534 831008911 831370771 831979871 832536042 832768977
1864.2H32768977K4616K29121N81979N41628K38716R3818K83539N45919M84705J68801
$$ 832768977 832793593 833022714 833604693 834146321 834385037 834478855 834762394 835308313 835793018 835961819
1884.6H35961819L6359K48134N41389N03420J75477L1709K31385M50910L69787R2923
$$ 835961819 835998178 836246312 836787701 837291121 837466598 837498307 837729692 838180602 838550389 838643312
1904.9H38643312j2934J83821L86238K87771L7015l3260J69576L58760K91109N8949
$$ 838643312 838630378 838814199 839200437 839488208 839525223 839491963 839661539 840020299 840311408 840370357
1925.3H40370357n3346Q4460K56300J88171k4557m7564J25289K42531J68979k3305
$$ 840370357 840317011 840401471 840657771 840845942 840821385 840773821 840899110 841141641 841310620 841287315
1945.7H41287315j14203L4571K32697K07960L6240l0100Q1062K16305K06173L7491
$$ 841287315 841173112 841207683 841440380 841648340 841684580 841654480 841735542 841951847 842158020 842195511
1966.1H42195511q4221N36J80483K21371M4525j09792k2292J64926J64092j6034j41859
$$ 842195511 842111290 842111826 842292309 842513680 842558205 842448413 842426121 842591047 842755139 842739105 842597246
1988.6H42597246o0379J29878J72615N424j57535r0897J01864J35601o3419k38896
$$ 842597246 842536867 842666745 842839360 842844784 842687249 842596352 842698216 842833817 842770398 842531502
2009H42531502j84357j7822L0875j09136k53379k02954k3961J5438j50025k98441k42471
$$ 842531502 842347145 842329323 842360198 842251062 841997683 841794729 841770768 841786206 841636181 841337740 841095269
2031.4H41095269n4181K3663j32441l00050k03729J5855P8559n7697k03133j44243
$$ 841095269 841041088 841064751 840932310 840632260 840428531 840444386 840522945 840465248 840262115 840117872
2051.8H40117872P6234J55568K623j14322j5259J51575J64866K1220r5725j4902J59502
$$ 840117872 840194106 840349674 840352297 840237975 840222716 840374291 840539157 840560377 840464652 840449750 840609252
2074.2H40609252J62304j3650j05500M530J86205K41160R5428n3466k4021J33634K07961
$$ 840609252 840771556 840757906 840652406 840656936 840843141 841084301 841179729 841126263 841102242 841235876 841443837
2096.7H41443837J02043k5451J2576J70887K29358J01030m2379o377J43051K18987
$$ 841443837 841545880 841520429 841533005 841703892 841933250 842034280 841991901 841985524 842128575 842347562
2117.1H42347562J20163m5836n4240R7275J85788J02400j1444N901J29879J92701R0719
$$ 842347562 842467725 842421889 842367649 842464924 842650712 842753112 842741668 842747569 842877448 843070149 843160868
2139.5H43160868m1247p212J45733K29061J35660l1769k9504J56641K76744J88589
$$ 843160868 843119621 843112409 843258142 843487203 843622863 843591094 843561590 843718231 843994975 844183564
2159.9H44183564M7982O5148K23636L12508K20716J03652J47641L05056L53635K11835
$$ 844183564 844231546 844296694 844520330 844832838 845053554 845157206 845304847 845609903 845963538 846175373
2180.3H46175373Q3029J49906K83658K92122J93060J05977J38700K67744L03388J74641
$$ 846175373 846258402 846408308 846691966 846984088 847177148 847283125 847421825 847689569 847992957 848167598
2200.7H48167598O1035J04428K35378K82944K03609J34051J51813J90973J82093J19328
$$ 848167598 848228633 848333061 848568439 848851383 849054992 849189043 849340856 849531829 849713922 849833250
2221.1H49833250M8697P1704J76192J99258J09434L7909N9962R8348Q4519M8399M1843
$$ 849833250 849881947 849953651 850129843 850329101 850438535 850476444 850536406 850634754 850719273 850767672 850809515
2243.5H50809515P1823R3699N3942r597j2576J1325J4841K0206M0531L3558O914K2471
$$ 850809515 850881338 850975037 851028979 851019382 851006806 851018131 851032972 851053178 851093709 851127267 851134181 851156652
2268H51156652L2365J0968J9252L4928K6107O4671R4175L636j23560j87814k08617
$$ 851156652 851189017 851199985 851219237 851254165 851280272 851344943 851439118 851442754 851319194 851131380 850922763
2290.4H50922763k28643k40803k36869k51412k79963k98262l76641n06819n66959n33998
$$ 850922763 850694120 850453317 850216448 849965036 849685073 849386811 849010170 848503351 847936392 847402394
2310.8H47402394m73499m98474o90401r23872r52303p78020o51538o87182o92129m79937
$$ 847402394 846928895 846430421 845740020 844816148 843863845 843085825 842434287 841747105 841054976 840575039
2331.2H40575039k70605l27289m80830m94600k75135K98023J095176J059175j11759
$$ 840575039 840304434 839977145 839496315 839001715 838726580 839024603 840119779 841178954 841067195
2349.6H41067195j442313k103389j900434j321197o47723j3590M68910Q87036J230895
$$ 841067195 839624882 837521493 835621059 834299862 833652139 833638549 834107459 834994495 836225390
2367.9H36225390J408399J479089J435876J241624J050651R69291Q46922N99861K93673
$$ 836225390 837633789 839112878 840548754 841790378 842841029 843810320 844657242 845257103 845550776
2386.3H45550776K920j88589k20716j87337k07782k68161l01302k74420k17676k16603
$$ 845550776 845553696 845365107 845144391 844957054 844749272 844481111 844179809 843905389 843687713 843471110
2406.7H43471110l10540m00246l85880k88427k37644l17096m24981m29094l50714l13163
$$ 843471110 843160570 842760324 842374444 842086017 841848373 841531277 841106296 840677202 840326488 840013325
2427.1H40013325l74794m67956m47273l28422l00884m02331m78804m24982l25202l32892
$$ 840013325 839638531 839170575 838723302 838394880 838093996 837691665 837212861 836787879 836462677 836129785
2447.5H36129785m47751n23865m65274l31044l03805m15623m98056m47810l32713l12686
$$ 836129785 835682034 835158169 834692895 834361851 834058046 833642423 833144367 832696557 832363844 832051158
2467.9H32051158m22895n21779m67420l31700l25083m55976n28514m00305k45810l11970
$$ 832051158 831628263 831106484 830639064 830307364 829982281 829526305 828997791 828597486 828351676 828039706
2488.3H28039706m82857n24641l87311k23696k56836m35233n02706l85821k56419k83182
$$ 828039706 827556849 827032208 826644897 826421201 826164365 825729132 825226426 824840605 824584186 824301004
2508.7H24301004m14848m86731l95239k41816k52187m09842m92751m14193l07262l30210
$$ 824301004 823886156 823399425 823004186 822762370 822510183 822100341 821607590 821193397 820886135 820555925
2529H20555925m42743m78923m10140l27349l26037m52042n57422m87030l63588l62873
$$ 820555925 820113182 819634259 819224119 818896770 818570733 818118691 817561269 817074239 816710651 816347778
2549.4H16347778m44889m73321m16577l48091l51548m41015n02586m30822l06487k91229
$$ 816347778 815902889 815429568 815012991 814664900 814313352 813872337 813369751 812938929 812632442 812341213
2569.8H12341213m07755m97580m54426l59177l28183m11094n09500m64320l31879l20673
$$ 812341213 811933458 811435878 810981452 810622275 810294092 809882998 809373498 808909178 808577299 808256626
2590.2H08256626m40240n08904m64261l70323l42966m66883n80013n26487m27008m28617
$$ 808256626 807816386 807307482 806843221 806472898 806129932 805663049 805083036 804556549 804129541 803700924
2610.6H03700924n29587o33240o28233n23090m82321n99385p63297p83741o59466o11305
$$ 803700924 803171337 802538097 801909864 801386774 800904453 800305068 799541771 798758030 798098564 797487259
2631G97487259p02262p88033p72953o59764o02841p29323q44836p60794o16610o24835
$$ 797487259 796784997 795996964 795224011 794564247 793961406 793232083 792387247 791626453 791009843 790385008
2651.4G90385008p71582q52824p57515o13749n89669o72817p55131p51496o50286n83351
$$ 790385008 789613426 788760602 788003087 787389338 786799669 786126852 785371721 784620225 783969939 783386588
2671.8G83386588o58929p57039p18772n91040n41031o09219o92547o95765o07609n65947
$$ 783386588 782727659 781970620 781251848 780660808 780119777 779510558 778818011 778122246 777514637 776948690
2692.2G76948690o65426p52985p02381o20485o41942p49588q29220q08537p43270p27176
$$ 776948690 776283264 775530279 774827898 774207413 773565471 772815883 771986663 771178126 770434856 769707680
2712.6G69707680p94947q72076q44717p30276o51062o75439p59542p94530p30753o57499
$$ 769707680 768912733 768040657 767195940 766465664 765814602 765139163 764379621 763585091 762854338 762196839
2733G62196839o65248p04944o77228n87046n48065o13510o98924o96600o24776n85854
$$ 762196839 761531591 760826647 760149419 759562373 759014308 758400798 757701874 757005274 756380498 755794644
2753.4G55794644o15537o55114o37234n79953n57005o29008p43091p65443p11441o73413
$$ 755794644 755179107 754523993 753886759 753306806 752749801 752120793 751377702 750612259 749900818 749227405
2773.8G49227405o89626p76231q74222q48233p59721q20995r71615j001120r28282
$$ 749227405 748537779 747761548 746887326 746039093 745279372 744458377 743486762 742485642 741557360
2792.2G41557360r12488r98437j100362j130759j098335j100838j197696j318037j351357
$$ 741557360 740644872 739646435 738546073 737415314 736316979 735216141 734018445 732700408 731349051
2810.5G31349051j310885j293123j364290j483083j540005j530886j538754j636207
$$ 731349051 730038166 728745043 727380753 725897670 724357665 722826779 721288025 719651818
2826.8G19651818j825332j972676k010047k091825k344787k756417l238320l707946
$$ 719651818 717826486 715853810 713843763 711751938 709407151 706650734 703412414 699704468
2843.1F99704468m218161m727542m931152m518569l502905k336741j514732j234353
$$ 699704468 695486307 690758765 685827613 681309044 677806139 675469398 673954666 672720313
2859.5F72720313j421630j850486k356112k809405k992511k740205k222597j746297
$$ 672720313 671298683 669448197 667092085 664282680 661290169 658549964 656327367 654581070
2875.8F54581070j359284j042545q38876p74324q60989j032710j198530j314461j395226
$$ 654581070 653221786 652179241 651340365 650566041 649705052 648672342 647473812 646159351 644764125
2894.1F44764125j540422j787901k024591k183199k330899k576709k969027l433108
$$ 644764125 643223703 641435802 639411211 637228012 634897113 632320404 629351377 625918269
2910.4F25918269l878057m258513m490853m452169m058480l317654k367675j372993
$$ 625918269 622040212 617781699 613290846 608838677 604780197 601462543 599094868 597721875
2926.8E97721875m21584M32253J254499K110720K860844L343224L546477L528952L215850
$$ 597721875 597300291 597732544 598987043 601097763 603958607 607301831 610848308 614377260 617593110
2945.1F17593110K552926J793087J198649P75814O00219Q19266J309454J872063K456188
$$ 617593110 620146036 621939123 623137772 623913586 624513805 625333071 626642525 628514588 630970776
2963.5F30970776L054619L581822L922164M128218M281461M307926M190087L936887
$$ 630970776 634025395 637607217 641529381 645657599 649939060 654246986 658437073 662373960
2979.8F62373960L524303L119767K834201K556503K224862J816690J335919R07839
$$ 662373960 665898263 669018030 671852231 674408734 676633596 678450286 679786205 680694044
2996.1F80694044N38051J20163k74420n55933o86228p03513p49112q24809q40783q11517
$$ 680694044 681232095 681352258 681077838 680521905 679835677 679132164 678383052 677558243 676717460 675905943
3016.5F75905943q35657r89795j226306j420855j498461j468182j423895j446486j531303
$$ 675905943 675070286 674080491 672854185 671433330 669934869 668466687 667042792 665596306 664065003
3034.9F64065003j599967j599789j620292j731158j849591j869321j802445j797318
$$ 664065003 662465036 660865247 659244955 657513797 655664206 653794885 651992440 650195122
3051.2F50195122j899779j940727j869262j780212j727879j702249j592993j410365
$$ 650195122 648295343 646354616 644485354 642705142 640977263 639275014 637682021 636271656
3067.5F36271656j294196j295388j338065j289188j163066j107573j140416j142144
$$ 636271656 634977460 633682072 632344007 631054819 629891753 628784180 627643764 626501620
3083.8F26501620j077116r81986q97169r14276r99093r81689q97646q96394j001298
$$ 626501620 625424504 624442518 623545349 622631073 621631980 620650291 619752645 618856251 617854953
3102.2F17854953j121998j134217j075446j091123j165032j183808j191080j259982
$$ 617854953 616732955 615598738 614523292 613432169 612267137 611083329 609892249 608632267
3118.5F08632267j397372j564085j615405j548887j509308j547337j634240j709938
$$ 608632267 607234895 605670810 604055405 602506518 600997210 599449873 597815633 596105695
3134.8E96105695j713097j660288j684367j820565j916349j890838j797139j726091
$$ 596105695 594392598 592732310 591047943 589227378 587311029 585420191 583623052 581896961
3151.1E81896961j801431j987100k066612k011240j949549j938581j992941k065539
$$ 581896961 580095530 578108430 576041818 574030578 572081029 570142448 568149507 566083968
3167.4E66083968k065540k010345j987755k029717k078712k059997k036631k070784
$$ 566083968 564018428 562008083 560020328 557990611 555911899 553851902 551815271 549744487
3183.7E49744487k078474k020418j992822k028883k055883k035022j980424j943052
$$ 549744487 547666013 545645595 543652773 541623890 539568007 537532985 535552561 533609509
3200.1E33609509j926183j907647j884043j841962j811445j807094j811981j820266
$$ 533609509 531683326 529775679 527891636 526049674 524238229 522431135 520619154 518798888
3216.4E18798888j827777j838088j833975j819909j826882j840055j823664j821041
$$ 518798888 516971111 515133023 513299048 511479139 509652257 507812202 505988538 504167497
3232.7E04167497j953184k111018k096921k054990k102017k160251k227187k273173
$$ 504167497 502214313 500103295 498006374 495951384 493849367 491689116 489461929 487188756
3249D87188756k264708k266496k297253k304792k267569k253145k298147k313614k212554
$$ 487188756 484924048 482657552 480360299 478055507 475787938 473534793 471236646 468923032 466710478
3267.4D66710478k007872j851022j811832j764626j651525j521111j419991j333624
$$ 466710478 464702606 462851584 461039752 459275126 457623601 456102490 454682499 453348875
3283.7D53348875j229793j117408r55254p98225p70301p84248p40588o69926n99951
$$ 453348875 452119082 451001674 450046420 449248195 448477894 447693646 446953058 446283132 445683181
3302D45683181n36024n35161o07520o12825n55575n57661n88715n89520n80013n94645
$$ 445683181 445147157 444611996 444004476 443391651 442836076 442278415 441689700 441100180 440520167 439925522
3322.4D39925522o15925o57082p19338p60645p98911q07822p93814q40932r35704j022339
$$ 439925522 439309597 438652515 437933177 437172532 436373621 435565799 434771985 433931053 432995349 431973010
3342.8D31973010j114994j148105j068443j085102j263202j351684j270681j177699
$$ 431973010 430858016 429709911 428641468 427556366 426293164 424941480 423670799 422493100
3359.1D22493100j188248j255870j234412j147390j188636j365691j427591j278341
$$ 422493100 421304852 420048982 418814570 417667180 416478544 415112853 413685262 412406921
3375.5D12406921j133769j095415j066714r77904q69780p34479n65469n90801q12501
$$ 412406921 411273152 410177737 409111023 408133119 407263339 406528860 405963391 405372590 404560089
3393.8D04560089q41558n72324l64601n03749p05898o01440m16786l59148l15725k62022
$$ 404560089 403718531 403146207 402781606 402277857 401571959 400970519 400553733 400194585 399878860 399616838
3414.2C99616838k18601j08152N1170J50860K41846L49700M75824N98848P23839Q33481
$$ 399616838 399398237 399290085 399341255 399492115 399733961 400083661 400559485 401158333 401882172 402715653
3434.6D02715653P42257N64605O31928Q59112J034289J154215J191526J241148J335352
$$ 402715653 403457910 404022515 404654443 405513555 406547844 407702059 408893585 410134733 411470085
3453D11470085J385183J513779J693755J650959J585692J800359J984775J807034J514464
$$ 411470085 412855268 414369047 416062802 417713761 419299453 421099812 423084587 424891621 426406085
3471.3D26406085J553059J798123K011061K094924J952678J902521K075732K115249
$$ 426406085 427959144 429757267 431768328 433863252 435815930 437718451 439794183 441909432
3487.6D41909432K014637K039880K168179K244681K207219K210111K283007K194076
$$ 441909432 443924069 445963949 448132128 450376809 452584028 454794139 457077146 459271222
3504D59271222K043993K124041K303868K442658K476246K352029K315968K473950K695263
$$ 459271222 461315215 463439256 465743124 468185782 470662028 473014057 475330025 477803975 480499238
3522.3D80499238K689689K477437K453745K612710K734154K848536K884954K767265
$$ 480499238 483188927 485666364 488120109 490732819 493466973 496315509 499200463 501967728
3538.6E01967728K833784L077924L139138K932668K765954K900958L099024L120661
$$ 501967728 504801512 507879436 511018574 513951242 516717196 519618154 522717178 525837839
3554.9E25837839L163516L343225L409564L284037L335715L721058L845632L614783
$$ 525837839 529001355 532344580 535754144 539038181 542373896 546094954 549940586 553555369
3571.3E53555369L566325L722966L882229M026473M093527M041851M033148M156530
$$ 553555369 557121694 560844660 564726889 568753362 572846889 576888740 580921888 585078418
3587.6E85078418M212201M091322M079402M195630M307509M382133M340291M139662
$$ 585078418 589290619 593381941 597461343 601656973 605964482 610346615 614686906 618826568
3603.9F18826568L962934M120052M348695M314304M166782L949701M006923M300534
$$ 618826568 622789502 626909554 631258249 635572553 639739335 643689036 647695959 651996493
3620.2F51996493M076839L570735L392756L867328M217089L758728L563285L585577
$$ 651996493 656073332 659644067 663036823 666904151 671121240 674879968 678443253 682028830
3636.5F82028830L455222L363132L249645K986253K900064L326416L487408K850711
$$ 682028830 685484052 688847184 692096829 695083082 697983146 701309562 704796970 707647681
3652.8G07647681K577663K933740K941668K540052K228856K062977J981616K099514
$$ 707647681 710225344 713159084 716100752 718640804 720869660 722932637 724914253 727013767
3669.2G27013767K187431J896560J842320K021134J932978J776517J678347J675547
$$ 727013767 729201198 731097758 732940078 734961212 736894190 738670707 740349054 742024601
3685.5G42024601J784741J731933J491189J405060J321614J140713J027882J076341
$$ 742024601 743809342 745541275 747032464 748437524 749759138 750899851 751927733 753004074
3701.8G53004074J186013J140058R58205R37760J172721J194775Q84175O37770N95868
$$ 753004074 754190087 755330145 756288350 757226110 758398831 759593606 760477781 761115551 761711419
3720.1G61711419O41107O92606P23839O53863N77331P22706R90152J013160O92427
$$ 761711419 762352526 763045132 763768971 764422834 765000165 765722871 766713023 767726183 768418610
3738.5G68418610L43561L09706O28591P24434N05686N39005P26521P23779O31273N58615
$$ 768418610 768762171 769071877 769700468 770424902 770930588 771469593 772196114 772919893 773551166 774109781
3758.9G74109781M73738M38332M71294TM91977N21540M96626M89831M80354L97146
$$ 774109781 774583519 775021851 775493145 775964439 776456416 776977956 777474582 777964413 778444767 778841913
3779.3G78841913L05950L26395M08888M15266L78191L79503L48210K41578J24514J15633
$$ 778841913 779147863 779474258 779883146 780298412 780676603 781056106 781404316 781645894 781770408 781886041
3799.7G81886041L12925M76300M63784M59492L82722K34305J78934K77876K89441J74641
$$ 781886041 782198966 782675266 783139050 783598542 783981264 784215569 784394503 784672379 784961820 785136461
3820.1G85136461K53380L76105L66390K99275K16484K28047K59161J97232J97887K86401
$$ 785136461 785389841 785765946 786132336 786431611 786648095 786876142 787135303 787332535 787530422 787816823
3840.5G87816823L55780L47078J76370k5869j77741j02818M59016O87480L66985P9871
$$ 787816823 788172603 788519681 788696051 788670182 788492441 788389623 788848639 789536119 789903104 789982975
3860.9G89982975P4923K22325J73986P8320J60218K51531K91944K03609N5492Q6010
$$ 789982975 790057898 790280223 790454209 790532529 790692747 790944278 791236222 791439831 791495323 791581333
3881.3G91581333K27391K74718J41263K0743R2506K00570J65760J8478p3970K4140
$$ 791581333 791808724 792083442 792224705 792245448 792337954 792538524 792704284 792722762 792648792 792672932
3901.7G92672932K16186L06189K36511J34051N7400L0636K8849L3855Q7798R4593P9870
$$ 792672932 792889118 793195307 793431818 793565869 793623269 793653905 793682754 793716609 793804407 793899000 793978870
3924.1G93978870R6261Q9646P7724Q7261J08362Q4877R894n424R4652J89066J69873
$$ 793978870 794075131 794164777 794242501 794329762 794438124 794523001 794532895 794527471 794622123 794811189 794981062
3946.5G94981062R2507M5061M0293P9572J26958J21236P4803L7194K8729O0022J14918
$$ 794981062 795073569 795118630 795158923 795238495 795365453 795486689 795561492 795598686 795627415 795687437 795802355
3969G95802355Q8692L0100N2214R6797J04428Q8692P7247M4704J4960O3420J08182
$$ 795802355 795891047 795921147 795973361 796070158 796174586 796263278 796340525 796385229 796400189 796463609 796571791
3991.4G96571791Q6487Q4459J16468
$$ 796571791 796658278 796742737 796859205
3997.5G96859205
$$ 796859205
##END=$$ End of the data block
