##TITLE=G08-51-SE $$ Begin of the data block
##JCAMP-DX=5.00 $$ ACD/SpecManager v 10.08
##SPECTROMETER/DATA SYSTEM=Alpha
##DATE=22 Oct 2013 10:53:20
##DATA TYPE=INFRARED SPECTRUM
##DATA CLASS=XYDATA
##ORIGIN=
##OWNER=
##NPOINTS=1765
##FIRSTX=399.75695801
##LASTX=3997.56933594
##MAXX=3997.56933594
##MINX=399.75695801
##MAXY=0.72808224
##MINY=0.06419098
##XFACTOR=1.0000000000
##YFACTOR=1.000000000000000e-9
##FIRSTY=0.29092306
##DELTAX=2.03957629
##XUNITS=1/CM
##YUNITS=ARBITRARY UNITS
##XYDATA=(X++(Y..Y))
399.8 290923059 287555695 284580320 282563388 282141924 282763779 283540010 284144670 284433901 283944935
418.1 283944935 282273144 280500948 279324383 278158724 276557386 274689287 272848964 271215200
434.4 271215200 270098925 269883394 270571083 271824211 273404092 274986684 275908738 275962740 275319815
452.8 275319815 274196088 272761554 270953268 268799871 266307324 263667583 261199892 258897811
469.1 258897811 256458730 253891379 251664609 249954000 248605922 247445241 246394232 245473832 244578570
487.5 244578570 243287086 241413221 239387199 237431452 235243291 232748359 230097055 227340400
503.8 227340400 224558264 221740440 218823180 215962932 213326484 210788310 208324671 206178233
520.1 206178233 204607338 203744143 203382567 203314140 203605250 204328552 205621377 207628563 210235029
538.4 210235029 212959170 215157479 216594830 217300653 217227817 216499195 215363592 214070484 212713614
556.8 212713614 211135909 209238917 207069099 204713881 202284202 199983045 198193148 197376773 197639316
575.2 197639316 198731139 200558618 203086585 206076995 209135458 211821795 213816360 215071455
591.5 215071455 215642661 215709433 215650037 215672597 215770081 215899423 216001719 216147467 216416717 216664791
611.9 216664791 216958717 217584908 218575701 219936654 221772581 224017620 226553574 229308113 231976211
630.2 231976211 234268650 236198455 237869993 239458725 241114259 242662713 243891567 244863123 245697722
648.6 245697722 246378079 246850431 247108534 247255966 247442305 247632354 247747302 248137370 249445394 251066238
669 251066238 251728624 252522618 253880471 255517930 257226110 258818597 260154694 261130482 261784852
687.3 261784852 262244225 262299478 261587769 260211974 258744270 257898301 258048236 259019494 260516793
705.7 260516793 262534052 265172124 268396169 271999955 275855571 280233562 285299391 290643185
722 290643185 295902103 301078498 306092590 310786963 314881355 318060130 320359826 322094619 323440343
740.4 323440343 324178547 324244946 323926181 323486149 322923034 322000027 320577353 318834484 317128807
758.7 317128807 315804899 315061778 315115482 316503286 319576293 324164450 329824358 336120963 342720687
777.1 342720687 349203259 355121553 360210299 364404202 367861956 370898992 373578668 375949889
793.4 375949889 378390044 381354243 384989738 388985187 392836213 396192819 399044067 401411951
809.7 401411951 403180361 404326051 404959440 405049950 404409260 402884722 400446981 397241712 393610448
828.1 393610448 389903665 386197716 382416338 378530264 374618262 370788604 367203861 364086598
844.4 364086598 361487091 359352976 357674688 356374860 355300993 354473650 354320705 355686903 359397858
862.7 359397858 365547478 373344779 381653309 389463246 395950943 400396794 402240366 401361316 398124039
881.1 398124039 393095493 386890918 380073488 373046696 366079450 359395504 353109926 347089678
897.4 347089678 341020912 334619164 327742398 320350826 312481403 304287285 296084017 288277984
913.7 288277984 281223059 275212497 270532787 267322928 265335619 264048129 263060570 262264669 261659503
932.1 261659503 261180401 260702610 260146469 259445637 258234590 255686671 250928372 243763462 234857351
950.4 234857351 225138232 215232089 205425665 195849717 186606616 177700385 169091627 160871342
966.8 160871342 153187960 146196380 140059680 134891808 130735189 127581462 125342816 123822711
983.1 123822711 122780614 121982656 121250764 120542735 119892113 119307280 118841492 118590020 118558653 118620284
1003.5 118620284 118557952 118173629 117405236 116349809 115197621 114088379 113004707 111858584 110642634
1021.8 110642634 109392047 108084492 106724702 105375975 104050063 102706037 101313308 99882796
1038.1 99882796 98505959 97269833 96157849 95153101 94331212 93796767 93611315 93789749 94308861
1056.5 94308861 95117517 96172400 97452417 98853737 100093596 100723945 100460514 99624433 98918080
1074.8 98918080 98851182 99597014 101126850 103301428 105948664 108883210 111921176 114913657 117762551
1093.2 117762551 120391719 122679621 124520108 125917688 127005950 128030330 129259109 130817845
1109.5 130817845 132664323 134708285 136860251 138966903 140842274 142429069 143829346 145279184
1125.8 145279184 147042066 149207488 151620537 153978705 155985892 157410473 158102483 158122063 157724008
1144.2 157724008 157127991 156496540 155988276 155704692 155747980 156288832 157485783 159383625 161893234
1162.6 161893234 164891228 168306991 172116488 176394358 181304201 186919063 193107769 199667543
1178.9 199667543 206392005 213036656 219405070 225328058 230557039 234793752 237801582 239545211
1195.2 239545211 240225211 240136057 239517316 238553300 237511799 236698285 236224756 235959306 235709101 235363469
1215.6 235363469 234883711 234218642 233274117 231975898 230332866 228476688 226564825 224701270 222986385
1233.9 222986385 221551254 220544830 220105425 220268413 220962614 222139359 223783776 225845605 228154480
1252.3 228154480 230530262 232918918 235318631 237700224 240007743 242232740 244439796 246690348
1268.6 246690348 248914480 250916451 252532661 253783137 254837841 255871475 256952345 258049607
1284.9 258049607 259120047 260106593 260889262 261236280 260928959 259926587 258383721 256510675 254461855
1303.3 254461855 252316624 250145763 248140886 246509358 245345652 244662702 244457066 244694054 245168403
1321.6 245168403 245411456 244942114 243595928 241572410 239218935 236822993 234603405 232736036 231405079
1340 231405079 230608732 230066240 229503512 228793487 227852091 226612002 225066364 223259330 221214369
1358.3 221214369 218790606 215802431 212328032 208612815 204961345 201875687 199221313 196411014
1374.7 196411014 193306670 189939082 186361313 182836697 179707110 177248821 175768077 175130635
1391 175130635 174764067 174405485 174252033 174430460 174981475 175914586 177233517 178833395 180545628
1409.3 180545628 182366028 184286192 186251700 188365892 190940917 193693846 196303383 198722392
1425.7 198722392 200660631 201891467 202391461 202266499 201563552 200811356 200621247 200799033 201105356
1444 201105356 201464146 201824129 202113807 202292457 202661201 203965932 206695691 209787637 212672263
1462.4 212672263 215720758 219247237 223473087 229176044 237265825 246177405 253741235 259563714
1478.7 259563714 263533145 265685499 265979737 264304399 260510921 255151093 249538317 243285626
1495 243285626 235710397 228227988 221728995 215651259 207995325 197382897 188191518 180979595
1511.3 180979595 174129084 168193489 163878664 161186397 159009069 156853676 154726341 152438059
1527.6 152438059 150374308 148475707 146582335 145207912 144238308 143253103 142950431 143655270 145010412
1546 145010412 146949068 149554223 152751312 156338826 160051912 164534941 170011058 174348593 177976117
1564.3 177976117 181489915 184802681 187990740 190592438 192613214 194434598 195940673 196965635
1580.7 196965635 197518155 197726473 197637528 197196737 196252227 194731101 192582518 189882070 186632797
1599 186632797 182668135 177961394 172643125 166747168 160190776 153289601 146422863 138876349 130127013
1617.4 130127013 122351155 115106218 106859051 98921515 91917813 85477568 79977013 75014941
1633.7 75014941 70027433 66593759 65023109 64354151 64190976 64459465 65188579 66047832 67033321
1652 67033321 68622582 70501871 72409071 74722551 77688508 81259020 84941395 89138776 94177008
1670.4 94177008 99191792 104557201 110622741 116645001 122591488 129477292 138612300 147890881
1686.7 147890881 156565920 166453481 177301601 190747470 206924587 223986283 243495509 260711223
1703 260711223 275569826 290479183 303666979 315017551 325014383 334073454 343093187 351462185
1719.3 351462185 358240336 364140481 369594336 374446839 378872395 382911533 387229323 392175466
1735.7 392175466 396879137 401781917 407397509 413512975 420117795 427278727 435436189 444578886
1752 444578886 453456670 462085634 470829517 479312778 488007575 496460676 504079521 511241794 518002808
1770.3 518002808 524824619 531596363 537481427 542633653 547503471 552168131 556542277 560627282
1786.7 560627282 564308405 567607403 571094573 574798346 578139246 581062853 584017038 587182403
1803 587182403 590235591 592989624 595532656 598111033 600757837 603304267 605717242 608088553 610336304
1821.3 610336304 612379551 614419341 616431296 618354976 620479703 622670054 624591708 626341820
1837.6 626341820 627981424 629326224 630519211 632074654 633847833 635473430 636946559 638293922
1854 638293922 639580071 640828133 642029107 643172741 644249737 645156384 645979822 647114158 648473024
1872.3 648473024 649711788 650816739 651901126 652971506 654055893 655184209 656243682 657158673
1888.6 657158673 658146560 659254968 660277843 661257863 662216306 663081527 663860798 664620101 665341496
1907 665341496 666003942 666705787 667417884 668005645 668513060 669151485 669823527 670454383 671171904 671857417
1927.4 671857417 672413349 672920167 673412442 673870206 674319744 674681902 674923122 675296724 675888419 676477194
1947.8 676477194 676969767 677410662 677873671 678394794 678903520 679398656 679898202 680348516 680769384 681257486
1968.2 681257486 681747854 682153106 682556093 682992578 683398426 683729947 684032023 684339404 684638679 684894860
1988.6 684894860 685114741 685355723 685641646 685931861 686190307 686409891 686548412 686603248 686604023 686576426
2009 686576426 686511517 686390042 686192214 685972571 685808897 685603619 685284138 684921324 684589922 684279799
2029.4 684279799 683960497 683620811 683288097 682987928 682715952 682478964 682249129 682020187 681851745 681785643
2049.8 681785643 681759417 681732833 681744635 681830168 681987405 682160079 682304621 682468116 682703793 682943523
2070.2 682943523 683111489 683218718 683336675 683495581 683663964 683796525 683907628 684069335 684279978 684508264
2090.5 684508264 684718370 684892535 685095310 685383081 685678244 685917199 686139643 686379910 686642408 686888158
2110.9 686888158 687073171 687212884 687371135 687564492 687755108 687889397 687984169 688119709 688299835 688478470
2131.3 688478470 688628733 688777745 688945770 689119399 689292133 689453304 689627826 689837158 690025687 690207064
2151.7 690207064 690464020 690799534 691185534 691577733 691948235 692346156 692858815 693468332 694078028 694680333
2172.1 694680333 695300817 695949852 696623445 697273850 697874129 698474884 699106932 699747562 700365543 700935364
2192.5 700935364 701486409 702055633 702640414 703177989 703626156 704067886 704587698 705156326 705695212 706179619
2212.9 706179619 706665158 707203627 707738161 708161294 708475590 708799422 709191859 709568024 709835887 710027456
2233.3 710027456 710232496 710493445 710782290 710994840 711112440 711250961 711469114 711711109 711882889 711963117
2253.7 711963117 712046027 712212384 712406397 712552965 712664843 712781131 712912858 713058293 713169336 713177145
2274.1 713177145 713106334 713008761 712891459 712788820 712780356 712879121 713066995 713309824 713529170 713716209
2294.5 713716209 713907540 714153886 714476049 714849830 715300083 715916336 716715217 717505217 718048394 718453586
2314.9 718453586 719192624 720471203 721874595 722832561 723380625 724004865 724795461 725306749 725295603
2333.3 725295603 725088418 725000858 725062788 724869072 723447978 720177293 717099369 716675818 719050884
2351.6 719050884 722688317 725766778 727618217 728082240 727138281 724929452 721789360 718102574 714252293
2370 714252293 710503757 706882536 703392088 700193763 697445154 695141792 693221986 691666603 690507770
2388.3 690507770 689720392 689083099 688320518 687385380 686459303 685673892 684922338 684009731 682936728
2406.7 682936728 681878090 680942237 680034995 678976655 677767158 676591933 675534189 674465895 673254132
2425 673254132 671932638 670663655 669509888 668341696 667043746 665663600 664340317 663125753 661919117
2443.4 661919117 660610080 659227967 657907069 656711102 655528843 654222906 652830243 651497662
2459.7 651497662 650303364 649168253 647937417 646614671 645361125 644230187 643101871 641857624
2476 641857624 640525877 639227211 638027310 636887848 635724545 634507835 633314908 632228076 631193221
2494.4 631193221 630094767 628940344 627844155 626840591 625848293 624783397 623653173 622576714
2510.7 622576714 621625543 620666087 619548202 618354857 617236137 616199315 615167379 614061117 612858057
2529 612858057 611608028 610395014 609236181 608031511 606730223 605431736 604234695 603107989 601938546
2547.4 601938546 600690961 599461436 598317444 597206473 596041322 594819784 593625069 592506170
2563.7 592506170 591432333 590314865 589104176 587882578 586738944 585626066 584451497 583221793
2580 583221793 582019925 580895543 579812169 578678787 577462971 576258123 575137734 574042618 572895467
2598.4 572895467 571671665 570412993 569177210 567918599 566560566 565113068 563618302 562076986
2614.7 562076986 560485721 558848560 557144642 555404723 553694069 551976562 550166965 548290849
2631 548290849 546411574 544528246 542645991 540748060 538819730 536914349 535055578 533222377 531388521
2649.4 531388521 529520094 527629972 525793374 524018407 522211790 520353973 518525481 516768456
2665.7 516768456 515044808 513301015 511541307 509824753 508189559 506601572 504997790 503383160
2682 503383160 501816750 500298440 498780370 497232735 495642304 494026542 492399812 490733624 489016235
2700.4 489016235 487280250 485520512 483719945 481897682 480023950 478094935 476202786 474358499
2716.7 474358499 472485453 470578879 468692213 466890186 465184987 463516414 461875200 460268170
2733 460268170 458660275 457074165 455555588 454088628 452629656 451149672 449667275 448215097 446793348
2751.4 446793348 445378512 443960100 442542255 441130549 439742208 438346326 436915696 435474813
2767.7 435474813 434016228 432504326 430944830 429380953 427783579 426083833 424306273 422515064
2784 422515064 420678049 418721020 416692495 414684892 412647426 410501957 408297688 406076461 403821498
2802.3 403821498 401496559 399043351 396486938 393910706 391320437 388681650 385986179 383219719
2818.7 383219719 380362093 377396584 374319196 371149033 367867023 364421368 360790640 356919110
2835 356919110 352701128 348051995 342833877 336836874 329969436 322465807 314931333 308101416 302547663
2853.3 302547663 298464358 295484155 292884678 290003300 286423743 282078326 277206272 272232950
2869.7 272232950 267698109 264029324 261329114 259454787 258169532 257192165 256260931 255212516 253988504
2888 253988504 252574712 250957668 249137521 247112781 244856492 242360830 239621565 236593246 233213425
2906.4 233213425 229402646 225109339 220359445 215232208 209930792 204801336 200185433 196342424
2922.7 196342424 193434522 191533014 190686196 190902218 192131117 194338515 197459057 201261804 205393925
2941 205393925 209499791 213204101 216225818 218501955 220055118 221024692 221793383 222831905 224463508
2959.4 224463508 226841688 230048001 234074026 238827825 244207561 250070274 256230831 262500733
2975.7 262500733 268722445 274788678 280575573 285955608 290842116 295172542 298907369 302023113
2992 302023113 304486901 306267768 307370126 307809532 307626545 306942552 305926234 304693192 303315341
3010.4 303315341 301921904 300619960 299317062 297843933 296138376 294132710 291811794 289362013
3026.7 289362013 286957026 284611136 282273859 279903322 277493209 275020808 272451639 269812614
3043 269812614 267159283 264491379 261774659 259044230 256347507 253673345 251023144 248438105 245979637
3061.4 245979637 243679926 241521940 239528745 237735331 236065418 234411836 232770294 231217563
3077.7 231217563 229772717 228374660 227030098 225793526 224646434 223548546 222482413 221431494
3094 221431494 220392942 219372183 218361825 217310056 216153622 214925110 213705242 212475538 211168185
3112.4 211168185 209793642 208402008 206983641 205490872 203932256 202345178 200726628 199068338
3128.7 199068338 197369486 195634007 193883479 192102969 190270409 188434795 186650530 184871778
3145 184871778 183032930 181162268 179298818 177437484 175572321 173705295 171843395 170001253 168166488
3163.4 168166488 166326627 164495140 162690252 160911068 159102529 157256514 155446008 153702393
3179.7 153702393 151994959 150309026 148628682 146940574 145283714 143664926 142057389 140489310
3196 140489310 138995901 137551993 136140585 134769008 133416295 132079959 130783200 129514158 128241628
3214.3 128241628 126962245 125701025 124469265 123245545 122010805 120783672 119581245 118356608
3230.7 118356608 117079169 115766756 114422202 113028586 111595161 110161297 108720072 107236698
3247 107236698 105702393 104113519 102500111 100926623 99380232 97829193 96289881 94777994 93337476
3265.3 93337476 91984257 90671219 89388862 88212401 87200344 86318187 85504323 84733784 84021829
3283.7 84021829 83414793 82925141 82528897 82222804 81983514 81780747 81627131 81529409 81458315 81405729
3304.1 81405729 81369899 81368998 81448324 81580296 81717387 81851430 81994072 82168460 82364634 82565859 82747109
3326.5 82747109 82884230 83025008 83194174 83371498 83557166 83722278 83823673 83869554 83907977 83974853
3346.9 83974853 84080137 84207796 84293120 84296860 84291875 84341384 84414780 84463403 84478013 84493913 84539421 84556751
3371.4 84556751 84524915 84533684 84604874 84673546 84678844 84668271 84739655 84908895 85093856 85203685 85264437
3393.8 85264437 85351713 85499965 85709020 85919008 86041301 86151168 86357653 86618744 86889982 87182328
3414.2 87182328 87488398 87782204 88090360 88488117 88998869 89573570 90180129 90760700 91353238 92033513
3434.6 92033513 92698134 93287908 93882754 94537206 95267907 96075192 96920460 97796410 98687410 99592835
3455 99592835 100565538 101567827 102482386 103395067 104475252 105688557 106877938 107901238 108898237
3473.4 108898237 110079274 111409687 112726294 113961451 115239792 116647914 118110783 119568512
3489.7 119568512 121038564 122519545 124021232 125520051 127030492 128588110 130131960 131672129
3506 131672129 133318722 135039777 136785433 138569832 140304103 142016888 143834174 145777300 147723198
3524.4 147723198 149590105 151501924 153589636 155788913 158017620 160232723 162413269 164723992
3540.7 164723992 167198181 169671610 172093496 174577594 177142218 179771841 182493985 185282007
3557 185282007 188169464 191154853 194126531 197073132 200301379 203885108 207505688 211104795 214805305
3575.3 214805305 218613252 222534359 226594135 230682656 234711945 238880515 243422657 248034880
3591.7 248034880 252543449 257153153 261936069 266776502 271659404 276561290 281332821 286109030
3608 286109030 291114569 296331882 301714718 307045996 312349021 318088442 323999912 329569072 334670246
3626.3 334670246 339763254 345559478 351467520 357129693 362699181 368184566 373636603 379076064
3642.6 379076064 384324133 389242768 394321144 400094002 405881464 411134154 416357756 421755224
3659 421755224 426920027 431811363 436553389 440954059 445036590 449392200 453628629 457360774 461491257
3677.3 461491257 465959162 470161051 474152952 477893382 481146127 484090954 487295717 490689993
3693.6 490689993 493912369 496848911 499414980 501725495 504184484 506713808 508860886 510438800
3709.9 510438800 511931241 514132440 516681254 519001782 521048188 522890031 524538636 526178896
3726.3 526178896 528142273 530005038 531220019 532084942 533282816 535062909 536929488 537970066
3742.6 537970066 538480401 539982557 541641831 542500615 543668509 545555651 547308981 548641145 550013363
3760.9 550013363 551501215 552755237 553801000 554763496 555894971 557347059 558767498 559882760
3777.3 559882760 560749114 561734140 562856793 563883483 564963162 566176355 567326188 568181634 568802893
3795.6 568802893 569595814 570264935 570719302 571833730 572971046 573749542 574966729 576345921 577081144
3814 577081144 577301919 577869177 578369856 578889549 580136895 581386745 582309008 583044887 583682775 584343672
3834.4 584343672 584669232 584771812 585392296 586351216 587333679 588424146 589492023 589910090 589070857
3852.7 589070857 588689744 590073645 591558099 592371881 592715383 593102455 593666136 593861580 594052851
3871.1 594052851 594742000 595612049 596439064 596832216 597088754 597538471 597814739 598310113 598889947 599112093
3891.5 599112093 599584639 600307882 600595057 600453258 600302279 600370169 600899220 601737916 602417469 602842212
3911.9 602842212 603071988 603075564 603068233 603343964 603701353 603859305 604043186 604369104 604537368 604600012
3932.3 604600012 604901135 605359733 605688512 605813503 605881929 606112421 606402218 606592953 606821895 607131481
3952.7 607131481 607424021 607647359 607815325 607950985 608128369 608371079 608552456 608670235 608823240 609048486
3973.1 609048486 609292448 609480560 609628439 609798849 609995067 610158384 610291064 610474765 610746026 611030936
3993.4 611030936 611254334 611431062
3997.5 611431062
##END=$$ End of the data block
