##TITLE=G08-51-SE $$ Begin of the data block
##JCAMP-DX=5.00 $$ ACD/SpecManager v 10.08
##SPECTROMETER/DATA SYSTEM=Alpha
##DATE=22 Oct 2013 10:53:20
##DATA TYPE=INFRARED SPECTRUM
##DATA CLASS=XYDATA
##ORIGIN=
##OWNER=
##NPOINTS=1765
##FIRSTX=399.75695801
##LASTX=3997.56933594
##MAXX=3997.56933594
##MINX=399.75695801
##MAXY=0.72844964
##MINY=0.06440203
##XFACTOR=1.0000000000
##YFACTOR=1.000000000000000e-9
##FIRSTY=0.29143846
##DELTAX=2.03957629
##XUNITS=1/CM
##YUNITS=ARBITRARY UNITS
##XYDATA=(X++(Y..Y))
399.8 291438460 287748903 285132349 283640325 283177435 283317655 283843189 284592122 285168111 284883589
418.1 284883589 283250690 281262785 279490173 277818859 276233524 274644464 273013771 271453828
434.4 271453828 270357639 270288974 271366537 273077488 274876505 276353657 277048647 276862204 276177287
452.8 276177287 275270253 273920029 272068769 269907475 267442763 264816582 262058467 259254813 256619841
471.1 256619841 254317880 252413213 250724703 249250323 248039514 247088641 246240035 245105714 243730202
489.5 243730202 242224976 240445018 238406643 236049220 233401716 230699360 228029177 225305200
505.8 225305200 222456262 219514072 216570839 213792264 211221203 208844990 206826285 205293253
522.1 205293253 204278454 203812271 203832671 204267561 205068022 206253767 208148077 210728049 213313431
540.5 213313431 215478912 217004851 217593327 217464581 216983899 216075957 214760408 213329002 211810261
558.8 211810261 209958091 207729772 205280274 202702865 200321123 198730335 198170260 198405668 199343145
577.2 199343145 201137558 203654051 206585959 209619448 212271124 214216605 215481475 216153041 216409951
595.6 216409951 216519803 216629714 216701433 216667473 216650233 216788188 217061087 217354774 217683285 218271211
616 218271211 219286948 220717922 222541630 224745274 227242932 229881257 232470229 234884575 236978456
634.3 236978456 238760814 240424216 241997853 243416980 244666621 245698139 246532977 247206628 247587562
652.7 247587562 247654974 247663528 247813642 248089582 248383909 248972058 250487000 252072960 252488256 253188580
673.1 253188580 254590571 256276965 258041352 259697706 260967672 261837274 262480855 262904853 262908995
691.4 262908995 262227952 260916322 259485006 258625686 258706927 259616107 261144519 263301045 266052067
709.8 266052067 269205242 272707880 276617318 281058609 286061347 291290551 296517164 301808506
726.1 301808506 306941450 311607063 315632075 318780750 321097016 322904617 324289769 325023711 325099260
744.4 325099260 324791998 324332505 323699206 322704196 321240366 319447666 317701429 316336215 315547109
762.8 315547109 315604210 317018479 320124328 324755400 330466449 336783677 343329430 349785507 355790108
781.2 355790108 360970378 365174502 368630350 371638238 374241650 376586676 379055202 382069975
797.5 382069975 385782480 389813513 393593371 396875948 399760544 402182668 403949708 405054092
813.8 405054092 405602783 405622214 404996306 403534323 401130348 397918493 394227207 390417069 386649549
832.1 386649549 382860422 378966749 375000954 371140569 367609650 364520133 361935169 359855384
848.5 359855384 358193308 356887460 355829149 354978472 354742646 356069356 359852552 366051316 373750180
866.8 373750180 381911308 389625490 396046519 400447577 402332306 401578039 398428828 393385887 387099922
885.2 387099922 380180687 373071909 366079688 359432757 353199929 347198963 341109961 334663838
901.5 334663838 327751815 320350260 312497020 304356337 296208650 288401157 281294435 275257707
917.8 275257707 270588994 267372400 265371382 264100909 263120085 262266934 261607409 261159837 260755718
936.2 260755718 260239273 259540170 258314252 255735457 250946611 243775129 234868526 225128114 215195939
954.5 215195939 205400437 195863768 186616912 177672610 169043690 160800502 153100684 146128431
970.8 146128431 140026778 134892002 130767316 127645701 125434428 123911262 122832216 122008979 121275932
989.2 121275932 120561987 119893029 119312175 118895032 118680529 118620552 118613787 118492641 118091770 117373355
1009.6 117373355 116421759 115362048 114268117 113129638 111941867 110720403 109439597 108074322
1025.9 108074322 106656514 105269186 103971668 102697417 101334944 99908747 98549478 97312003
1042.2 97312003 96180364 95176481 94372667 93855165 93673617 93845010 94344474 95128886 96177921
1060.6 96177921 97459920 98887600 100188047 100862399 100624837 99797010 99045545 98916210 99641576
1078.9 99641576 101178437 103352614 106006458 108966276 112014644 114991382 117825150 120444097
1095.2 120444097 122726403 124581873 126011074 127124459 128151700 129364818 130903795 132753298
1111.6 132753298 134817392 136955455 139020890 140885860 142504141 143945903 145413652 147142902
1127.9 147142902 149265200 151708484 154132709 156150237 157550976 158239737 158253074 157819554 157196462
1146.2 157196462 156580687 156109810 155845925 155874535 156401619 157623276 159537688 162022054 164993852
1164.6 164993852 168397471 172209799 176514894 181434274 187010273 193162128 199715048 206433460
1180.9 206433460 213076204 219463706 225413859 230649486 234846100 237798423 239525899 240214914
1197.2 240214914 240121067 239503786 238566086 237525687 236661345 236151293 235889405 235623121 235263452 234809890
1217.6 234809890 234158933 233196452 231875822 230238855 228433549 226583600 224749982 223041072 221635580
1236 221635580 220670909 220235631 220381394 221062273 222232446 223876879 225923732 228223830 230617255
1254.3 230617255 233008966 235398501 237783432 240101740 242351919 244583204 246819347 249014094
1270.6 249014094 251008034 252628475 253881246 254938960 255977809 257062972 258172363 259257585
1287 259257585 260247678 261027813 261362374 261019111 259985089 258457303 256625801 254591435 252439559
1305.3 252439559 250285238 248303682 246682778 245536134 244861439 244659573 244915843 245377585 245573029
1323.7 245573029 245098695 243775934 241740122 239355609 236950263 234747142 232885078 231521457
1340 231521457 230684072 230128974 229572013 228854105 227899954 226674199 225159466 223365679 221324027
1358.3 221324027 218907878 215917155 212416336 208666682 205003336 201920018 199259311 196437150
1374.7 196437150 193353653 190040186 186468169 182892337 179731712 177288547 175846204 175243214
1391 175243214 174910799 174588844 174436867 174586400 175125852 176069945 177399173 179005310 180734262
1409.3 180734262 182563245 184470236 186445966 188615516 191221982 193940803 196519226 198924765
1425.7 198924765 200835019 202039167 202536374 202447191 201803625 201040313 200783968 200933069 201246962
1444 201246962 201609761 201962784 202265486 202473000 202864513 204191148 206935942 210021093 212899804
1462.4 212899804 215949550 219443500 223619804 229289651 237347782 246219516 253739446 259529412
1478.7 259529412 263482332 265622199 265897453 264202267 260400921 255027175 249401107 243162945
1495 243162945 235599488 228107408 221609548 215551510 207931504 197345287 188159212 180946156
1511.3 180946156 174083471 168162182 163903892 161256179 159105018 156972095 154855043 152583167
1527.6 152583167 150540218 148668155 146801412 145430699 144482434 143537775 143226653 143940985 145342365
1546 145342365 147283956 149857834 153059110 156696722 160480872 165026918 170484468 174765274 178363636
1564.3 178363636 181863904 185154259 188316107 190914780 192958653 194812372 196315318 197305009
1580.7 197305009 197816059 197992012 197890460 197433308 196452469 194894940 192739695 190055937 186810628
1599 186810628 182849705 178179204 172915295 167039379 160460040 153545216 146677122 139114439 130328268
1617.4 130328268 122505933 115248181 107028395 99109143 92104584 85654788 80137283 75160749
1633.7 75160749 70153877 66698745 65145038 64530112 64402029 64643376 65336548 66204950 67195989
1652 67195989 68755545 70620596 72529018 74844226 77844605 81468314 85163243 89346096 94373964
1670.4 94373964 99376030 104726762 110800937 116830841 122763306 129644930 138798654 148089468
1686.7 148089468 156760290 166638657 177481204 190917611 207075045 224151120 243707404 260939002
1703 260939002 275817275 290753037 303920478 315252841 325317174 334500372 343590647 351960689
1719.3 351960689 358722508 364590049 370023966 374890804 379336357 383413941 387798369 392758697
1735.7 392758697 397439092 402341813 407961577 414084703 420725852 427945286 436152071 445285439
1752 445285439 454121262 462736100 471487254 479979694 488663822 497102946 504746020 511930346 518709064
1770.3 518709064 525580823 532381415 538257957 543395281 548244774 552897811 557289660 561394930
1786.7 561394930 565079510 568382919 571878552 575564384 578887105 581847548 584837615 587979198
1803 587979198 590996623 593721628 596235573 598799050 601454616 604029477 606450498 608803213 611075342
1821.3 611075342 613186598 615250528 617235243 619132936 621242285 623427510 625341356 627081752
1837.6 627081752 628739834 630148232 631410241 632955909 634655356 636214495 637668133 639048219
1854 639048219 640375733 641628563 642819226 643976390 645065963 645953834 646756530 647894919 649267435
1872.3 649267435 650513828 651602387 652671516 653767824 654878736 655995607 657061219 658022702
1888.6 658022702 659011960 660061300 661042988 662034571 663019836 663876832 664634705 665391505 666115999
1907 666115999 666783273 667497039 668233991 668864846 669401169 670023263 670660675 671261251 671960354 672658205
1927.4 672658205 673233926 673735499 674230397 674716890 675187826 675566494 675833344 676202536 676738381 677257419
1947.8 677257419 677720249 678191483 678705513 679265320 679788351 680260301 680734873 681206167 681654453 682119012
1968.2 682119012 682573676 682987988 683413088 683847666 684258819 684611082 684923530 685221732 685504317 685760736
1988.6 685760736 685987592 686237991 686540544 686831594 687071800 687266767 687403977 687499344 687544823 687534750
2009 687534750 687471211 687335253 687094986 686824620 686632216 686428607 686139047 685819328 685513139 685191631
2029.4 685191631 684855402 684517980 684182346 683884203 683635294 683407426 683172166 682955921 682816625 682768941
2049.8 682768941 682730317 682681382 682695866 682799995 682964027 683135688 683284044 683448911 683684826 683929443
2070.2 683929443 684096277 684193790 684301019 684447110 684602678 684742212 684889674 685079753 685267389 685454428
2090.5 685454428 685659707 685864389 686101496 686397731 686676621 686889887 687092304 687329292 687599897 687850714
2110.9 687850714 688031375 688172579 688353896 688567638 688747406 688873410 688988566 689138710 689316511 689511418
2131.3 689511418 689693153 689834058 689977705 690162420 690338433 690478206 690647244 690880358 691127360 691354871
2151.7 691354871 691587150 691853166 692174196 692547798 692952394 693389893 693915069 694516897 695118308 695730865
2172.1 695730865 696373343 697026312 697697341 698364973 698985636 699602902 700254619 700883627 701457739 701997042
2192.5 701997042 702539802 703118086 703698456 704216361 704695702 705202103 705741465 706281900 706781149 707236886
2212.9 707236886 707723439 708283901 708821833 709231019 709552646 709893584 710269272 710626066 710919380 711124897
2233.3 711124897 711307347 711559892 711842120 712040365 712174177 712346435 712566495 712779522 712939620 713037312
2253.7 713037312 713145852 713339865 713557780 713706195 713796616 713897586 714024186 714142442 714209616 714198351
2274.1 714198351 714137971 714055419 713947296 713837802 713816702 713924527 714121640 714353502 714572072 714783788
2294.5 714783788 715004444 715252399 715534091 715853810 716276884 716884077 717675388 718479216 719050407 719472885
2314.9 719472885 720171452 721341074 722697735 723710597 724257827 724778235 725464284 725927949 725929737
2333.3 725929737 725763977 725660264 725659370 725496650 724176347 720952392 717870653 717392623 719682097
2351.6 719682097 723248363 726250291 728029728 728449643 727471352 725295544 722294092 718761206 714994729
2370 714994729 711275637 707694888 704274952 701124728 698386371 696087897 694174588 692631841 691498041
2388.3 691498041 690737069 690112174 689342499 688405275 687488854 686710179 685962856 685039878 683950543
2406.7 683950543 682890952 681952775 681037009 679988623 678792953 677609444 676561236 675526679 674305499
2425 674305499 672936618 671642542 670479596 669288933 667968988 666588366 665272415 664070070 662898839
2443.4 662898839 661617815 660224736 658881724 657682061 656523407 655255914 653880358 652544260
2459.7 652544260 651339471 650172710 648910701 647567093 646276891 645117879 644007862 642796516
2476 642796516 641472638 640188754 639023840 637893736 636705995 635464668 634269059 633188307 632142603
2494.4 632142603 631040394 629897416 628793895 627789199 626808941 625728488 624569416 623487353
2510.7 623487353 622537017 621582448 620504975 619349897 618227124 617166579 616107941 614976466 613761365
2529 613761365 612511098 611309588 610186458 609012961 607709765 606402159 605210006 604088724 602919400
2547.4 602919400 601681828 600457609 599299252 598170817 596996486 595766842 594547927 593400955
2563.7 593400955 592307806 591182470 589992940 588798285 587662399 586570561 585444510 584241688
2580 584241688 583033085 581890106 580761731 579587042 578375995 577206254 576122403 575037599 573861480
2598.4 573861480 572585225 571293771 570075750 568850875 567497969 566008329 564458787 562943995
2614.7 562943995 561438739 559842706 558113933 556304395 554536760 552823544 551036835 549145460
2631 549145460 547243953 545392036 543562889 541706860 539826989 537947178 536074460 534204185 532320559
2649.4 532320559 530420125 528537452 526731908 524969757 523140609 521257222 519436419 517696381
2665.7 517696381 515958130 514202714 512470126 510784805 509154141 507558048 505951285 504330873
2682 504330873 502743483 501205146 499675393 498121440 496533513 494907171 493259102 491603315 489912987
2700.4 489912987 488163590 486376375 484580457 482770562 480910361 478993297 477064967 475169897
2716.7 475169897 473296553 471405178 469522655 467715859 466007054 464358658 462734580 461113304
2733 461113304 459474891 457872480 456349999 454869717 453398049 451915413 450432837 448978752 447560400
2751.4 447560400 446164429 444754004 443325460 441917151 440553337 439187735 437750638 436267197
2767.7 436267197 434800535 433318585 431764424 430182785 428584248 426898330 425122410 423308194
2784 423308194 421464413 419542789 417548388 415534377 413466752 411309183 409107417 406872749 404605746
2802.3 404605746 402300894 399872631 397308350 394704282 392094791 389446288 386741906 383975267
2818.7 383975267 381136805 378202647 375132740 371936202 368629128 365161747 361503482 357629210
2835 357629210 353426546 348781288 343567014 337572932 330694139 323164105 315582156 308703691 303132862
2853.3 303132862 299036235 296040595 293461353 290606946 287032723 282680303 277784735 272774577
2869.7 272774577 268216193 264546603 261857808 259997725 258697301 257676154 256731480 255708992
2886 255708992 254486680 253037781 251407176 249595031 247555763 245280370 242787510 240068376 237065300
2904.3 237065300 233675852 229831114 225518510 220742896 215588495 210304350 205205694 200563386
2920.6 200563386 196666211 193742082 191855356 191007420 191202581 192432255 194662258 197800606 201621845
2939 201621845 205785573 209921032 213660404 216728106 219011277 220542222 221516445 222294211 223316371
2957.4 223316371 224944189 227353424 230572298 234573096 239321232 244717628 250587255 256767839
2973.7 256767839 263087928 269362450 275474548 281304538 286694884 291559368 295878381 299626321
2990 299626321 302761555 305240512 307044685 308176428 308651060 308518082 307864219 306839406 305599272
3008.3 305599272 304240465 302865148 301551729 300234765 298768222 297054291 295024991 292706728
3024.7 292706728 290261447 287842959 285509437 283225268 280913174 278500795 275968224 273370028
3041 273370028 270739496 268079966 265388101 262654871 259944141 257286668 254624218 251961499 249370232
3059.3 249370232 246912584 244595781 242411003 240394607 238548279 236822560 235182106 233592570
3075.6 233592570 232054055 230573460 229111105 227733210 226530522 225428015 224362627 223339736
3092 223339736 222323880 221296206 220273301 219237432 218154728 217011377 215804532 214548573 213254184
3110.3 213254184 211929381 210570469 209166676 207739249 206274062 204721302 203098238 201462433
3126.6 201462433 199822068 198136240 196383551 194584146 192755178 190937117 189171106 187417552
3143 187417552 185587198 183684811 181812227 179973677 178120494 176251441 174369097 172476143 170591831
3161.3 170591831 168738946 166912854 165099367 163295686 161503583 159699976 157870889 156070575
3177.6 156070575 154333308 152603209 150861084 149151698 147482634 145838693 144198701 142581418
3193.9 142581418 141049832 139578760 138107702 136662290 135261685 133884549 132551327 131273910
3210.3 131273910 130001664 128712878 127438799 126185447 124923095 123653874 122396320 121152572
3226.6 121152572 119947389 118763581 117521703 116174340 114773698 113392338 112003192 110560738
3242.9 110560738 109075725 107571520 106050394 104489297 102883503 101296373 99760585 98221704
3259.2 98221704 96665852 95145270 93687177 92294708 90988152 89796126 88707469 87675333
3275.5 87675333 86696766 85807607 85045420 84393308 83805151 83289564 82872428 82564153 82331307 82107529
3295.9 82107529 81890099 81741259 81681728 81669882 81660561 81666119 81746884 81912383 82066081 82140863 82212649
3318.4 82212649 82364723 82563952 82750149 82904331 83032630 83201177 83412245 83605371 83803289 84011361
3338.8 84011361 84150814 84186114 84190667 84233068 84323339 84436126 84510043 84501661 84461279 84479190 84577009 84683001
3363.2 84683001 84743731 84774777 84777325 84744036 84704369 84716029 84769234 84795021 84797464 84846616 84972575 85171215
3387.7 85171215 85381635 85480049 85458457 85455664 85580058 85813046 86030960 86160950 86312599 86554475
3408.1 86554475 86830221 87117970 87426782 87710954 87957166 88250414 88632479 89122295 89734904 90390898
3428.5 90390898 90964742 91529205 92207976 92874013 93435049 94032407 94750553 95514685 96278712 97065121
3448.9 97065121 97935736 98868579 99814616 100798503 101797774 102736779 103711493 104876123 106113829
3467.2 106113829 107225873 108186826 109158210 110301368 111644804 113040760 114334494 115593992 116953626
3485.6 116953626 118421338 119915329 121358454 122753441 124216408 125771657 127376974 128984779
3501.9 128984779 130503908 132009298 133658335 135401011 137161344 138943762 140696898 142446160
3518.2 142446160 144281298 146240070 148213372 150131375 152102306 154192463 156355709 158576995
3534.5 158576995 160813257 163001567 165254235 167649403 170117438 172579825 175109789 177730501
3550.9 177730501 180400178 183152467 185988307 188910753 191923216 194971308 198011771 201243937
3567.2 201243937 204757795 208333939 211912721 215598047 219436795 223447487 227558732 231633291
3583.5 231633291 235665068 239852101 244400173 249047518 253631175 258300006 263122052 268021792
3599.8 268021792 272959590 277885526 282703459 287557721 292579830 297747403 303104490 308504492
3616.1 308504492 313921154 319668978 325504214 331048518 336205065 341403365 347278565 353184640
3632.4 353184640 358803600 364353597 369853675 375303626 380729645 386001915 390994489 396134079
3648.8 396134079 401874900 407597095 412800938 417999536 423450828 428707808 433635980 438397288
3665.1 438397288 442837983 446935683 451264441 455491573 459267169 463381141 467739791 471863061
3681.4 471863061 475851685 479618937 482922256 485905558 489087939 492466122 495690584 498632908
3697.7 498632908 501197219 503482461 505954981 508517981 510654211 512255311 513799310 515968323
3714 515968323 518476248 520793259 522844255 524703741 526382625 528045237 530005217 531886935 533173561
3732.4 533173561 534083128 535276651 537079513 539013326 540118039 540560901 541891992 543495059 544424832
3750.7 544424832 545623839 547447145 549133360 550446272 551814198 553287387 554551065 555612743
3767.1 555612743 556536734 557626247 559104860 560591102 561750174 562619090 563555419 564608872 565628529
3785.4 565628529 566714406 567918718 569120944 570057750 570735753 571546793 572208881 572632670 573693752
3803.8 573693752 574821949 575599968 576802909 578232944 579071820 579351068 579896629 580345273 580774605
3822.1 580774605 581919611 583152890 584120810 584877789 585536480 586261511 586670578 586802423 587388694
3840.5 587388694 588324964 589272738 590305448 591384351 591903150 591131032 590680897 591970861 593419254
3858.8 593419254 594228566 594588101 595027626 595614851 595795631 595986784 596676946 597555757 598411322 598816872
3879.2 598816872 599051893 599494100 599733949 600135565 600706041 600985110 601457834 602173984 602486491 602388203
3899.6 602388203 602295280 602368534 602844536 603644609 604296267 604693234 604948699 605034053 605069041 605267346
3920 605267346 605514944 605694115 605977893 606298804 606350780 606364608 606749117 607267678 607582033 607684672
3940.4 607684672 607737124 607950985 608244181 608464479 608709455 609016001 609319568 609577060 609786332 609954298
3960.8 609954298 610120118 610295415 610410631 610522926 610717714 610911310 611043572 611199737 611417830 611680031
3981.2 611680031 611935437 612098098 612230361 612450838 612713397 612897158 613031387 613260925
3997.5 613260925
##END=$$ End of the data block
