##TITLE=G08-51-SE $$ Begin of the data block
##JCAMP-DX=5.00 $$ ACD/SpecManager v 10.08
##SPECTROMETER/DATA SYSTEM=Alpha
##DATE=22 Oct 2013 10:53:20
##DATA TYPE=INFRARED SPECTRUM
##DATA CLASS=XYDATA
##ORIGIN=
##OWNER=
##NPOINTS=1765
##FIRSTX=399.75695801
##LASTX=3997.56933594
##MAXX=3997.56933594
##MINX=399.75695801
##MAXY=0.72886956
##MINY=0.06460503
##XFACTOR=1.0000000000
##YFACTOR=1.000000000000000e-9
##FIRSTY=0.29195064
##DELTAX=2.03957629
##XUNITS=1/CM
##YUNITS=ARBITRARY UNITS
##XYDATA=(X++(Y..Y))
399.8 291950643 288367182 285830259 284633040 284238636 284421116 284863442 284980983 284818977 284402579
418.1 284402579 283372521 281832814 279978454 278131813 276513368 274890661 273206204 271849900
434.4 271849900 271072000 270891964 271726072 273543119 275356472 276480287 276897788 276735693 276178777
452.8 276178777 275323749 273961574 272056907 269835889 267390251 264883816 262352049 259754419 257135272
471.1 257135272 254691303 252647877 250868767 249296576 248112395 247199208 246241197 245141581 243911609
489.5 243911609 242468402 240648553 238550261 236338869 233910143 231228098 228399321 225406751
505.8 225406751 222328678 219470546 216802821 214121073 211498097 209144518 207210347 205685720
522.1 205685720 204648063 204207569 204184920 204450220 205125332 206407711 208550498 211423054 214255378
540.5 214255378 216346905 217549905 218023211 217944369 217392340 216414467 215136364 213663384 211960942
558.8 211960942 210011661 207870409 205582708 203195661 200883150 199125186 198343918 198519275 199522406
577.2 199522406 201358870 203939572 206916764 209910914 212618083 214685649 215974137 216576144 216742903
595.6 216742903 216836140 216951251 216977030 216954604 216995329 217143863 217421234 217816323 218363583 219058678
616 219058678 219908088 221143022 222937450 225186273 227741957 230485633 233185872 235611230 237626836
634.3 237626836 239348784 241044015 242717713 244151488 245308638 246295899 247159258 247874320 248352900
652.7 248352900 248546377 248613924 248792812 249022678 249155223 249624506 251158088 252898604 253410012 254053622
673.1 254053622 255378455 257074833 258807927 260402679 261753559 262766272 263475776 263849705 263719529
691.4 263719529 262980759 261728942 260378033 259591132 259698868 260591269 262110859 264211565 266893744
709.8 266893744 270069093 273605615 277507365 281938672 286939859 292229623 297531515 302770972
726.1 302770972 307841778 312553316 316570550 319673955 322031379 323885441 325259149 325985014 326078743
744.4 326078743 325785667 325359344 324754536 323719144 322207868 320402503 318585783 317130923 316352487
762.8 316352487 316478580 317928016 321030974 325692564 331460923 337801129 344353348 350820422 356814682
781.2 356814682 361941695 366057873 369424880 372417092 375082582 377458215 379905134 382904381
797.5 382904381 386621118 390678108 394494057 397821993 400729060 403109670 404827327 405923545
813.8 405923545 406473190 406467050 405823559 404378980 401965886 398671538 394889414 391060233 387323529
832.1 387323529 383519411 379553705 375548184 371679544 368117422 364935547 362220913 360084921
848.5 360084921 358437449 357139140 356140316 355433434 355283409 356576264 360283911 366421342 374115616
866.8 374115616 382349223 390154481 396629095 401016295 402790219 401881039 398611784 393493950 387176901
885.2 387176901 380263507 373145968 366114765 359423995 353178263 347194880 341090918 334623903
901.5 334623903 327711403 320278466 312378645 304240167 296144724 288380384 281269461 275200844
917.8 275200844 270542324 267374188 265390813 264108062 263115436 262277573 261634350 261150271 260717213
936.2 260717213 260202259 259467900 258209288 255668849 250955701 243806645 234861284 225122064 215257421
954.5 215257421 205478758 195904747 186689034 177813888 169206530 160927907 153161138 146141231
970.8 146141231 140041828 134932935 130819440 127679378 125427186 123899087 122872822 122101307 121385686
989.2 121385686 120672710 120010950 119455002 119046301 118793599 118696183 118687421 118570372 118124709 117316864
1009.6 117316864 116308063 115239255 114142142 113046616 111974768 110835023 109550342 108156599
1025.9 108156599 106732562 105355106 104054004 102782063 101455554 100053318 98670304 97407535
1042.2 97407535 96294910 95337600 94579525 94100311 93945250 94115473 94575010 95294945 96269928 97523056
1062.6 97523056 98985247 100312799 100999460 100764297 99924035 99177524 99070609 99808007 101344347
1081 101344347 103521161 106144972 109034002 112059884 115094170 117981546 120603286 122879341 124739975
1099.3 124739975 126144171 127209291 128231511 129481122 131052092 132898167 134949863 137124553
1115.6 137124553 139243513 141111016 142692581 144118860 145602822 147355288 149494782 151925042
1132 151925042 154312149 156312391 157722458 158413753 158424199 158015564 157419890 156783924 156279936 156034142
1152.4 156034142 156100079 156620532 157820463 159741715 162242249 165199637 168554425 172322527 176594794
1170.7 176594794 181496650 187100247 193289831 199842513 206550792 213189930 219549537 225466534
1187 225466534 230700076 234920889 237894371 239605635 240264684 240169942 239558235 238609523 237561643
1205.4 237561643 236704126 236183435 235902056 235669360 235339671 234846428 234171167 233230606 231923416
1223.7 231923416 230285436 228483438 226664633 224885091 223202854 221782297 220799148 220347270 220473096
1242.1 220473096 221170112 222387984 224059165 226093903 228362381 230741680 233143866 235529020
1258.4 235529020 237891078 240213677 242480919 244722977 246997133 249222338 251199156 252792686
1274.7 252792686 254031301 255080760 256117970 257209510 258327842 259417653 260408908 261186868 261528671
1293.1 261528671 261219949 260213375 258678973 256832033 254792184 252649426 250509799 248531282
1309.4 248531282 246900335 245751694 245093405 244893268 245123625 245577678 245784014 245292053 243944183
1327.8 243944183 241904438 239522576 237129837 234953627 233116627 231756732 230913013 230355680 229787007
1346.1 229787007 229044154 228064418 226822302 225302145 223520786 221485808 219046235 216021121 212497219
1364.5 212497219 208745793 205089614 202019498 199373931 196542755 193429008 190104902 186566994
1380.8 186566994 183034822 179888740 177433744 175963953 175338894 175013646 174715117 174573720 174726173
1399.1 174726173 175286204 176280037 177664265 179303393 181050152 182890445 184797734 186775818 188944668
1417.5 188944668 191528618 194230661 196801990 199200839 201114342 202327788 202823833 202710405 202031970
1435.9 202031970 201270148 201054767 201220050 201501429 201845527 202218309 202510402 202688470 203100875 204471052
1456.2 204471052 207170293 210172594 213025883 216096506 219620630 223804370 229485676 237569466
1472.6 237569466 246412814 253862709 259607136 263523817 265590757 265797287 264091253 260296404
1488.9 260296404 254878610 249186113 242917821 235352054 227849513 221352354 215330422 207777366
1505.2 207777366 197253302 188075647 180872649 174059153 168194279 163987145 161394492 159259439
1521.5 159259439 157103911 154998124 152772203 150769785 148911521 147052169 145725369 144847691
1537.8 144847691 143971279 143697351 144419760 145822212 147788614 150413752 153635815 157248378 161029160
1556.2 161029160 165622205 171111971 175382093 178958580 182454675 185777307 188964814 191556543
1572.5 191556543 193578750 195373297 196807504 197761402 198257804 198416963 198279366 197784722 196784317
1590.9 196784317 195227563 193087295 190421209 187182531 183198452 178485096 173210591 167381808
1607.2 167381808 160858408 153961971 147102535 139549896 130747184 122923672 115694612 107479349
1623.5 107479349 99529982 92488959 86016834 80510907 75558171 70539221 67033224 65416411
1639.8 65416411 64743787 64605027 64899169 65630563 66502534 67541063 69136076 70955805 72840244
1658.2 72840244 75182162 78207754 81801675 85451931 89621842 94641596 99642746 105031483
1674.5 105031483 111136913 117158875 123081833 129966751 139098749 148357257 157035500 166929111
1690.8 166929111 177758142 191177875 207363814 224483669 244034901 261255085 276133150
1705.1 276133150 291070312 304293036 315708518 325827777 335064650 344206899 352583140 359356314
1721.4 359356314 365289122 370799243 375685543 380101055 384149939 388519347 393484533 398206443
1737.7 398206443 403158516 408810228 414959878 421620578 428859323 437094659 446231008 455047578
1754 455047578 463651210 472404003 480912209 489620894 498073786 505725205 512941599 519759297 526640058
1772.4 526640058 533427358 539300501 544448018 549299419 553939104 558324277 562444806 566155553
1788.7 566155553 569506645 573054671 576750338 580059707 583003998 585978448 589106262 592119157
1805 592119157 594863713 597412884 599999845 602649331 605197251 607608080 609980464 612256646 614355028
1823.4 614355028 616431415 618460298 620400906 622503102 624648631 626538694 628272355 629930496
1839.7 629930496 631340027 632608712 634193361 635937929 637489557 638888419 640220881 641541779
1856 641541779 642807245 643990397 645140350 646266043 647224069 648072064 649183214 650502145 651730299
1874.4 651730299 652835786 653923988 655011594 656093001 657192230 658252537 659218252 660232127
1890.7 660232127 661304593 662292421 663273752 664250493 665119469 665889680 666669786 667439103 668114185
1909 668114185 668787062 669506192 670162439 670712769 671315074 671934843 672530890 673229277 673927486 674499989
1929.4 674499989 674991608 675462008 675925851 676398337 676795900 677073658 677435577 677993596 678568244 679048896
1949.8 679048896 679484785 679960310 680521548 681083322 681587279 682068765 682528138 682950556 683403134 683863759
1970.2 683863759 684274673 684697092 685145378 685561836 685904264 686198056 686466396 686742008 687029660 687295675
1990.6 687295675 687568188 687882304 688186407 688429534 688612223 688722670 688798785 688865662 688884854 688807607
2011 688807607 688637257 688410342 688199937 688039601 687825620 687518001 687184572 686880469 686573803 686240435
2031.4 686240435 685893834 685554028 685250044 684984028 684744060 684525371 684342146 684201598 684109509 684044361
2051.8 684044361 684020996 684080303 684211195 684384584 684560776 684703827 684843600 685050309 685295761 685500026
2072.2 685500026 685636520 685760319 685910761 686053157 686154604 686263144 686444998 686675429 686922491 687148750
2092.6 687148750 687333763 687540293 687828422 688123345 688337624 688522935 688761294 689048588 689306080 689496338
2113 689496338 689657688 689848721 690066516 690247297 690355361 690448999 690595806 690790534 691006720 691199541
2133.4 691199541 691357195 691514611 691684484 691836655 691962540 692123234 692359328 692619979 692853093 693078518
2153.8 693078518 693347454 693688869 694077492 694483042 694913507 695430815 696049213 696685374 697302043 697915137
2174.2 697915137 698557436 699253082 699938059 700548828 701131999 701757193 702415824 703041971 703599393 704120874
2194.6 704120874 704665124 705248654 705806315 706305563 706797183 707308710 707816184 708299756 708772182 709278762
2215 709278762 709836364 710362732 710772157 711093724 711439967 711847842 712233484 712529480 712739170 712926567
2235.4 712926567 713163614 713423371 713616729 713762820 713944733 714164376 714360595 714496374 714584649 714674294
2255.8 714674294 714838326 715050280 715212703 715318799 715417624 715542495 715686560 715774000 715760231 715701222
2276.1 715701222 715619564 715489030 715356350 715337455 715453565 715645730 715867102 716058612 716216683 716400743
2296.5 716400743 716666162 716987252 717309356 717696786 718274236 719025016 719737172 720214486 720590830 721285224
2316.9 721285224 722473741 723774910 724652410 725163698 725765705 726520181 726947904 726794839 726463258
2335.3 726463258 726282299 726290643 726167500 724896669 721766472 718805254 718390048 720597029 723957896
2353.6 723957896 726801217 728499234 728869557 727893651 725726306 722740650 719322205 715738595 712156177
2372 712156177 708667517 705340028 702300131 699675262 697456658 695605099 694112718 692976356 692162812
2390.4 692162812 691488802 690703034 689767003 688863814 688105047 687357545 686430037 685357809 684330225
2408.7 684330225 683416963 682488143 681407750 680216730 679061592 677994847 676898479 675649285 674298346
2427.1 674298346 673019111 671873391 670731843 669439495 668033779 666703641 665497005 664275408
2443.4 664275408 662942350 661559641 660256684 659069180 657880843 656566322 655174851 653869033
2459.7 653869033 652696252 651536465 650273919 648943245 647675753 646513879 645364881 644119740
2476 644119740 642799616 641530752 640367389 639246762 638067007 636803687 635580957 634513140 633502722
2494.4 633502722 632390499 631206453 630088031 629084587 628123999 627090871 625963032 624873936
2510.7 624873936 623912990 622947156 621831417 620633721 619496346 618453264 617426515 616301656 615065038
2529 615065038 613820136 612644136 611515522 610325456 609027624 607739925 606558383 605423629 604223073
2547.4 604223073 602965653 601748466 600588799 599431098 598228753 597004294 595834374 594750404
2563.7 594750404 593682289 592533350 591308355 590107858 588991880 587911069 586776733 585553646
2580 585553646 584322155 583174944 582066715 580903471 579671204 578472257 577392459 576325536 575152099
2598.4 575152099 573883474 572591066 571348846 570100844 568748236 567309558 565830708 564318299
2614.7 564318299 562754333 561117709 559399664 557643533 555915475 554196358 552389920 550479531
2631 550479531 548566461 546715438 544874609 542964458 541022599 539152920 537339747 535499036 533616781
2649.4 533616781 531714618 529825270 528007030 526240230 524430394 522564948 520720541 518950522
2665.7 518950522 517233908 515526414 513804674 512083888 510423541 508824289 507218182 505602419
2682 505602419 504025877 502478838 500925481 499371618 497797906 496170580 494515121 492846787 491127849
2700.4 491127849 489360124 487590045 485822648 484013855 482123971 480186373 478278816 476416051
2716.7 476416051 474539757 472650290 470802307 469011515 467297792 465645283 464000165 462355703
2733 462355703 460742205 459175646 457632184 456114948 454638839 453154713 451659739 450219810 448828042
2751.4 448828042 447436333 446033388 444621027 443210930 441822648 440436214 439008743 437543511
2767.7 437543511 436059296 434552789 433019429 431450933 429820299 428119987 426359534 424549937
2784 424549937 422695488 420758605 418748498 416739464 414705276 412565947 410354942 408132315 405881822
2802.3 405881822 403558433 401125133 398587704 395988911 393356651 390693218 387985796 385204077
2818.7 385204077 382328033 379355878 376266658 373056680 369732141 366245270 362571895 358699024
2835 358699024 354521543 349891633 344638795 338577747 331649125 324101239 316532761 309674144 304086298
2853.3 304086298 299947470 296927005 294308633 291397601 287807792 283463091 278571516 273593664
2869.7 273593664 269068450 265389264 262667954 260767519 259447187 258430719 257469207 256417632
2886 256417632 255186260 253735065 252097219 250290841 248282030 246024400 243505627 240754783 237733871
2904.3 237733871 234340772 230507374 226183251 221390098 216253832 210967764 205816180 201137647
2920.6 201137647 197234124 194295228 192410141 191604123 191844866 193087175 195289806 198398441 202232897
2939 202232897 206425816 210576758 214322165 217391282 219687954 221246198 222250715 223059431 224099651
2957.4 224099651 225708842 228079617 231304422 235391021 240241215 245682523 251563519 257760823
2973.7 257760823 264113158 270416021 276504815 282286525 287696570 292658657 297067285 300845891
2990 300845891 303992152 306500196 308315247 309431970 309895396 309752733 309115142 308137834 306938440
3008.3 306938440 305614531 304254502 302922457 301608801 300185859 298514009 296498924 294174731
3024.7 294174731 291744471 289331466 286961049 284674615 282398641 280001819 277468145 274848104
3041 274848104 272181034 269506246 266810715 264064282 261333495 258657694 255996019 253347337 250765741
3059.3 250765741 248322502 246018246 243801445 241746023 239941552 238275930 236621186 234995127
3075.6 234995127 233437672 231949314 230532542 229204401 227961034 226777673 225680590 224679559
3092 224679559 223680511 222623721 221568599 220540404 219472021 218333229 217117980 215844631 214572445
3110.3 214572445 213274837 211904168 210480064 209014788 207511574 205978617 204397604 202754408
3126.6 202754408 201081827 199387804 197642639 195843220 193986714 192127571 190330476 188544333
3143 188544333 186702460 184816733 182936698 181091487 179266199 177403718 175499707 173602328 171721637
3161.3 171721637 169849724 167997450 166168019 164314687 162440926 160607591 158806831 157030746
3177.6 157030746 155303374 153581291 151834145 150103077 148417503 146773845 145149857 143534243
3193.9 143534243 141950309 140418768 138931334 137493610 136102170 134731501 133387923 132086262
3210.3 132086262 130808473 129535109 128265396 127009958 125776410 124534406 123289667 122065619
3226.6 122065619 120816171 119508952 118171625 116831973 115477219 114078157 112636723 111176953
3242.9 111176953 109707467 108233474 106743477 105197720 103601702 102018267 100460999 98905265
3259.2 98905265 97365864 95855542 94393924 93006708 91671854 90398684 89244142 88199139
3275.5 88199139 87232925 86387865 85660562 84961861 84307179 83803393 83451107 83148174 82877547 82684554
3295.9 82684554 82531504 82396194 82312539 82269967 82249388 82277492 82344308 82421958 82525991 82637705 82732476
3318.4 82732476 82863390 83050087 83244517 83437808 83625048 83792634 83946444 84104754 84273644 84432408
3338.8 84432408 84557861 84649913 84710166 84733389 84763288 84824540 84871806 84884614 84903948 84955357 85045248
3361.2 85045248 85147522 85196994 85187443 85170329 85166357 85163534 85172616 85199162 85232027 85262053 85297950 85376441
3385.7 85376441 85541658 85733280 85845336 85904114 85980520 86107798 86284332 86454496 86572178 86704165
3406.1 86704165 86921580 87202162 87495297 87794445 88102356 88396929 88714488 89106962 89587100 90162128
3426.5 90162128 90818785 91456860 92071727 92734091 93376867 93959242 94570480 95279701 96068956 96886314
3446.8 96886314 97680122 98503038 99398300 100332938 101312779 102309391 103233017 104179770 105304413 106508426
3467.2 106508426 107644796 108676001 109732263 110948682 112309948 113693446 114970677 116211742
3483.6 116211742 117569700 119038053 120529130 121987939 123427726 124952078 126546726 128143355
3499.9 128143355 129734844 131274253 132776260 134365663 136082441 137893483 139742404 141521141
3516.2 141521141 143259391 145074338 147025183 149025992 150998399 153004453 155072838 157199159
3532.5 157199159 159457564 161796317 164078087 166406214 168844014 171307370 173755229 176261321
3548.8 176261321 178851098 181509390 184296384 187199250 190160677 193183646 196234405 199284598
3565.1 199284598 202590749 206224754 209885359 213500127 217183501 220980123 224968255 229172662
3581.5 229172662 233403742 237543851 241783231 246331587 250962228 255572796 260274857 265073866
3597.8 265073866 269942939 274923056 279945344 284815133 289681584 294782758 300068140 305490404
3614.1 305490404 310894400 316284925 322017133 327851802 333415449 338666588 343983084 349863529
3630.4 349863529 355722725 361321032 366849631 372332186 377837747 383353710 388666093 393673062
3646.7 393673062 398788244 404457182 410167634 415448457 420700938 426094979 431268007 436181158
3663 436181158 440978825 445427924 449507892 453888237 458220601 462036908 466119438 470458657 474572122
3681.4 474572122 478541166 482328355 485681713 488637865 491745055 495111287 498397142 501392126
3697.7 501392126 503970444 506269813 508698106 511189461 513348579 515040636 516644180 518828213
3714 518828213 521305203 523562372 525602996 527511179 529221117 530853391 532742977 534564853 535853982
3732.4 535853982 536815763 538012683 539758921 541653872 542772233 543267488 544631541 546210885 547091603
3750.7 547091603 548275650 550160289 551942647 553245068 554495037 555916786 557212651 558324099
3767.1 558324099 559318662 560448587 561896563 563323736 564430058 565272808 566219330 567325413 568421125
3785.4 568421125 569573402 570780873 571923435 572827458 573511422 574338615 575031102 575494528 576575696
3803.8 576575696 577657878 578361213 579534829 580964684 581798792 582106173 582727849 583200455 583576679
3822.1 583576679 584683359 585909367 586894989 587703049 588409364 589189410 589660168 589774609 590265930
3840.5 590265930 591095984 592009664 593117177 594285727 594827056 594021082 593529761 594778121 596213639
3858.8 596213639 597070336 597486436 597924948 598486662 598663211 598852813 599524140 600370765 601243675 601727009
3879.2 601727009 601990700 602408111 602690816 603163302 603666723 603778124 604157925 604892969 605320156 605361283
3899.6 605361283 605284750 605288982 605696678 606452227 607120693 607554793 607801139 607836962 607859015 608127236
3920 608127236 608443439 608623922 608878851 609231114 609411657 609475017 609712481 610082030 610401630 610607386
3940.4 610607386 610707581 610866129 611086488 611251771 611474395 611799657 612144649 612439036 612653255 612806320
3960.8 612806320 612951159 613137782 613306165 613442063 613610148 613798618 613986850 614198148 614414692 614601910
3981.2 614601910 614762604 614905119 615059793 615282536 615552545 615790486 615988612 616189897
3997.5 616189897
##END=$$ End of the data block
