##TITLE=G08-51-CE $$ Begin of the data block
##JCAMP-DX=5.00 $$ ACD/SpecManager v 10.08
##SPECTROMETER/DATA SYSTEM=Alpha
##DATE=22 Oct 2013 10:53:20
##DATA TYPE=INFRARED SPECTRUM
##DATA CLASS=XYDATA
##ORIGIN=
##OWNER=
##NPOINTS=1765
##FIRSTX=399.75695801
##LASTX=3997.56933594
##MAXX=3997.56933594
##MINX=399.75695801
##MAXY=0.81879807
##MINY=0.28140050
##XFACTOR=1.0000000000
##YFACTOR=1.000000000000000e-9
##FIRSTY=0.54656130
##DELTAX=2.03957629
##XUNITS=1/CM
##YUNITS=ARBITRARY UNITS
##XYDATA=(X++(Y..Y))
399.8E46561301k301991p39753j064897k007246q19564J317143J080275o75917j235306
418.1E40114045m51207p55548k065897j989365q24392q37266j944185k034604n74589
436.5E28636992M86433M40062Q04007J723230J333415j99020m92871L44813n8830j866042
456.9E31152189k602160j648009j367807k146006k583981k035737j590550k165734
473.2E15012205k392352j331747l91960q54492j473248p30038p1764j001596k060413
491.5E04704595j687885j045465j734197k855629k737463j940757k235591l098339
507.9D87369269k889335k198428k291351k779037k540469j589507j185745j354903
524.2D70540494q69543J95176O48975M91887Q61705K041578K737552K182007J362413
$$ plain form
399.8 546561301 544259310 543519557 542454660 540447414 539627850 540944993 542025268 541349351 540114045
418.1 540114045 539662838 538907290 536841393 534852028 534027636 533190370 531246185 529211581 528636992
436.5 528636992 529123425 529563487 530367494 532090724 533424139 533225119 532732248 533077061 533018231 531152189
456.9 531152189 528550029 526902020 525534213 523388207 520804226 518768489 517177939 515012205
473.2 515012205 512619853 511288106 510896146 510041654 508568406 507838368 507766604 506765008 504704595
491.5 504704595 503016710 501971245 500237048 497381419 494643956 492703199 490467608 487369269
507.9 487369269 484479934 482281506 479990155 477211118 474670649 473081142 471895397 470540494
524.2 470540494 469670951 469866127 470515102 471006989 471868694 473910272 476647824 478829831 480192244
542.5D80192244J113951P85738j90883r73672q50588o55890j249760j915962j749783
560.9D74505395j453638j974851k661228k363921j333624n62131j38015O73086J960635
579.2D66651708K700329K603441K555192K697468K145349R89408L26663M14401M93497
597.6D81577456J17004j93566M4614L69936K62559M7475K07781O05196P54237P74831
618D84567523J369089K346873K703071K470732K570450K863169K564519J815558J559078
636.3E04830062J873970J868904J384914J142800J333773J373231Q54493K82824L61085
654.7E15306056O53028M24802M2677K59638Q78930J368046J184523P55012J222015
673.1E22094727J634240J395881J256406J638472J710475J039445M89533N20408L77596
$$ plain form
542.5 480192244 481306195 482091933 481901050 480927378 480076790 479420900 478171140 476255178 474505395
560.9 474505395 473051757 471076906 468415678 466051757 464718133 464156002 464017987 464691073 466651708
579.2 466651708 469352037 471955478 474510670 477208138 479353487 480342895 480669558 481083959 481577456
597.6 481577456 481694460 481500894 481545508 481915444 482178003 482225478 482433259 483038455 483792692 484567523
618 484567523 485936612 488283485 490986556 493457288 496027738 498890907 501455426 503270984 504830062
636.3 504830062 506704032 508572936 509957850 511100650 512434423 513807654 514662147 514944971 515306056
654.7 515306056 515959084 516383886 516426563 516686201 517565131 518933177 520117700 520872712 522094727
673.1 522094727 523728967 525124848 526381254 528019726 529730201 530769646 531259179 531779587 532157183
691.4E32157183l73066j045286j011253m43101J03772O46949J530170K349913K536357
709.8E36451638K417147K759457L523945L931404L859519L972173M378855M437924
726.1E65732062L939628L437162L177702K745867J929104J218439J051545R43601L95775
744.4E84570885j95980k56062j09792l75032r36866j162946q79884o45101n73695j251
764.8E79434276J259744K469778L215372L883422M682004N062104M688978M087090
781.2F08782768L672064L254950K614796K003312J825571K012491K057672K056658
797.5F28280282K488375L028691L003239K458573K067327K009690J706183R62138M68433
815.8F46472931M38571J53363p39396j592994j781583j798093k217769k550543k350151
$$ plain form
691.4 532157183 531784117 530738831 529727578 529284477 529388249 530035198 531565368 533915281 536451638
709.8 536451638 538868785 541628242 545152187 549083591 552943110 556915283 561294138 565732062
726.1 565732062 569671690 573108852 576286554 579032421 580961525 582179964 583231509 584175110 584570885
744.4 584570885 584374905 584118843 584009051 583634019 582697153 581534207 580654323 580009222 579435527 579434276
764.8 579434276 580694020 583163798 586379170 590262592 594944596 600006700 604695678 608782768
781.2 608782768 612454832 615709782 618324578 620327890 622153461 624165952 626223624 628280282
797.5 628280282 630768657 633797348 636800587 639259160 641326487 643336177 645042360 646004498 646472931
815.8 646472931 646911502 647064865 646325469 644732475 642950892 641152799 638935030 636384487 634034336
834.2F34034336k087653k287805k601028k325832j708210j455426j483381j227260
850.5F18857741o60240l21091m18484k57134R92656K877831M248917M958272N430997
868.9F35709465N314946M169583K545893J167596r4533j666010l184616l990352m200399
887.2F35771573m380048m641592m641533m304588m107356m348457m689276m923463
903.5E99735260n326331n957126o409824o374240o051242n726636n153835m019499
919.8E54716527k687871j757860j300335r56595n78225l80516m09782m05550k84314
938.2E45955479l34084r11891k194524m077852o184161q025646r166896r521127r545684
956.6D95993614r709149r918631r926319r789526r660334r462326q927435p997751
$$ plain form
834.2 634034336 631946683 629658878 627057850 624732018 623023808 621568382 620085001 618857741
850.5 618857741 618197501 617876410 617457926 617200792 618193448 621071279 625320196 630278468 635709465
868.9 635709465 641024411 645193994 647739887 648907483 648812950 647146940 643962324 639971972 635771573
887.2 635771573 631391525 626749933 622108400 617803812 613696456 609347999 604658723 599735260
903.5 599735260 594408929 588451803 582041979 575667739 569616497 563889861 558736026 554716527
919.8 554716527 552028656 550270796 548970461 548013866 547435641 547055125 546645343 546239793 545955479
938.2 545955479 545621395 544709504 542514980 538437128 532252967 524227321 515060425 505539298 495993614
956.6 495993614 486284465 476365834 466439515 456649989 446989655 437527329 428599894 420602143
972.9D20602143o943315n888015m704059l466814k474308j876027j525223j256913
989.2C92467469j114041j115471j056820p63088l86954k01612k15173l48956o79493
1007.5C86585861j193404j694053j960427j933902j825303j882076j980991j913547
1023.9C72202158j876652k032131k128661k016425j961827k115667k282053k218992
1040.2C55569750j968890j785845j650780j282752o50644n6416M34101R73790J483500
1058.5C51065814J815081J999855K112806J939893R88781n94735j721591j614391n47827
1076.9C55443686P86871K041489L151059L971487M365713M441619M387438M226476
1093.2C82815838L843218L226638K577603J996159J548022J425296J677037K086311
$$ plain form
972.9 420602143 413658828 407770813 403066754 399599940 397125632 395249605 393724382 392467469
989.2 392467469 391353428 390237957 389181137 388418049 388031095 387829483 387614310 387265354 386585861
1007.5 386585861 385392457 383698404 381737977 379804075 377978772 376096696 374115705 372202158
1023.9 372202158 370325506 368293375 366164714 364148289 362186462 360070795 357788742 355569750
1040.2 355569750 353600860 351815015 350164235 348881483 348230839 348174423 348608524 349582314 351065814
1058.5 351065814 352880895 354880750 356993556 358933449 359922230 359327495 357605904 355991513 355443686
1076.9 355443686 356230557 358272046 361423105 365394592 369760305 374201924 378589362 382815838
1093.2 382815838 386659056 389885694 392463297 394459456 396007478 397432774 399109811 401196122
1109.5D01196122K429545K636284K703368K629012K387822K027333J736104J741380
1125.8D19486970K088010K600253K938270K847135K399802J662791P33525n5432n19217
1144.2D34182107p47829q50559q25971n59509j0252P04706J494288K331466L131002
1162.6D38849449L744304M132629M494369N050123N733370O299228O646544O856173
1178.9D81806189O906092O667137O203622N632639M859805L804922K600372J474082
1195.2E19954860N72980j19329o47306r30488r22621p68959n81742l89695k50995k84493
1215.6E15632212n09858p53522r54628j196325j492619j731992j792073j714766j594246
1233.9E03892183j358628r55582m52518Q0168O13570J168669J648008J933992K080262
$$ plain form
1109.5 401196122 403625667 406261951 408965319 411594331 413982153 416009486 417745590 419486970
1125.8 419486970 421574980 424175233 427113503 429960638 432360440 434023231 434756756 434701324 434182107
1144.2 434182107 433434278 432583719 431757748 431198239 431187987 431892693 433386981 435718447 438849449
1162.6 438849449 442593753 446726382 451220751 456270874 462004244 468303472 474950016 481806189
1178.9 481806189 488712281 495379418 501583040 507215679 512075484 515880406 518480778 519954860
1195.2 519954860 520527840 520408511 519761205 518830717 517908096 517139137 516557395 516167700 515916705 515632212
1215.6 515632212 515122354 514368832 513414204 512217879 510725260 508993268 507201195 505486429 503892183
1233.9 503892183 502533555 501577973 501125455 501205623 501819193 502987862 504635870 506569862 508650124
1252.3E08650124K187431K238095K210200K155900K114653K124965K168358K134800
1268.6E25984526J990437J793146J507402J175761R56476Q98719R17196R51350R70959
1287E37145972Q91388O60479K64227k58803q15749j279712j621962j847267j941085
1305.3E31197488j922965j774549j507223j130700o61790j55330K73824M58598K68698
1323.7E25046051k89381j045227j699805k084017k209544k059400j727164j283646
1340E12647867q23736n60284n43892o89685r58085j268506j545191j788795k004564
1358.3E02465129k371252k984255l520608l782660l759325l266602k955139l220588
1374.7D76604700l506005l777861m165083m224808l610372k559274j382709n81116
$$ plain form
1252.3 508650124 510837555 513075650 515285850 517441750 519556403 521681368 523849726 525984526
1268.6 525984526 527974963 529768109 531275511 532451272 533407748 534306467 535223663 536175013 537145972
1287 537145972 538037360 538697839 538962066 538703263 537887514 536607802 534985840 533138573 531197488
1305.3 531197488 529274523 527499974 525992751 524862051 524200261 524044931 524318755 524777353 525046051
1323.7 525046051 524756670 523711443 522011638 519927621 517718077 515658677 513931513 512647867
1340 512647867 511824131 511263847 510719955 510030270 509072185 507803679 506258488 504469693 502465129
1358.3 502465129 500093877 497109622 493589014 489806354 486047029 482780427 479825288 476604700
1374.7 476604700 473098695 469320834 465155751 460930943 457320571 454761297 453378588 452797472
1391D52797472l86118l71635j20491K71708P44313J227647J706034K030551K122045
1409.3D60021526K174794K232254K295405K471625K859265K876490K650261K417565
1425.7D79999185J895010J225233N39988j43885q06868q83997k93642P9244J92672
1444D81802940K57492K87652K37108J45286L78221J417041K952635L260255K972246
1462.4D93710876L080457L461868M059910N440593P623136Q154571O698549N118549
1478.7E37348509L525972J879454J88112j515448l340960m750490n032956n695284
1495E22606909p040977p121563o346584o051629p766724j1031508r875536q023143
1511.3D59349245p777065o868005n066901l192723k637595k735138k803624k987534
$$ plain form
1391 452797472 452411354 452039719 451919228 452190936 452935249 454162896 455868930 457899481 460021526
1409.3 460021526 462196320 464428574 466723979 469195604 472054869 474931359 477581620 479999185
1425.7 479999185 481894195 483119428 483659416 483515531 482708663 481824666 481531024 481610268 481802940
1444 481802940 482060432 482348084 482585192 482730478 483108699 484525740 487478375 490738630 493710876
1462.4 493710876 496791333 500253201 504313111 509753704 517376840 525531411 532229960 537348509
1478.7 537348509 540874481 542753935 542942047 541426599 538085639 533335149 528302193 522606909
1495 522606909 515565932 508444369 502097785 496046156 488279432 477247924 467372388 459349245
1511.3 459349245 451572180 444704175 439637274 436444551 433806956 431071818 428268194 425280660
1527.6D25280660k649992k429456k484202j868457j316666j402557p60794M81933J349509
1546D14199978K031744K787113L535509M057497M173904M935801N914271M591912L796339
1564.3D50024068L685296L431380L247112K671510K088696J806557J376450Q46267
1580.7D69177336L60757p153l76970p88778j327306j932263k591699l188700l834903
1599D55490321m696548n563796o272107p027328q055478q753121q933306j0036349
1615.3C96152288j1829287j0758162j0302424j2018293j1932135j0897308j0276646
1629.6C18138033q941650q229763q409947n887717k621203r10134J19538J030653J951307
1648B86239117K158016K577246L859251L940791L876567M727990N982488O803840O628663
$$ plain form
1527.6 425280660 422630668 420201212 417717010 415848553 414531887 413129330 412368536 412850469 414199978
1546 414199978 416231722 419018835 422554344 426611841 430785745 435721546 441635817 446227729 450024068
1564.3 450024068 453709364 457140744 460387856 463059366 465148062 466954619 468331069 469177336
1580.7 469177336 469538093 469530940 469153970 468365192 467037886 465105623 462513924 459325224 455490321
1599 455490321 450793773 445229977 438957870 431930542 423875064 415121943 406188637 396152288
1615.3 396152288 384323001 373564839 363262415 351244122 339311987 328414679 318138033
1629.6 318138033 309196383 300966620 292556673 286668956 284047753 283137619 283257157 284287810 286239117
1648 286239117 288397133 290974379 294833630 298774421 302650988 307378978 313361466 320165306 326793969
1666.3C26793969P288962Q453489Q018106Q182019Q977920Q554428Q144022R113699
1682.6C93526614J1648029J1409730J0287880J1332483J2026637J4367462J6670703
1696.9D81269538J6700626J8103182J5382767J2719571J2372554J0682761R051145
1711.2E76282144P879376P016957O867051O274819M980326M197001L858209L454566
1727.5F20810449L123045K740800K807081L175378L004015L093779L551721L985703
1743.8F46291971M387915M757762N348206N938649N697608N405366N322159N113721
1760.1F88263357N207061M924357M333198M078508L914654L890991L746868L259122
1776.5G21618116K953112K785981K565622K387881K295316K105295J824796J863718
$$ plain form
1666.3 326793969 334082931 342536420 350554526 358736545 367714465 376268893 384412915 393526614
1682.6 393526614 405174643 416584373 426872253 438204736 450231373 464598835 481269538
1696.9 481269538 497970164 516073346 531456113 544175684 556548238 567230999 576282144
1711.2 576282144 584161520 591178477 598045528 604320347 609300673 613497674 617355883 620810449
1727.5 620810449 623933494 626674294 629481375 632656753 635660768 638754547 642306268 646291971
1743.8 646291971 650679886 655437648 660785854 666724503 672422111 677827477 683149636 688263357
1760.1 688263357 693470418 698394775 702727973 706806481 710721135 714612126 718358994 721618116
1776.5 721618116 724571228 727357209 729922831 732310712 734606028 736711323 738536119 740399837
1792.8G40399837K009392J892805J640559J557052J677990J698732J542389J380742
1809.1G53799498J393914J435817J351773J223088J236379J264035J154125J051605
1825.4G63910234J039624J115322J221180J113832R03487R16183R62735P69496N98728
1843.8G72550821Q31127J004518Q17716O26087O49512P59720O96421N56648N66125
1862.1G79058695O45578N10216L27706N07712P67172P10487M81963M22478N83768O65784
1882.5G84681559N34653M37975M87447N74291N29289M12524M72903N66363M60685L05116
1902.9G89462805L39806M39823L83496K69532K87175L48330K74002K06530K68042M05312
1923.3G92684853M55499K85208J52051K34664K94506J95623J45316K01762K05576J30773
$$ plain form
1792.8 740399837 742409229 744302034 745942593 747499645 749177635 750876367 752418756 753799498
1809.1 753799498 755193412 756629229 757981002 759204090 760440469 761704504 762858629 763910234
1825.4 763910234 764949858 766065180 767286360 768400192 769303679 770219862 771182597 771952093 772550821
1843.8 772550821 773381948 774386466 775204182 775830269 776479781 777239501 777935922 778492570 779058695
1862.1 779058695 779704273 780214489 780542195 781049907 781817079 782527566 783009529 783432007 784015775 784681559
1882.5 784681559 785216212 785654187 786141634 786715925 787245214 787657738 788130641 788697004 789157689 789462805
1902.9 789462805 789802611 790242434 790625930 790895462 791182637 791530967 791804969 792011499 792279541 792684853
1923.3 792684853 793140352 793425560 793577611 793812275 794106781 794302404 794447720 794649482 794855058 794985831
1943.7G94985831J14500K24412L23415K48551J21355J56522K68042K53618J43170J47104
1964.1G96986520K42174K42531J40131J09494K19941K70426J46270M5776J47522K23219
1984.5G98774004J04249j0312L2246J49548J57237N1439M0650J27673R7573l3200o6638
2006.9G99424469K8074L0160j07050j78694j07646m7923j33812k15054j64330j07228
2027.3G98420966j84000k58028j70827o4135j32143k33114j37866N901k5630j33037
2047.7G97088087r7394K1219M2021l5584k1398J14501J51217N1081J8954J33812J89186
2070.2G97655702Q8989O438R3043K00510J36077J0312L6597J63853J63496P4148R2983
2092.6G98722148J99616J79291M9650N8949K04504K17557O7353M0650J92821K54572
$$ plain form
1943.7 794985831 795100331 795324743 795648158 795896709 796018064 796174586 796442628 796696246 796839416 796986520
1964.1 796986520 797228694 797471225 797611356 797720850 797940791 798211217 798357487 798403263 798550785 798774004
1984.5 798774004 798878253 798867941 798900187 799049735 799206972 799258411 799299061 799426734 799524307 799491107 799424469
2006.9 799424469 799452543 799482703 799375653 799196959 799089313 799041390 798907578 798692524 798528194 798420966
2027.3 798420966 798236966 797978938 797808111 797743976 797611833 797378719 797240853 797246754 797221124 797088087
2047.7 797088087 796990693 797011912 797053933 797018349 796996951 797111452 797262669 797313750 797332704 797466516 797655702
2070.2 797655702 797744691 797751129 797844172 798044682 798180759 798191071 798227668 798391521 798555017 798629165 798722148
2092.6 798722148 798921764 799101055 799150705 799209654 799414158 799631715 799699068 799739718 799932539 800187111
2113H00187111J17600M1187J47700K10285J09077J3470O3539J59800J44601P4267J25408
2135.4H01394045K01404J28150n9J4543J60277K13206J14858R1076K06411K27153J25587
2157.9H02876651J33634K70784L16441K37524K04564L24428M49001L67999K40744K92360
2178.2H05714130L95000L51906K61188K97546L87609L61145K56359K39075L14354L34382
2198.6H08912694K51770K32459L32117L31878J92941J72376K98560L26872K39551J96755
2219H11487973K43723K82347K05040J05679J32621J83582J21772P1764J56343K15054
2239.4H13205898J17063M6909J13547J80483J43349N7042M2617R9421J11937L2961
2259.8H14151227O319R6023J49488Q8215L5107P6711Q4579k0861j02997m7624M9114
$$ plain form
2113 800187111 800304711 800345898 800493598 800703883 800812960 800826430 800889969 801049769 801194370 801268637 801394045
2135.4 801394045 801595449 801723599 801723540 801738083 801898360 802111566 802226424 802317500 802523911 802751064 802876651
2157.9 802876651 803010285 803281069 803597510 803835034 804039598 804364026 804813027 805181026 805421770 805714130
2178.2 805714130 806109130 806461036 806722224 807019770 807407379 807768524 808024883 808263958 808578312 808912694
2198.6 808912694 809164464 809396923 809729040 810060918 810253859 810426235 810724795 811051667 811291218 811487973
2219 811487973 811731696 812014043 812219083 812324762 812457383 812640965 812762737 812834501 812990844 813205898
2239.4 813205898 813322961 813369870 813483417 813663900 813807249 813864291 813906908 814006329 814118266 814151227
2259.8 814151227 814157546 814253569 814403057 814491272 814526379 814603090 814687669 814666808 814563811 814516187 814565301
2282.3H14565301P9632M5240L3319P8201P2181J0133K3484J31071J66178J09314J19150
2304.7H15433204K04742K42651K02417J37150J42575K78055L87371L78907L39567L40224
2325.1H18086863L19778J98722L3319m0471q7023k11298j88232j09315m78804j194596
2345.5H16328943j072884n6028Q79407J177132R22739N52416O6340l68237p25985j103461
2365.9H16600382j360416j446843j428902j303435j144230j094043j068712r33766
2382.2H06820035p16746n25832m16040l48449l09706l30746l58582l70860l99470m04477
2402.6H02639127m15623m56274m61757m53532m80890n10216n25355n41508n47946n51760
2423G97694266n73516n92411n94675n99444n96762n80966n74172n88178o11127o07490
$$ plain form
2282.3 814565301 814644933 814690173 814723492 814801693 814873874 814884007 814907491 815038562 815204740 815314054 815433204
2304.7 815433204 815637946 815880597 816083014 816220164 816362739 816640794 817028165 817407072 817746639 818086863
2325.1 818086863 818406641 818605363 818638682 818598211 818511188 818299890 818111658 818002343 817523539 816328943
2345.5 816328943 815256059 815200031 816079438 817256570 818179309 818731725 818798065 818429828 817703843 816600382
2365.9 816600382 815239966 813793123 812364221 811060786 809916556 808822513 807753801 806820035
2382.2 806820035 806103289 805577457 805161417 804812968 804503262 804172516 803813934 803443074 803043604 802639127
2402.6 802639127 802223504 801767230 801305473 800851941 800371051 799860835 799335480 798793972 798246026 797694266
2423 797694266 797120750 796528339 795933664 795334220 794737458 794156492 793582320 792994142 792383015 791775525
2443.4G91775525n88656o03258o48380o55710o03617n69284o10053o50347o20603n62310
2463.8G85663307n49734o15477o49453n85079n59449o17623o29485n59926n51641o44505
2484.2G79700935o61016n59210n20170n97179o25014n32985m78923n42343n91695n28396
2504.6G74064004m70995n46337o04093n05686m20689n16772o38485o03915n17547n21123
2525G68718362n97119o38843n93305n67734o35326o75857o04451n57303o26326o81996
2545.4G62540102o22511n50985n86689o58929o33717n51879n54741o18934o11842n51104
2565.8G56598771n55516o28054o49869n78761n35071n99504o73294o34134n62727o04093
2586.2G50577748o69956o05524n17249n70297o69718o49750n63264n96225p33912p58708
$$ plain form
2443.4 791775525 791186869 790583611 789935231 789279521 788675904 788106620 787496567 786846220 786225617 785663307
2463.8 785663307 785113573 784498096 783848643 783263564 782704115 782086492 781457007 780897081 780345440 779700935
2484.2 779700935 779039919 778480709 777960539 777363360 776738346 776205361 775726438 775184095 774592400 774064004
2504.6 774064004 773593009 773046672 772442579 771936893 771516204 770999432 770360947 769757032 769239485 768718362
2525 768718362 768121243 767482400 766889095 766321361 765686035 765010178 764405727 763848424 763222098 762540102
2545.4 762540102 761917591 761366606 760779917 760120988 759487271 758935392 758380651 757761717 757149875 756598771
2565.8 756598771 756043255 755415201 754765332 754186571 753651500 753051996 752378702 751744568 751181841 750577748
2586.2 750577748 749907792 749302268 748785019 748214722 747545004 746895254 746331990 745735765 745001853 744243145
2606.6G44243145o76095p05183q39651q91149q33809q16405r03726r69708r35554r00984
2626.9G35770881r86457j088679j043140r47774r76324j078129j055240r51171r88961
2645.3G26655006j118779j114845r98437r84073j072824j073718r72867r38654r94504
2663.7G17386305j011312r52184r16600r55403j001179r63509q82507r04142r65059
2682G08834410r15766q43287q74936r35912Tr09031r18627j001000j063526j020372
2702.4F99416041j001060j089930j161993j121044j073837j126588j178383j146317
2718.7F90516889j093149j094878j140475j103580r80735r46104j044453j066744r32097
2737.1F81114674q83460r76384j002371r32455q83043q96693r19520r05812q80599
$$ plain form
2606.6 744243145 743567050 742861867 742022216 741131067 740297258 739480853 738577127 737607419 736671865 735770881
2626.9 735770881 734784424 733695745 732652605 731704831 730728507 729650378 728595138 727643967 726655006
2645.3 726655006 725536227 724421382 723422945 722438872 721366048 720292330 719319463 718380809 717386305
2663.7 717386305 716374993 715422809 714506209 713550806 712549627 711586118 710703611 709799469 708834410
2682 708834410 707918644 707075357 706200421 705264509 704328597 703419566 702500939 701499939 700436413 699416041
2702.4 699416041 698414981 697325051 696163058 695042014 693968177 692841589 691663206 690516889
2718.7 690516889 689423740 688328862 687188387 686084807 685104072 684157968 683113515 682046771 681114674
2737.1 681114674 680231214 679254830 678252459 677320004 676436961 675540268 674620748 673714936 672834337
2755.4F72834337q91328r50754r40501q61466q96454r88722r87470r31800r31441j030803
2775.8F63423598j131475j116336j097798j218676j313329j256883j230598j349866
2792.2F53708637j467467j450836j422286j484454j557887j595676j628398j690627
2808.5F41411006j771032j800120j788914j855255j982033k033472k025187k094448
2824.8F26060545k272129k424836k470553k540528k771140l122270l507971l963352
2841.1F02987766m590809n326986n883098n988956n562603m645467l430545k369344
2857.4E65189958j949728k235234k855062l490567l989995m134238l783941l098965
2873.7E39652228k335131j661956j189709r39429q84413j010538j235902j414060j536787
$$ plain form
2755.4 672834337 671943009 670992255 670051754 669190288 668293834 667305112 666317642 665385842 664454401 663423598
2775.8 663423598 662292123 661175787 660077989 658859313 657545984 656289101 655058503 653708637
2792.2 653708637 652241170 650790334 649368048 647883594 646325707 644730031 643101633 641411006
2808.5 641411006 639639974 637839854 636050940 634195685 632213652 630180180 628154993 626060545
2824.8 626060545 623788416 621363580 618893027 616352499 613581359 610459089 606951118 602987766
2841.1 602987766 598396957 593069971 587186873 581197917 575635314 570989847 567559302 565189958
2857.4 565189958 563240230 561004996 558149934 554659367 550669372 546535134 542751193 539652228
2873.7 539652228 537317097 535655141 534465432 533526003 532641590 531631052 530395150 528981090 527444303
2892.1E27444303j712441j942456k168775k380371k601862k885818l251672l665388
2908.4E06835520m132628m655719n146325n423158n355597m968166m267216l256857
2924.7D69629854k059311q63135K34634J297593K338886L253192L913373M252046M223734
2943.1D86220866L772408K976239K087474J348972Q18670N58495P34747J335651K106219
2961.4E01959741K833665L510057M139960M695535N153358N420804N500019N518615
2977.8E38731754N418479N051732M561425M133224L685236L144741K588809K048790
2994.1E69364190J486123Q84354L16083j40607n22971q19683r68218j003683j013398
3012.4E67582190j028776j073122j204193j377702j590073j870155k023160j951039
$$ plain form
2892.1 527444303 525731862 523789406 521620631 519240260 516638398 513752580 510500908 506835520
2908.4 506835520 502702892 498047173 492900848 487477690 482122093 477153927 472886711 469629854
2924.7 469629854 467570543 466707408 466942042 468239635 470578521 473831713 477745086 481997132 486220866
2943.1 486220866 489993274 492969513 495056987 496405959 497224629 497783124 498517871 499853522 501959741
2961.4 501959741 504793406 508303463 512443423 517138958 522292316 527713120 533213139 538731754
2977.8 538731754 544150233 549201965 553763390 557896614 561581850 564726591 567315400 569364190
2994.1 569364190 570850313 571734667 572050750 571910143 571387172 570567489 569599271 568595588 567582190
3012.4 567582190 566553414 565480292 564276099 562898397 561308324 559438169 557415009 555463970
3028.7E55463970j858056j873910j947761k022624k093077k189993k287627k313733
3045.1E38877189k312481k354563k390146Tk381504k368688k338052k231181k061426
3063.4E18049002j936972j829744j689732j571357j502574j485943j467705j407266
3079.7E05157709j348078j294434j217485j105606j019150j008600j028985j041323
3096D96094048j023620j035363j109898j158476j196384j265466j336456j379877j385361
3114.4D85203147j392096j453311j573532j679033j751125j831025j850754j810342
3130.7D71861929j841128j926750j967549j979620k041012k127826k161711k134979
3147D55681354k083957k091825k173663k250939k276391k274632k272964k274990k282977
$$ plain form
3028.7 555463970 553605914 551732004 549784243 547761619 545668542 543478549 541190922 538877189
3045.1 538877189 536564708 534210145 531819999 529429853 527048349 524679661 522341609 520110428 518049002
3063.4 518049002 516112030 514282286 512592554 511021197 509518623 508032680 506564975 505157709
3079.7 505157709 503809631 502515197 501297712 500192106 499172956 498164356 497135371 496094048
3096 496094048 495070428 494035065 492925167 491766691 490570307 489304841 487968385 486588508 485203147
3114.4 485203147 483811051 482357740 480784208 479105175 477354050 475523025 473672271 471861929
3130.7 471861929 470020801 468094051 466126502 464146882 462105870 459978044 457816333 455681354
3147 455681354 453597397 451505572 449331909 447080970 444804579 442529947 440256983 437981993 435699016
3165.4D35699016k278924k271474k281874k291292k301961k332598k325654k285749
3181.7D17329490k283960k279699k241731k228737k248496k233863k173513k119928
3198C99519563k093971k076685k043367k001613j994342j996726j973659j929581j882791
3216.4C81526828j888752j914323j888811j863837j919419k001196k037823k041161
3232.7C65971506k072752k157956k213031k232045k264679k294987k344340k429128
3249C47962588k490342k504825k489388k489478k523213k538860k495736k383649k268970
3267.4C25778127k186239k089351j957834j818300j669049j486033j341104j269967
3283.7C11960250j171857j012593q73477p51853o42687n89907n35727m72843m39078
$$ plain form
3165.4 435699016 433420092 431148618 428866744 426575452 424273491 421940893 419615239 417329490
3181.7 417329490 415045530 412765831 410524100 408295363 406046867 403813004 401639491 399519563
3198 399519563 397425592 395348907 393305540 391303927 389309585 387312859 385339200 383409619 381526828
3216.4 381526828 379638076 377723753 375834942 373971105 372051686 370050490 368012667 365971506
3232.7 365971506 363898754 361740798 359527767 357295722 355031043 352736056 350391716 347962588
3249 347962588 345472246 342967421 340478033 337988555 335465342 332926482 330430746 328047097 325778127
3267.4 325778127 323591888 321502537 319544703 317726403 316057354 314571321 313230217 311960250
3283.7 311960250 310788393 309775800 308902323 308150470 307507783 306917876 306382149 305909306 305470228
3302C05470228l62068k48313k35647l14921l19690k38359j84029j73837j80781j90318
3322.4C03022265j90258k41458l26484l08961k53379k90990l73483m38541n14448n82337
3342.8B99501926o01620o04182n99563o16253o92367p85470q08299p72536p55191p43866
3363.2B92522579p22765p23482p85321q86976q97169p76321o62983o37382o52879o33300
3383.6B85144001n44369l80188k39939k84522m50343m74215k69473j16676k24501l62992
3404B81796783k78502j03951j3828J1086N603n573N4032J62661K72602M36812N82665
3426.5B82920390O42300O79195Q20875R63837Q75473P10189P50542R52602J128643
3444.8B90444046J215309J209021J239776J336098J374871J442849J572222J561224
$$ plain form
3302 305470228 305108160 304859847 304624200 304309279 303989589 303751230 303567201 303393364 303212583 303022265
3322.4 303022265 302832007 302590549 302264065 301955104 301701725 301410735 301037252 300598711 300084263 299501926
3342.8 299501926 298900306 298296124 297696561 297080308 296387941 295602471 294794172 294021636 293266445 292522579
3363.2 292522579 291799814 291076332 290291011 289404035 288506866 287730545 287067562 286430180 285777301 285144001
3383.6 285144001 284599632 284219444 283979505 283694983 283244640 282770425 282500952 282384276 282159775 281796783
3404 281796783 281518281 281414330 281400502 281411588 281417191 281411618 281465650 281628311 281900913 282337725 282920390
3426.5 282920390 283562690 284241885 285062760 286026597 286902070 287612259 288362801 289315403 290444046
3444.8 290444046 291659355 292868376 294108152 295444250 296819121 298261970 299834192 301395416
3461.1C01395416J554638J757920J920700J779020J488209J481056J745284K014666
3477.4C15136909K105535J957684J880646K043665K157777K119064K108396K153158
3493.8C31662834K223611K243131K231091K252221K202809K120227K198845K387881
3510.1C49522650K533555K495766K327293K360314K579481K740293K681464K550751
3526.4C69791567K593100K711475K804458K949059L021360K924740K959728L127337
3542.7C92882824L173530L076404L018022L080726L232598L363818L424078L492087
3559D18744087L517688L459006L472596L825725M164040M087001L979444M090578M253178
3577.4D53593343M373581M452914M413932M313052M441678M745007M707187M602492
$$ plain form
3461.1 301395416 302950054 304707974 306628674 308407694 309895903 311376959 313122243 315136909
3477.4 315136909 317242444 319200128 321080774 323124439 325282216 327401280 329509676 331662834
3493.8 331662834 333886445 336129576 338360667 340612888 342815697 344935924 347134769 349522650
3510.1 349522650 352056205 354551971 356879264 359239578 361819059 364559352 367240816 369791567
3526.4 369791567 372384667 375096142 377900600 380849659 383871019 386795759 389755487 392882824
3542.7 392882824 396056354 399132758 402150780 405231506 408464104 411827922 415252000 418744087
3559 418744087 422261775 425720781 429193377 433019102 437183142 441270143 445249587 449340165 453593343
3577.4 453593343 457966924 462419838 466833770 471146822 475588500 480333507 485040694 489643186
3593.7D89643186M735351M871488M874438M853844M753232M531920M555345M771530
3610E27590334M882038M971266M830897M660964M945218N003810M595816M196763M324794
3628.4E70001900M867017M694105M336297M232407M191220M202306M119992L817976
3644.7F04463220L558516L763735M147768L956974L558755L640056L746509L415525
3661F34251058L117323L056705K840340K563775K750456K642155K268076K575457K818525
3679.4F58883870K674758K559304K390981K171338K068340K145410K196848K069116
3695.7F77159965J810253J544654J460671J577914J548827J303494J049638J051962
3712F88507378J414359J546859J374066J193285J049161R28998R67443J169801J094639
$$ plain form
3593.7 489643186 494378537 499250025 504124463 508978307 513731539 518263459 522818804 527590334
3610 527590334 532472372 537443638 542274535 546935499 551880717 556884527 561480343 565677106 570001900
3628.4 570001900 574868917 579563022 583899319 588131726 592322946 596525252 600645244 604463220
3644.7 604463220 608021736 611785471 615933239 619890213 623448968 627089024 630835533 634251058
3661 634251058 637368381 640425086 643265426 645829201 648579657 651221812 653489888 656065345 658883870
3679.4 658883870 661558628 664117932 666508913 668680251 670748591 672894001 675090849 677159965
3695.7 677159965 678970218 680514872 681975543 683553457 685102284 686405778 687455416 688507378
3712 688507378 689921737 691468596 692842662 694035947 695085108 696014106 696981549 698151350 699245989
3730.3F99245989Q08299O96480Q12531J077294J077712N04613K37941R21488R23574
3748.7G06305921M02153P01069J214743J094699P33256P26998Q28684P51197O97970
3767.1G13456690O30141O65843P96616P67529O23763M99725N30183N35012M95791N93841
3787.5G19595134O96898P03752N45859L40104L99769L90410L65794P41124O37531L36349
3807.8G24752724O14524Q05974M65274J44601L02195J88947J77085O11365O70553N60939
3828.2G29294181M53830L66270M13418K81513J00314K69771M14133M61817N84543N96404
3848.6G33236194J86383n38408j60694Q27193P67946L78191J87755K88010L70383Q8811
3869G35631764O7830L40581M63128M70161K13564J48654K48790J47104L20971L66390
$$ plain form
3730.3 699245989 700054288 700750768 701563299 702640593 703718305 704222918 704460859 705382347 706305921
3748.7 706305921 706708074 707409143 708623886 709718585 710451841 711178839 712007523 712758720 713456690
3767.1 713456690 714086831 714752674 715549290 716316819 716940582 717440307 717970490 718505502 719001293 719595134
3787.5 719595134 720292032 720995784 721541643 721881747 722281516 722671926 723037720 723778844 724416375 724752724
3807.8 724752724 725367248 726173222 726638496 726783097 727085292 727274239 727451324 728062689 728733242 729294181
3828.2 729294181 729748011 730114281 730527699 730809212 730909526 731179297 731593430 732055247 732639790 733236194
3848.6 733236194 733422577 732884169 732723475 733550668 734318614 734696805 734884560 735172570 735542953 735631764
3869 735631764 735699594 736040175 736503303 736973464 737187028 737335682 737584472 737731576 738052547 738418937
3889.4G38418937J13487K49207M22239J56582j10627j22725J7642L60311N12182L17633
3909.8G40334868K11537K11299L8326r6024Q7560K56777J98423J42754J07109N4479
3930.2G41547108J29103K37167K26319J58191O7651L0994J49131K18273J39236J00315
3950.6G43003488R1195R8467J68204J72496J22010J24455J24454J10925J28507J28091
3971G44272292R4354Q3148Q8036J02461J64151K08795J46270J9789L9517J67072J34349
3993.4G45520234O4433J28388
3997.5G45713055
$$ plain form
3889.4 738418937 738532424 738781631 739203870 739360452 739249825 739127100 739144742 739505053 740017235 740334868
3909.8 740334868 740546405 740757704 740796030 740700006 740787566 741044343 741242766 741385520 741492629 741547108
3930.2 741547108 741676211 741913378 742139697 742297888 742365539 742396533 742545664 742763937 742903173 743003488
3950.6 743003488 743094683 743193150 743361354 743533850 743655860 743780315 743904769 744015694 744144201 744272292
3971 744272292 744366646 744449794 744537830 744640291 744804442 745013237 745159507 745179296 745218813 745385885 745520234
3993.4 745520234 745584667 745713055
3997.5 745713055
##END=$$ End of the data block
