##TITLE=G08-51-CE $$ Begin of the data block
##JCAMP-DX=5.00 $$ ACD/SpecManager v 10.08
##SPECTROMETER/DATA SYSTEM=Alpha
##DATE=22 Oct 2013 10:53:20
##DATA TYPE=INFRARED SPECTRUM
##DATA CLASS=XYDATA
##ORIGIN=
##OWNER=
##NPOINTS=1765
##FIRSTX=399.75695801
##LASTX=3997.56933594
##MAXX=3997.56933594
##MINX=399.75695801
##MAXY=0.81876737
##MINY=0.28117165
##XFACTOR=1.0000000000
##YFACTOR=1.000000000000000e-9
##FIRSTY=0.54449892
##DELTAX=2.03957629
##XUNITS=1/CM
##YUNITS=ARBITRARY UNITS
##XYDATA=(X++(Y..Y))
399.8E44498920j942098j023590j430154j983583m75586J738728J279056j105667j895785
418.1E37660241n12838j15514j172662j730680j344323j275838j914739j749516k05994
436.5E27638137P62999L71159N03897J555562J389921r9123n86629M9949k39610j633049
456.9E29713213k218127j566052j412869k130568k553105k034426j637876k133310
473.2E14026880k258241j290738n00799q57651j412272r31740k92123q62717j770854
491.5E03849745j672447j239717j704723k539783k580405k077400k330661l153265
507.9D86551344k889156j939475k100885k916009k738088j661897j089513j209021
524.2D70007300q06987K48283O52850M01497P60048J997561K751589K144932J293808
$$ plain form
399.8 544498920 542556822 541533232 540103078 538119495 537643909 539382637 540661693 539556026 537660241
418.1 537660241 537147403 537031889 535859227 534128547 532784224 531508386 529593647 527844131 527638137
436.5 527638137 528401136 528772295 529276192 530831754 532221675 532122552 531535923 531585872 531346262 529713213
456.9 529713213 527495086 525929034 524516165 522385597 519832492 517798066 516160190 514026880
473.2 514026880 511768639 510477901 509977102 509119451 507707179 506775439 506483316 505620599 503849745
491.5 503849745 502177298 500937581 499232858 496693075 494112670 492035270 489704609 486551344
507.9 486551344 483662188 481722713 479621828 476705819 473967731 472305834 471216321 470007300
524.2 470007300 469200313 469448596 470101446 470502943 471262991 473260552 476012141 478157073 479450881
542.5D79450881J124591Q19445j56433r21785q05945n60254j127183j908630j863599
560.9D74051088j558721j984864k570034k267390j351982o46592j69962O44207J894146
579.2D66039896K691716K648562K590984K731979K226234J082688L84838M65452M26740
597.6D81289089q7738k92451J75387N50330K42472p3791K95252Q63641Q80063P12812
618D84555066J294911K307921K703726K499223K595902K942294K640366J767159J389444
636.3E04696012J760065J933217J466990J164019J368701J380384Q13008K37345K98023
654.7E15117764N93544M26948J37150L70860Q95858J287639J134515Q25166J250387
673.1E22039831J647353J505136J365424J622557J600802R96351N86510O39796M01616
$$ plain form
542.5 479450881 480575472 481394917 481238484 480316699 479510754 478950500 477823317 475914687 474051088
560.9 474051088 472492367 470507503 467937469 465670079 464318097 463671505 463501543 464145750 466039896
579.2 466039896 468731612 471380174 473971158 476703137 478929371 480012059 480396897 480862349 481289089
597.6 481289089 481201351 480908900 481084287 481634617 481877089 481803298 482098550 482962191 483842254 484555066
618 484555066 485849977 488157898 490861624 493360847 495956749 498899043 501539409 503306568 504696012
636.3 504696012 506456077 508389294 509856284 511020303 512389004 513769388 514582396 514819741 515117764
654.7 515117764 515711308 516138256 516275406 516646266 517542124 518829763 519964278 520789444 522039831
673.1 522039831 523687184 525192320 526557744 528180301 529781103 530777454 531363964 532003760 532405376
691.4E32405376m89354j192093j014947l84331J59919P47979J559257K298117K504468
709.8E36594391K418220K803802L533245L814637L774762M048109M490972M497945
726.1E65976083L888369L310859L153324K836108J987100J212657J038611R09388L34084
744.4E84646583k41340k23934j8358l00885r19938j232445r54390o45518n96523q8394
764.8E79424858J191080K418101L166496L883839M722297N116522M708648M039467
781.2F08671308L691434L372550K661050J960635J803935K078294K138019K020717
797.5F28397942K434074L026307K908647K304971K055586K141118J789033R26018M05312
815.8F46389008M04000J34528p60973j584589j762689j815140k210438k491891k333165
$$ plain form
691.4 532405376 531916022 530723929 529708982 529324651 529484570 530232549 531791806 534089923 536594391
709.8 536594391 539012611 541816413 545349658 549164295 552939057 556987166 561478138 565976083
726.1 565976083 569864452 573175311 576328635 579164743 581151843 582364500 583403111 584312499 584646583
744.4 584646583 584405243 584181309 584162951 583862066 582942128 581709683 580755293 580109775 579513252 579424858
764.8 579424858 580615938 583034039 586200535 590084374 594806671 599923193 604631841 608671308
781.2 608671308 612362742 615735292 618396342 620356977 622160912 624239206 626377225 628397942
797.5 628397942 630832016 633858323 636766970 639071941 641127527 643268645 645057678 645983696 646389008
815.8 646389008 646793008 646927536 646166563 644581974 642819285 641004145 638793707 636301816 633968651
834.2F33968651k198040k413988k601803k273440j694083j457691j473010j185894
850.5F18670702n88000l32057n52237l24369J082897K973259M245818M913091N367994
868.9F35457098N208910M112065K604127J201689j44422j690865l151357l944158m194796
887.2F35458291m450977m733324m654825m239321m010677m275859m694223m978836
903.5E99420249n393266o005824o395817o319880o024361n737602n195320m053414
919.8E54294765k632618j675188j312554j010955n86152l73781m15921m05192k71201
938.2E45611203l11852r21309k238452m084468o143272p968605r129047r544253r600342
956.6D95669603r747743r913862r863079r723842r668797r533256q988768q000672
$$ plain form
834.2 633968651 631770611 629356623 626754820 624481380 622787297 621329606 619856596 618670702
850.5 618670702 618082702 617750645 617198408 616874039 617956936 620930195 625176013 630089104 635457098
868.9 635457098 640666008 644778073 647382200 648583889 648439467 646748602 643597245 639653087 635458291
887.2 635458291 631007314 626273990 621619165 617379844 613369167 609093308 604399085 599420249
903.5 599420249 594026983 588021159 581625342 575305462 569281101 563543499 558348179 554294765
919.8 554294765 551662147 549986959 548674405 547663450 547077298 546703517 546287596 545882404 545611203
938.2 545611203 545299351 544378042 542139590 538055122 531911850 523943245 514814198 505269945 495669603
956.6 495669603 485921860 476007998 466144919 456421077 446752280 437219024 428230256 420229584
972.9D20229584o876111n830914m740298l507882k431482j837313j539052j242965
989.2C92223567j070768j100987j073539p86186l81201j75089k44349m18365o72549
1007.5C86300534j138449j692027j960277j886904j811207j919508k008080j953423
1023.9C71930659j936287k030671k083927j986205j932800k102614k267986k189189
1040.2C55400980j982034j818478j645803j278371o52283N960N01484R29981J379788
1058.5C50841224J759738K009392K141326J944453R54479o44267j735687j587778n24134
1076.9C55158746Q14080K066106L121346L930778M367053M463196M422307M246384
1093.2C82589996L826618L196120K523065J957148J594097J484185J679868K113074
$$ plain form
972.9 420229584 413353473 407522559 402782261 399274379 396842897 395005584 393466532 392223567
989.2 392223567 391152799 390051812 388978273 388192087 387810886 387635797 387391448 386973083 386300534
1007.5 386300534 385162085 383470058 381509781 379622877 377811670 375892162 373884082 371930659
1023.9 371930659 369994372 367963701 365879774 363893569 361960769 359858155 357590169 355400980
1040.2 355400980 353418946 351600468 349954665 348676294 348024011 348029971 348531455 349461436 350841224
1058.5 350841224 352600962 354610354 356751680 358696133 359650612 359006345 357270658 355682880 355158746
1076.9 355158746 355972826 358038932 361160278 365091056 369458109 373921305 378343612 382589996
1093.2 382589996 386416614 389612734 392135799 394092947 395687044 397171229 398851097 400964171
1109.5D00964171K489865K652674K700836K649844K403885K014518J707404J702696
1125.8D19285893K050579K591580K961040K866894K370566J638442P63983l7253n20796
1144.2D33970928p32243q37833q17298n37038J1444P07328J490772K340019L128230
1162.6D38724309L732532M153759M525006N034446N677283O254733O637543O862521
1178.9D81602132O917626O684870O192684N584895M835248L821075K617061J483560
1195.2E19739151N82755j31011o74665r45568r24051p59065n76199l88145k40743k88904
1215.6E15393555n30243p62999r36806j165867j463115j680791j755715j734912j616836
1233.9E03746271j353741r46283m42028R3162O11544J142263J615465J913905K072573
$$ plain form
1109.5 400964171 403454036 406106710 408807546 411457390 413861275 415875793 417583197 419285893
1125.8 419285893 421336472 423928052 426889092 429755986 432126552 433764994 434528977 434491724 433970928
1144.2 433970928 433238685 432400852 431583554 431046516 431057960 431765288 433256060 435596079 438724309
1162.6 438724309 442456841 446610600 451135606 456170052 461847335 468102068 474739611 481602132
1178.9 481602132 488519758 495204628 501397312 506982207 511817455 515638530 518255591 519739151
1195.2 519739151 520321906 520190895 519516230 518570662 517646611 516887546 516311347 515923202 515682459 515393555
1215.6 515393555 514863312 514100313 513163507 511997640 510534525 508853734 507098019 505363107 503746271
1233.9 503746271 502392530 501446247 501004219 501097381 501708925 502851188 504466653 506380558 508453131
1252.3E08453131K195596K267421K233743K166450K141238K148807K150058K105833
1268.6E25862277J986205J783073J494646J180113R46462Q85486R44734R94801R86696
1287E37064493Q78155O34193K37048k61664p80642j253128j638592j870215j925409
1305.3E31084239j898586j787484j510501j094460o22809j21296L03090M48286K05100
1323.7E25005579l42906j038849j679897k076984k201199k075732j753271j282155
1340E12554586q26299n82099n57780o78361r33349j263380j547456j763821j983225
1358.3E02418816k374530k989590l544420l815502l767818l272355k963394l204435
1374.7D76486772l492236l777891m151643m222095l614813k531618j363486o05344
$$ plain form
1252.3 508453131 510648727 512916148 515149891 517316341 519457579 521606386 523756444 525862277
1268.6 525862277 527848482 529631555 531126201 532306314 533252776 534138262 535082996 536077797 537064493
1287 537064493 537942648 538576841 538813889 538552225 537771583 536518455 534879863 533009648 531084239
1305.3 531084239 529185653 527398169 525887668 524793208 524170399 524049103 524352193 524800479 525005579
1323.7 525005579 524662673 523623824 521943927 519866943 517665744 515590012 513836741 512554586
1340 512554586 511728287 511146188 510588408 509910047 508976698 507713318 506165862 504402041 502418816
1358.3 502418816 500044286 497054696 493510276 489694774 485926956 482654601 479691207 476486772
1374.7 476486772 472994536 469216645 465065002 460842907 457228094 454696476 453332990 452727646
1391D52727646m09097l46392o6072K85506P18445J231730J725852K027363K145082
1409.3D60040063K227455K253801K263426K427072K875209K921760K638280K365321
1425.7D80012387J878262J250654N41449j66744q02309q82744l16531Q3894K22385
1444D81820703K78711K95251K45214J61499M26203J504183K939224L140658K899915
1462.4D93711561L065824L447384M053056N472482P652223Q131742O657660N066455
1478.7E37258387L469169J864016K07424j493633l330111m791797n111515n734026
1495E22337914p023991p103502o334126o036848p744819j0983288r857774q035511
1511.3D59218055p773221o837278n028576l168314k624780k731294k786398k958089
$$ plain form
1391 452727646 452318549 451972157 451906085 452191591 452910036 454141766 455867618 457894981 460040063
1409.3 460040063 462267518 464521319 466784745 469211817 472087026 475008786 477647066 480012387
1425.7 480012387 481890649 483141303 483682752 483516008 482713699 481830955 481514424 481598318 481820703
1444 481820703 482099414 482394665 482639879 482801378 483227581 484731764 487670988 490811646 493711561
1462.4 493711561 496777385 500224769 504277825 509750307 517402530 525534272 532191932 537258387
1478.7 537258387 540727556 542591572 542798996 541305363 537975252 533183455 528071940 522337914
1495 522337914 515313923 508210421 501876295 495839447 488094628 477111340 467253566 459218055
1511.3 459218055 451444834 444607556 439578980 436410666 433785886 431054592 428268194 425310105
1527.6D25310105k626359k391428k440095j858294j310080j348853p22975M56691J332015
1546D14400727K048730K804280L522455M038275M215926N038350N901069M490644L750294
1564.3D50210750L686011L448397L252447K638667K051980J799941J366973Q26269
1580.7D69281435L37750n2154m25071q17239j332462j911461k573014l201365l845751
1599D55460668m662842n518675o266355p036299q035779q713245q885771j0007084
1615.3C96334618j1856883j0811270j0333329j2024135j1927694j0885089j0282100
1629.6C18214118q957922q213162q384377n903036k654224r30101J33306J075834J962364
1648B86342800K134800K563625L848821L950179L898620M742653O000965O830097O633043
$$ plain form
1527.6 425310105 422683746 420292318 417852223 415993929 414683849 413334996 412612021 413068712 414400727
1546 414400727 416449457 419253737 422776192 426814467 431030393 436068743 441969812 446460456 450210750
1564.3 450210750 453896761 457345158 460597605 463236272 465288252 467088193 468455166 469281435
1580.7 469281435 469619185 469567031 469141960 468324721 466992259 465080798 462507784 459306419 455460668
1599 455460668 450797826 445279151 439012796 431976497 423940718 415227473 406341702 396334618
1615.3 396334618 384477735 373666465 363333136 351309001 339381307 328496218 318214118
1629.6 318214118 309256196 301043034 292658657 286755621 284101397 283171296 283304602 284380436 286342800
1648 286342800 288477600 291041225 294890046 298840225 302738845 307481498 313482463 320312560 326945603
1666.3C26945603P261455Q418888Q016944Q195758Q972078Q558512Q156538R111106
1682.6C93636882J1635393J1375964J0258108J1339873J2059182J4394760J6660810
1696.9D81360972J6698241J8126309J5369952J2707174J2370288J0674357R046019
1711.2E76353312P880270P066727O959676O306708M966140M194915L862143L462553
1727.5F21052444L140509K774596K857328L166318K952933L075004L559351M002392
1743.8F46580875M401386M773915N368113N911708N651235N398155N350172N156160
1760.1F88591719N211055M873753M323601M125178L946841L894925L706098L204703
1776.5G21877873K948046K812445K575397K381206K287745K111793J866281J899004
$$ plain form
1666.3 326945603 334207058 342625946 350642890 358838648 367810726 376369238 384525776 393636882
1682.6 393636882 405272275 416648239 426906347 438246220 450305402 464700162 481360972
1696.9 481360972 498059213 516185522 531555474 544262648 556632936 567307293 576353312
1711.2 576353312 584233582 591300309 598259985 604566693 609532833 613727748 617589891 621052444
1727.5 621052444 624192953 626967549 629824877 632991195 635944128 639019132 642578483 646580875
1743.8 646580875 650982261 655756176 661124289 667035997 672687232 678085387 683435559 688591719
1760.1 688591719 693802774 698676527 703000128 707125306 711072147 714967072 718673170 721877873
1776.5 721877873 724825919 727638364 730213761 732594967 734882712 736994505 738860786 740759790
1792.8G40759790J996040J875401J647353J563370J643777J645327J521766J389921
1809.1G54042745J416802J478255J371622J187861J189053J255691J206517J109958
1825.4G64258504J043737J084089J155973J064062R26673R60648R76205P91431O42240
1843.8G72903562Q21650R52601P97272O44743O80983P79569O92130N47468N58138O38366
1864.2G80016482N54025L91603M83930O96540O65962M58062M24743N92947O47485N14805
1884.6G85446584M34280N08606O06954N38826M21107M74393N27084M16518L09169L84569
1904.9G90068090M68492L69430K54035K94685L61324K94268K13385K51233L83020M30703
1925.3G93388665K83658J85192K61783K93732J84298J27732J93358K29299J63376J19210
$$ plain form
1792.8 740759790 742755830 744631231 746278584 747841954 749485731 751131058 752652824 754042745
1809.1 754042745 755459547 756937802 758309424 759497285 760686338 761942029 763148546 764258504
1825.4 764258504 765302241 766386330 767542303 768606365 769533038 770493686 771469891 772261322 772903562
1843.8 772903562 773725212 774677813 775475085 776119828 776800811 777580380 778272510 778819978 779378116 780016482
1864.2 780016482 780570507 780962110 781446040 782142580 782808542 783266604 783691347 784284294 784931779 785446584
1884.6 785446584 785880864 786389470 786996424 787535250 787956357 788430750 788957834 789374352 789683521 790068090
1904.9 790068090 790536582 790906012 791160047 791454732 791816056 792110324 792323709 792574942 792957962 793388665
1925.3 793388665 793672323 793857515 794119298 794413030 794597328 794725060 794918418 795147717 795311093 795430303
1945.7G95430303J81377K67505K38776J41144J68026K84433K90752J78873J50442K29240
1966.1G97560871K38657J41739J22607K27750K45213J21176O0797J66059K09808Q9407
1986.5G99184084O258P3791J68025J35601M7922P7367J43051N9426n9962n5492J9669
2009G99799740k741j35303j83702q2254l3021j51753k30670j54496q6426j52529k17259
2031.4G98369586j69634r9957j41025k24292j61708m2557m5181j12474q9228R537N7518
2053.8G97350585L458l458Q9467J14262M9889L4332J23859J66953Q6307J7226R1851
2076.3G98124731J93715J31070K3067P6294J84536J45972L9458O4373K02239K10285
2096.7G99395740R5725J05083K15769J95384N9426N8532K08735K57730J25945M4406
$$ plain form
1945.7 795430303 795611680 795879185 796117961 796259105 796427131 796711564 797002316 797181189 797331631 797560871
1966.1 797560871 797799528 797941267 798063874 798291624 798536837 798658013 798718810 798884869 799094677 799184084
1986.5 799184084 799190342 799264133 799432158 799567759 799615681 799693048 799836099 799895525 799835563 799780071 799799740
2009 799799740 799796999 799661696 799477994 799395740 799362719 799210966 798980296 798825800 798739374 798586845 798369586
2031.4 798369586 798199952 798099995 797958970 797734678 797572970 797530413 797485232 797372758 797283530 797293067 797350585
2053.8 797350585 797354043 797350585 797440052 797554314 797604203 797638535 797762394 797929347 798015654 798032880 798124731
2076.3 798124731 798318446 798449516 798472583 798548877 798733413 798879385 798918843 798983216 799185455 799395740
2096.7 799395740 799491465 799596548 799812317 800007701 800067127 800125659 800334394 800592124 800718069 800762475
2117.1H00762475J18494J73747Q9467R179Q3089J90615J55211M7326Q6486K08915J80900
2139.5H02105904L0636N305J45972K01046J17243J18077K19941K14278J14918J39415
2159.9H03412735K77877L04401K18809K14457L44932M29929L35336K28762K85030L90768
2180.3H06443036L57985K74301L00526L61622L38912K65538K52724L16918L34978K71440
2200.7H09517980K71499L52859L23653J96279K06053L29733L30627K17497J66774K04146
2221.1H12117100K24709J78576J40011J83642K17021J39236O2883J21713J95920J35005
2241.5H13715816P0869J10329J55508J21653N6148O4194J22309J19090K6822P749J28328
2263.9H14698815J68503O4015K0027O0082L0696m4584o3300j0431O0379P6473M1127
$$ plain form
2117.1 800762475 800880969 801054716 801144183 801153362 801236451 801427066 801582277 801629603 801716089 801925004 802105904
2139.5 802105904 802136540 802141845 802287817 802488863 802606106 802724183 802944124 803158402 803273320 803412735
2159.9 803412735 803690612 803995013 804213822 804428279 804773211 805203140 805538476 805767238 806052268 806443036
2180.3 806443036 806801021 807075322 807375848 807737470 808076382 808341920 808594644 808911562 809246540 809517980
2200.7 809517980 809789479 810142338 810465991 810662270 810868323 811198056 811528683 811746180 811912954 812117100
2221.1 812117100 812341809 812520385 812660396 812844038 813061059 813200295 813263178 813384891 813580811 813715816
2241.5 813715816 813786685 813897014 814052522 814174175 814230323 814294517 814416826 814535916 814562738 814570487 814698815
2263.9 814698815 814867318 814931333 814951360 815011442 815042138 814997554 814934254 814923823 814984202 815060675 815101802
2286.3H15101802O3897J17778N6506m6254j0788J31309J63138Q0585Q8811K20716K89917
2308.8H16257417K00451R1433J22786K86221L90828L45528K68519K43246K05637J68442
2329.2H18580508J45912M0949j29819k61128k05815j21891m37677j049400r90033j59085
2349.6H15412521P09415J089871Q66532M69208L7134l75987o54339r35018j253784
2367.9H15365553j390934j389742j312554j134276j036048j026750q94785o56247m96685
2386.3H06027532m14431l41118l10778l41118l67939l80934m25934m49300m41194m43399
2406.7H02111387m41968m50731m88996n10752n01096n04792n27382n56648n76317n78821
2427.1G96973884n95868o16729n95987n87821o13093o00338n80549n94437o05703o14822
$$ plain form
2286.3 815101802 815165699 815283477 815339983 815293729 815282941 815414250 815577388 815657973 815746784 815967500 816257417
2308.8 816257417 816457868 816549301 816672087 816958308 817349136 817694664 817963183 818206429 818412066 818580508
2329.2 818580508 818726420 818767369 818637550 818376422 818170607 818048716 817611039 816561639 815571606 815412521
2349.6 815412521 816121936 817211807 818078339 818547547 818584681 818208694 817554355 816619337 815365553
2367.9 815365553 813974619 812584877 811272323 810138047 809101999 808075249 807180464 806524217 806027532
2386.3 806027532 805613101 805271983 804961205 804620087 804252148 803871214 803445280 802995980 802554786 802111387
2406.7 802111387 801669419 801218688 800729692 800218940 799717844 799213052 798685670 798129022 797552705 796973884
2427.1 796973884 796378016 795761287 795165300 794577479 793964386 793364048 792783499 792189062 791583359 790968537
2447.5G90968537o41346o47425n97239n51522n90205o56962o40452n64337n52595o30497
2467.9G84895957o47545n75960n66900o19590o06597n46217n68091o47605o40869n57780
2488.3G78918803n34714n95867o19829n37813m82499n52952n96703n15222m66943n46217
2508.7G73470044o05762n34117m45664m97162n98014n81085n13733n21302o05881o59526
2529G67907798o01649n52118o20246o72161o08623n78344o58691o97255o12259n36561
2549.4G61769891n88835o66558o23346n33402n39600o12915o14405n56409n77569o51717
2569.8G55805135o47187n68092n51284o31153o70731o04809n39839n86927o69420o35206
2590.2G49700487n50747n64277o40810o53267n84125n91815p10130p52031o90759p01368
$$ plain form
2447.5 790968537 790327191 789679766 789082527 788531005 787940800 787283838 786643386 786079049 785526454 784895957
2467.9 784895957 784248412 783672452 783105552 782485962 781879365 781333148 780765057 780117452 779476583 778918803
2488.3 778918803 778384089 777788222 777168393 776630580 776148081 775595129 774998426 774483204 774016261 773470044
2508.7 773470044 772864282 772330165 771884501 771387339 770789325 770208240 769694507 769173205 768567324 767907798
2529 767907798 767306149 766754031 766133785 765461624 764853001 764274657 763615966 762918711 762306452 761769891
2549.4 761769891 761181056 760514498 759891152 759357750 758818150 758205235 757590830 757034421 756456852 755805135
2569.8 755805135 755157948 754589856 754038572 753407419 752736688 752131879 751592040 751005113 750335693 749700487
2590.2 749700487 749149740 748585463 747944653 747291386 746707261 746115446 745405316 744653285 743962526 743261158
2610.6G43261158q09311q58903q10087q16286r43422j016617r52124r13859r95874
2629G35144675j071751j019180r30667r78232j102685j077593r48429r57906j090527
2647.3G25967705j111328j002550r72510j059294j089155r94981r32872r89914j036942
2665.7G16778159r75728r15348r49383j003087r59456q65876q98838r90153r44733
2684.1G08275557q41737q65340r45271r42051r03249r29534j020014j056612j001537
2702.4F99770212r75728j058638j146734j115143j072824j141250j201332j159310
2718.7F90899253j079023j061082j130223j131535j029432j001656j060485j043559
2735F82362258r22203q62836r36926r92715r21607q57115r10640r64701r24408q72255
$$ plain form
2610.6 743261158 742451847 741592944 740782857 739966571 739023149 738006532 737054408 736140549 735144675
2629 735144675 734072924 733053744 732123077 731144845 730042160 728964567 728016138 727058232 725967705
2647.3 725967705 724856377 723853827 722881317 721822023 720732868 719737887 718805015 717815101 716778159
2665.7 716778159 715802431 714887083 713937700 712934613 711975157 711109281 710210443 709220290 708275557
2684.1 708275557 707433820 706568480 705623209 704681158 703777909 702848375 701828361 700771749 699770212
2702.4 699770212 698794484 697735846 696589112 695473969 694401145 693259895 692058563 690899253
2718.7 690899253 689820230 688759148 687628925 686497390 685467958 684466302 683405817 682362258
2735 682362258 681440055 680577219 679640293 678647578 677725971 676868856 675958216 674993515 674069107 673196852
2755.4F73196852r08136r59218r07361q42869q86262r53317r55224r54330j005828
2773.8F64824307j065970j092255j094579j122952j227259j314223j278639j242221
2790.1F55386209j322805j419127j417995j418412j509189j588643j609444j636327
2806.4F43464267j706302j783848j795947j782179j852751j968443k035439k058149
2822.7F28481209k104401k237559k400875k495289k583921k794861l117442l469229
2839.1F07277632l910005m564941n322218n884886o017745n578160m599333l403604
2855.4E67996740k433657k025664k244830k837301l493726m019439m191876l831803
2871.7E42918444l086210k298474j675725j233637r39608q61168j017093j237691j394987
$$ plain form
2755.4 673196852 672288716 671329498 670422137 669579268 668693006 667739689 666784465 665830135 664824307
2773.8 664824307 663758337 662666082 661571503 660448551 659221292 657907069 656628430 655386209
2790.1 655386209 654063404 652644277 651226282 649807870 648298681 646710038 645100594 643464267
2806.4 643464267 641757965 639974117 638178170 636395991 634543240 632574797 630539358 628481209
2822.7 628481209 626376808 624139249 621738374 619243085 616659164 613864303 610746861 607277632
2839.1 607277632 603367627 598802686 593480468 587595582 581577837 575999677 571400344 567996740
2855.4 567996740 565563083 563537419 561292589 558455288 554961562 550942123 546750247 542918444
2871.7 542918444 539832234 537533760 535858035 534624398 533684790 532823622 531806529 530568838 529173851
2890.1E29173851j525283j702607j953184k196610k379596k596140k910257l276169
2906.4E10634005l656328m102111m634708n142450n413264n330563m940569m249185
2922.7D73164827l264606k075136q61347K27392J264483K331763L290147L947079M241735
2941D82266337M177093L747165K994478K109945J351416Q27193N83440P42019J309692
2959.4E00108778K085567K841473L514647M162073M753888N188763N422890N508602
2975.7E33586681N519271N393803N041838M589498M176497L717482L159166K591729
2992E67775965K061426J514495Q92341K85327j62482m99964q02874r72986r94504r96590
3012.4E68100154j021027j081705j206339j369178j583040j845836k006293j962125
$$ plain form
2890.1 529173851 527648568 525945961 523992777 521796167 519416571 516820431 513910174 510634005
2906.4 510634005 506977677 502875566 498240858 493098408 487685144 482354581 477414012 473164827
2922.7 473164827 469900221 467825085 466963738 467191130 468455613 470787376 474077523 478024602 482266337
2941 482266337 486443430 490190595 493185073 495295018 496646434 497473627 498057067 498799086 500108778
2959.4 500108778 502194345 505035818 508550465 512712538 517466426 522655189 528078079 533586681
2975.7 533586681 539105952 544499755 549541593 554131091 558307588 562025070 565184236 567775965
2992 567775965 569837391 571351886 572244227 572529554 572367072 571867108 571064234 570091248 569096744 568100154
3012.4 568100154 567079127 565997422 564791083 563421905 561838865 559993029 557986736 556024611
3028.7E56024611j864374j882016j977861k031505k053440k146721k268076k318382
3045.1E39482236k342761k368211k358139k361119k390563k381981k334237k233803
3061.4E20711422k083421j959860j845479j704216j583398j514375j479923j427770
3077.7E07112980j373589j352430j321852j246094j124800j017421r84848r80258r68963
3096D96742725r95248j068890j156420j228303j254558j253307j300603j340360j313924
3114.4D85831112j349271j489967j645446j719921j733751j777261j809597j831263
3130.7D72474635j894325j965553k007276k009332k033770k100438k124786k104879
3147D56234276k117127k131969k141267k218544k282530k284020k291829k275735k229452
$$ plain form
3028.7 556024611 554160237 552278221 550300360 548268855 546215415 544068694 541800618 539482236
3045.1 539482236 537139475 534771264 532413125 530052006 527661443 525279462 522945225 520711422
3061.4 520711422 518628001 516668141 514822662 513118446 511535048 510020673 508540750 507112980
3077.7 507112980 505739391 504386961 503065109 501819015 500694215 499676794 498691946 497711688 496742725
3096 496742725 495747477 494678587 493522167 492293864 491039306 489785999 488485396 487145036 485831112
3114.4 485831112 484481841 482991874 481346428 479626507 477892756 476115495 474305898 472474635
3130.7 472474635 470580310 468614757 466607481 464598149 462564379 460463941 458339155 456234276
3147 456234276 454117149 451985180 449843913 447625369 445342839 443058819 440766990 438491255 436261803
3165.4D36261803k243131k319366k356619k324462k301246k317905k297014k251327
3181.7D17850733k273798k308548k273917k247900k239853k212077k208382k192020
3198C99894238k143920k088904k021015j957744j928658j929402j934022j916229j899213
3216.4C82075131j938939j970887j943678j929939j945883j964420j993984k022415
3232.7C66364986k075374k166480k233207k246649k261877k333760k416879k454072
3249C48176688k460867k479464k487600k491236k523034k518475k452761k382398k331823
3267.4C26049030k242804k099216j931488j771659j656234j544714j400113j255840
3283.7C12146962j129031r92120q61853p81208o96212n80073n14656m91798m26978
$$ plain form
3165.4 436261803 434018672 431699306 429342687 427018225 424716979 422399074 420102060 417850733
3181.7 417850733 415576935 413268387 410994470 408746570 406506717 404294640 402086258 399894238
3198 399894238 397750318 395661414 393640399 391682655 389753997 387824595 385890573 383974344 382075131
3216.4 382075131 380136192 378165305 376221627 374291688 372345805 370381385 368387401 366364986
3232.7 366364986 364289612 362123132 359889925 357643276 355381399 353047639 350630760 348176688
3249 348176688 345715821 343236357 340748757 338257521 335734487 333216012 330763251 328380853 326049030
3267.4 326049030 323806226 321707010 319775522 318003863 316347629 314802915 313402802 312146962
3283.7 312146962 311017931 310025811 309163958 308382750 307686538 307106465 306591809 306100011 305673033
3302C05673033l23117k80291l25620l33160k81721k44290k24918k19941j94133j68740
3322.4C03077102j95772k68161l41892l31492k90155l06100l56763m14938m71711n34952
3342.8B99565166o17414o67125o40423o40928p13647p77662p79867p26729p15405p76410
3363.2B92509556p92653p50333p56263q31843q60154p73549o80715o56903o80357o57767
3383.6B85069019n40764l77684k68519l46721n05328m87715k98589j26064j69903l54797
3404B81592935l03685r4802j5765p033M887L4392J23710K11835K67863M05520N86629
3426.5B82806486O91384P07656P95126R53466R00447O89179O95646R45627J139671
3444.8B90324688J173198J164168J236737J322627J416356J549869J602084J536309
$$ plain form
3302 305673033 305349916 305069625 304744005 304410845 304129124 303884834 303659916 303439975 303245842 303077102
3322.4 303077102 302881330 302613169 302271277 301939785 301649630 301343530 300986767 300571829 300100118 299565166
3342.8 299565166 298947752 298280627 297640204 296999276 296285629 295507967 294728100 294001371 293285966 292509556
3363.2 292509556 291716903 290966570 290210307 289378464 288518310 287744761 287064046 286407143 285726786 285069019
3383.6 285069019 284528255 284150571 283882052 283535331 283030003 282542288 282243699 282117635 281947732 281592935
3404 281592935 281289250 281194448 281178683 281171650 281176537 281210929 281334639 281546474 281814337 282219857 282806486
3426.5 282806486 283497870 284205526 285000652 285954118 286854565 287543744 288239390 289185017 290324688
3444.8 290324688 291497886 292662054 293898791 295221418 296637774 298187643 299789727 301326036
3461.1C01326036J542926J761079J940519J783073J469731J454592J739979K041399
3477.4C15059334K121359J973182J914442K055883K135068K081335K118230K209335
3493.8C31668168K221942K193898K226770K278686K219200K133906K179295K337336
3510.1C49459201K519816K562583K446890K416610K527148K698809K736985K604843
3526.4C69972885K569854K690613K815932K935380K981812K919912L022134L213555
3542.7C93122077L212452L050595K999366L136247L297717L370553L414571L511638
3559D19115216L570705L527612L533244L858745M184306M089683L937840M042596M249334
3577.4D54109281M421860M513890M440278M302859M426002M749179M731536M642159
$$ plain form
3461.1 301326036 302868962 304630041 306570560 308353633 309823364 311277956 313017935 315059334
3477.4 315059334 317180693 319153875 321068317 323124200 325259268 327340603 329458833 331668168
3493.8 331668168 333890110 336084008 338310778 340589464 342808664 344942570 347121865 349459201
3510.1 349459201 351979017 354541600 356988490 359405100 361932248 364631057 367368042 369972885
3526.4 369972885 372542739 375233352 378049284 380984664 383966476 386886388 389908522 393122077
3542.7 393122077 396334529 399385124 402384490 405520737 408818454 412189007 415603578 419115216
3559 419115216 422685921 426213533 429746777 433605522 437789828 441879511 445817351 449859947 454109281
3577.4 454109281 458531141 463045031 467485309 471788168 476214170 480963349 485694885 490337044
3593.7D90337044M782349M914284M890501M867911M824520M640579M662096M823804
3610E28743088M815340M847765M802823M747272M995525M986942M601955M239440M417062
3628.4E71197212M945576M677236M299343M226625M182636M166723M104733L865123
3644.7F05665207L616691L773033M105210L888607L517926L639460L743052L404558
3661F35353744L101587L018618K833545K676964K879500K639175K199530K481640K729654
3679.4F59913957K660096K606630K452493K201140K041101K113343K180397K046704
3695.7F78215861J797259J564086J476943J561165J580894J376808J027763R84788
3712F89585567J423418J553476J340330J183748J071811R46819R72092J150012J095355
$$ plain form
3593.7 490337044 495119393 500033677 504924178 509792089 514616609 519257188 523919284 528743088
3610 528743088 533558428 538406193 543209016 547956288 552951813 557938755 562540710 566780150 571197212
3628.4 571197212 576142788 580820024 585119367 589345992 593528628 597695351 601800084 605665207
3644.7 605665207 609281898 613054931 617160141 621048748 624566674 628206134 631949186 635353744
3661 635353744 638455331 641473949 644307494 646984458 649863958 652503133 654702663 657184303 659913957
3679.4 659913957 662574053 665180683 667633176 669834316 671875417 673988760 676169157 678215861
3695.7 678215861 680013120 681577206 683054149 684615314 686196208 687573016 688600779 689585567
3712 689585567 691008985 692562461 693902791 695086539 696158350 697105169 698077261 699227273 700322628
3730.3G00322628Q64089P46369Q16584J039981J045108N46575L22997R68934R59694
3748.7G07632959M27067O66619J144230J028597O79553O87063Q20040P86305P29143
3767.1G14601576N91755N81205P52628P73609O44803N51462N84125N40495M45068N20706
3787.5G20587432O80864P45833N91159L88682M47750M22060L80576O75798N38289L42012
3807.8G25800455O49035P41064L90887J68086L52203K39134K37942O31154O82175N81503
3828.2G30473638M48763L51012L93986K26617M4465K92063N12838N28217N70535N69523
3848.6G34411657J68204n69284j75416Q53836P89106L84092K20120K86103L11255J16885
3869G36796558J47462L46303M23133L99470J53184J43588L45588K89499K78175J90437
$$ plain form
3730.3 700322628 701186717 701933086 702749670 703789651 704834759 705381334 705704331 706673265 707632959
3748.7 707632959 708060026 708726645 709870875 710899472 711579025 712266088 713086128 713872433 714601576
3767.1 714601576 715193331 715774536 716527164 717300773 717945576 718497038 719081163 719621658 720066726 720587432
3787.5 720587432 721268296 722014129 722605288 722993970 723441720 723863780 724244356 724920154 725458443 725800455
3807.8 725800455 726449490 727190554 727581441 727749527 728101730 728340864 728578806 729209960 729892135 730473638
3828.2 730473638 730922401 731273413 731667399 731894016 731938481 732230544 732743382 733271599 733842134 734411657
3848.6 734411657 734579861 734010577 733835161 734688997 735478103 735862195 736082315 736368418 736679673 736796558
3869 736796558 736944020 737290323 737713456 738112926 738266110 738409698 738755286 739044785 739322960 739513397
3889.4G39513397K4617K37286M38869K21252k4318l6419N5313K92004L95178K51353
3909.8G41368532K19703K36273M6670n3346J71661K95818J59860O7353Q5652J01924
3930.2G42700100J30236J61946J60098J77026J60575J12772J59204J67787Q0168O2823
3950.6G44072735J19806J73270J61231J03295P8320R1374J18792J46568J55747J35124
3971G45356262J28209J21534O9559M7505J44541K59340K19881Q7560M9591R6857P2539
3993.4G46653378K6345R0778
3997.5G46770501
$$ plain form
3889.4 739513397 739538014 739775300 740214169 740435421 740411103 740374684 740429997 740722001 741117179 741368532
3909.8 741368532 741588235 741824508 741871178 741817832 741989493 742285311 742445171 742512524 742598176 742700100
3930.2 742700100 742830336 742992282 743152380 743329406 743489981 743602753 743761957 743929744 744009912 744072735
3950.6 744072735 744192541 744365811 744527042 744630337 744708657 744800031 744918823 745065391 745221138 745356262
3971 745356262 745484471 745606005 745675564 745723069 745867610 746126950 746346831 746434391 746483982 746580839 746653378
3993.4 746653378 746679723 746770501
3997.5 746770501
##END=$$ End of the data block
