##TITLE=G08-51-CE $$ Begin of the data block
##JCAMP-DX=5.00 $$ ACD/SpecManager v 10.08
##SPECTROMETER/DATA SYSTEM=Alpha
##DATE=22 Oct 2013 10:53:20
##DATA TYPE=INFRARED SPECTRUM
##DATA CLASS=XYDATA
##ORIGIN=
##OWNER=
##NPOINTS=1765
##FIRSTX=399.75695801
##LASTX=3997.56933594
##MAXX=3997.56933594
##MINX=399.75695801
##MAXY=0.81889087
##MINY=0.28115869
##XFACTOR=1.0000000000
##YFACTOR=1.000000000000000e-9
##FIRSTY=0.54046828
##DELTAX=2.03957629
##XUNITS=1/CM
##YUNITS=ARBITRARY UNITS
##XYDATA=(X++(Y..Y))
$$ plain form
399.8 540468276 538535058 537696540 536623716 534977078 534331381 535661280 536940634 536209643 534729064
418.1 534729064 534545720 534274399 532519877 530602932 529652834 528694630 526937962 525503039 525431693
436.5 525431693 525921881 526107490 526743472 528326511 529722750 529987335 529691875 529629707 529161811 527432740
456.9 527432740 525317252 524111569 523111939 520983994 518106341 515990734 514535427 512491941 510239422
475.2 510239422 508875549 508266389 507520735 506306529 505391002 505050063 504110575 502140820 500363231
493.6 500363231 499245048 497641504 495080382 492560148 490708888 488630056 485579103 482536823
509.9 482536823 480339676 478200525 475395441 472672164 471049041 470047951 468877017 468019098 468179643
528.3 468179643 468907088 469446599 470190972 472169995 475025564 477302253 478646547 479686767 480438352
$$ packed form
399.8E40468276j933218q38518j072824j646638o45697J329899J279354p30991j480579
418.1E34729064j83344k71321j754522j916945r50098r58204j756668j434923p1346
436.5E25431693M90188J85609O35982J583039J396239K64585k95460o2168m67896j729071
456.9E27432740k115488j205683r99630k127945k877653k115607j455307k043486k252519
475.2E10239422j363873o09160p45654j214206r15527l40939r39488j969755j777589
493.6E00363231j118183j603544k561122k520234j851260k078832l050953l042280
509.9D82536823k197147k139151k805084k723277j623123j001090j170934q57919J60545
528.3D68179643P27445N39511P44373J979023K855569K276689J344294J040220P51585
$$ plain form
546.6 480438352 480327725 479477525 478675991 478067905 476917773 474920511 472868979 471177459 469155043
565 469155043 466535330 464257032 463041812 462608159 462636262 463473976 465519756 468189001 470723987
583.3 470723987 473289341 475993484 478141218 479262918 479718089 480152816 480624646 480728745 480629981
601.7 480629981 480801076 481155246 481306672 481337786 481655329 482346952 483108938 483884573 485266626 487622589
622.1 487622589 490459085 493178129 495835990 498576403 501045704 502902746 504530489 506468058
638.4 506468058 508444488 509902418 511032343 512340903 513656199 514417768 514672279 515041232 515684128
656.7 515684128 516110003 516224146 516560733 517399013 518576264 519596398 520490766 521891952 523598015
675.1 523598015 525039792 526358962 528037667 529712379 530717015 531290531 531910717 532255292 531751454
$$ packed form
546.6D80438352j10627q50200q01534o08086j150132j997262k051532j691520k022416
565D69155043k619713k278298j215220m33653K8103Q37714K045780K669245K534986
583.3D70723987K565354K704143K147734J121700M55171M34727M71830J04099r8764
601.7D80629981J71095L54170J51426L1114L17543O91623P61986P75635J382053K355963
622.1D87622589K836496K719044K657861K740413K469301J857042J627743J937569
638.4E06468058J976430J457930J129925J308560J315296P61569K54511L68953O42896
656.7E15684128M25875J14143L36587Q38280J177251J020134Q94368J401186J706063
675.1E23598015J441777J319170J678705J674712J004636N73516O20186L44575n03838
$$ plain form
693.5 531751454 530615270 529658914 529318631 529447198 530143142 531777501 534185648 536729813 539173424
711.8 539173424 541962326 545459688 549337626 553136408 557075083 561493218 565978646 569913805
728.1 569913805 573362112 576600015 579364061 581278265 582534432 583614767 584496975 584817231 584606528
746.5 584606528 584379911 584297001 583884716 582872570 581690490 580834508 580158293 579485178 579409957 580665410
766.9 580665410 583173573 586442232 590345204 595000565 600047529 604697883 608651161 612215519
783.2 612215519 615479887 618101478 620062351 621887445 623966098 626077592 628106177 630563259
799.5 630563259 633660316 636695027 639056861 641062796 643110871 644835770 645703614 646003842 646353781
817.9 646353781 646568894 645943165 644436300 642652571 640751481 638453543 635904074 633561373 631427050
$$ packed form
693.5E31751454j136184r56356l40283J28567O95944J634359K408147K544165K443611
711.8E39173424K788902L497362L877938L798782L938675M418135M485428L935159
728.1E69913805L448307L237903K764046J914204J256167J080335Q82208L20256k10703
746.5E84606528k26617q2910m12285j012146j182080q55982o76215o73115p5221J255453
766.9E80665410K508163L268659L902972M655361N046964M650354L953278L564358
783.2F12215519L264368K621591J960873J825094K078653K111494K028585K457082
799.5F30563259L097057L034711K361834K005935K048075J724899Q67844L00228L49939
817.9F46353781K15113o25729j506865j783729j901090k297938k549469k342701k134323
$$ plain form
836.2 631427050 629104137 626523793 624187350 622419119 620932341 619467676 618312299 617748499 617396772
854.6 617396772 616845787 616577804 617654264 620544195 624771237 629739165 635146737 640388072 644503355
872.9 644503355 647074580 648314536 648238540 646516204 643267572 639246881 635013163 630538344 625761092
891.3 625761092 621078432 616882622 612899244 608544946 603729725 598701656 593371511 587445021
907.6 587445021 581066966 574745357 568708599 562975109 557855427 553875268 551238954 549540043
923.9 549540043 548254251 547275066 546676934 546274006 545815766 545376897 545094848 544752538 543822706 541643322
944.3 541643322 537602842 531456888 523485780 514376998 504886150 495342672 485601157 475616634
960.6 475616634 465657383 455893219 446245372 436757863 427826583 419871688 412974387 407092899
$$ packed form
836.2F31427050k322913k580344k336443j768231j486778j464665j155377n63800l51727
854.6F17396772n50985k67983J076460K889931M227042M967928N407572N241335M115283
872.9F44503355K571225J239956p5996j722336l248632m020691m233718m474819m777252
891.3F25761092m682660m195810l983378m354298m815221n028069n330145n926490
907.6E87445021o378055o321609o036758n733490n119682l980159k636314j698911
923.9E49540043j285792r79185n98132m02928m58240m38869k82049l42310r29832k179384
944.3E41643322m040480o145954p971108r108782r490848r543478r741515r984523
960.6D75616634r959251r764164r647847r487509q931280p954895o897301n881488
$$ plain form
977 407092899 402362168 398886859 396440744 394580781 393046916 391809404 390747160 389656365 388586521
995.3 388586521 387811840 387456477 387330204 387124747 386671394 385885894 384634733 382916123 381001681
1013.7 381001681 379149348 377355248 375477314 373510689 371577740 369635135 367547661 365404099
1030 365404099 363390267 361433387 359321415 357048571 354847640 352896661 351133585 349518806 348259568
1048.3 348259568 347589433 347550035 348071456 349084646 350530803 352276236 354217798 356323749 358245224
1066.7 358245224 359181017 358567804 356875688 355311096 354814649 355636775 357674658 360790402 364736289
1085 364736289 369111627 373579234 377971470 382174253 386017859 389285564 391877860 393877476 395450085
1103.4 395450085 396861106 398501217 400629073 403152078 405826986 408513725 411122084 413509756
$$ packed form
977D07092899m730731l475309k446115j859963j533865j237512j062244j090795j069844
995.3C88586521p74681l55363j26273k05457m53353p85500j251161j718610j914442
1013.7C81001681j852333j794100j877934j966625j932949j942605k087474k143562
1030C65404099k013832j956880k111972k272844k200931j950979j763076j614779j259238
1048.3C48259568o70135l9398N21421J013190J446157J745433J941562K105951J921475
1066.7C58245224R35793o13213j692116j564592m96447Q22126K037883L115744L945887
1085C64736289M375338M467607M392236M202783L843606L267705K592296J999616J572609
1103.4C95450085J411021J640111K127856K523005K674908K686739K608359K387672
$$ plain form
1119.7 413509756 415533006 417246282 418968379 421047688 423669189 426643908 429498523 431883633
1136 431883633 433546126 434297830 434243023 433702886 432955056 432126552 431318820 430777222 430789292 431516647
1156.4 431516647 433040559 435409814 438552827 442265809 446350008 450811714 455838770 461535662
1172.7 461535662 467807800 474440157 481254458 488110602 494781315 501017213 506665170 511533380
1189.1 511533380 515337229 517928362 519402146 519972444 519814551 519113302 518167913 517263114 516514719
1207.4 516514719 515957594 515601933 515369892 515067399 514527440 513764083 512830019 511666536 510204017
1225.8 510204017 508511901 506752193 505047917 503456056 502096832 501150250 500715554 500812650 501440167
1244.1 501440167 502605379 504246831 506191134 508259237 510424018 512682796 514921844 517089963
$$ packed form
1119.7D13509756K023250J713276J722097K079309K621501K974719K854615K385110
1136D31883633J662493P51704n4807n40137p47830q28504q07732n41598J2070P27355
1156.4D31516647J523912K369255L143013L712982M084199M461706N027056N696892
1172.7D61535662O272138O632357O814301O856144O670713O235898N647957M868210
1189.1E11533380L803849K591133J473784N70298j57893p01249r45389r04799p48395
1207.4E16514719n57125l55661k32041l02493n39959p63357r34064j163483j462519
1225.8E10204017j692116j759708j704276j591861j359224r46582m34696R7096O27517
1244.1E01440167J165212J641452J944303K068103K164781K258778K239048K168119
$$ plain form
1260.4 517089963 519229293 521370411 523502648 525598824 527612150 529425263 530909121 532072663
1276.8 532072663 533025861 533924699 534876347 535862863 536840081 537726343 538378596 538630724 538369060 537571371
1297.2 537571371 536314249 534703732 532862484 530935287 529018164 527238965 525749087 524641037
1313.5 524641037 523990631 523847401 524119675 524553180 524782896 524462700 523407817 521694183 519599974
1331.8 519599974 517419517 515393853 513674259 512382925 511523008 510923743 510388076 509723544 508763790
1350.2 508763790 507492721 505966187 504195929 502179325 499774635 496770948 493228257 489415288
1366.5 489415288 485651642 482396632 479455799 476257384 472761899 468988806 464842260 460629135
1382.8 460629135 457023025 454488367 453134209 452562362 452188820 451842934 451745242 452035278 452789336
$$ packed form
1260.4E17089963K139330K141118K132237K096176K013326J813113J483858J163542
1276.8E32072663R53198Q98838R51648R86516R77218Q86262O52253K52128k61664p97689
1297.2E37571371j257122j610517j841248j927197j917123j779199j489878j108050
1313.5E24641037o50406j43230K72274M33505K29716l20196j054883j713634k094209
1331.8E19599974k180457k025664j719594j291334q59917n99265n35667o64532r59754
1350.2E08763790j271069j526534j770258k016604k404690l003687l542691l812969
1366.5D89415288l763646l255010k940833l198415l495485l773093m146546m213125
1382.8D60629135l606110k534658j354158n71847l73542l45886r7692K90036P54058
$$ plain form
1401.2 452789336 454023421 455765337 457860470 460040689 462254405 464500666 466770381 469219118
1417.5 469219118 472115338 475018382 477642775 480041623 481945783 483174473 483698368 483535618 482726038
1435.9 482726038 481843293 481547624 481643409 481852472 482115299 482407212 482643068 482804120 483241290 484739423
1456.2 484739423 487672031 490820348 493722230 496785849 500245333 504312456 509748995 517312944
1472.6 517312944 525395691 532040238 537070751 540490985 542305887 542480588 540969133 537597656
1488.9 537597656 532756209 527627051 521875024 514809191 507688701 501365125 495329559 487583876
1505.2 487583876 476639062 466853112 458871156 451126128 444296718 439270169 436109602 433514059
1521.5 433514059 430838615 428104252 425183058 422556996 420147508 417735100 415930837 414633781
$$ packed form
1401.2D52789336J234085J741916K095133K180219K213716K246261K269715K448737
1417.5D69219118K896220K903044K624393K398848J904160J228690N23895j62750q09580
1435.9D82726038q82745k95669R5785K09063K62827K91913K35856J61052M37170J498133
1456.2D84739423K932608L148317K901882L063619L459484M067123N436539P563949
1472.6E17312944Q082747O644547N030513L420234J814902J74701j511455l371477
1488.9E37597656m841447n129158n752027p065833p120490o323576o035566p745683
1505.2D87583876j0944814r785950p981956p745028o829410n026549l160567k595543
1521.5D33514059k675444k734363k921194k626062k409488k412408j804263j297056
$$ plain form
1537.8 414633781 413279772 412612736 413142502 414509386 416574061 419395447 422925353 426950186 431117624
1556.2 431117624 436097711 442060351 446661711 450451523 454114228 457531601 460784048 463412166
1572.5 463412166 465413123 467177778 468564570 469403267 469716817 469644010 469227374 468412250 467039257
1590.9 467039257 465062946 462444782 459242582 455427140 450774997 445242226 438993484 432002902
1607.2 432002902 423986346 415265441 406365037 396342307 384493500 373713315 363408267 351398289
1623.5 351398289 339455068 328515053 318179905 309198141 300951749 292541325 286667973 284060031
1639.8 284060031 283158779 283296347 284372002 286355019 288481116 290993035 294854611 298855722 302770585
1658.2 302770585 307508528 313471019 320274949 326932728 334221214 342648864 350665897 358863652
$$ packed form
1537.8D14633781j354009o67036N29766J366884K064675K821386L529906M024833M167438
1556.2D31117624M980087N962640M601360L789812L662705L417373L252447K628118
1572.5D63412166K000957J764655J386792Q38697L13550p2807m16636q15124j372993
1590.9D67039257j976311k618164l202200l815442m652143n532771o248742o990582
1607.2D32002902q016556q720905q900404j0022730j1848807j0780185j0305048j2009978
1623.5C51398289j1943221j0940015j0335148q981764q246392q410424n873352k607942
1639.8B84060031r01252J37568J075655J983017K126097K511919L861576M001111L914863
1658.2C02770585M737943N962491O803930O657779P288486Q427650Q017033Q197755
$$ plain form
1674.5 358863652 367845565 376392454 384514153 393603295 405266166 416678965 426924407 438215911
1690.8 438215911 450219929 464576185 481237411 497944146 516085505 531495512 544232905
1705.1 544232905 556631505 567343950 576426029 584335685 591420233 598395526 604712009 609683335
1721.4 609683335 613894582 617765665 621220708 624367416 627158046 630016983 633200407 636178970
1737.7 636178970 639271498 642865241 646910608 651342750 656110168 661448061 667368710 673029125
1754 673029125 678392768 683708370 688862324 694092095 698989451 703333914 707479954 711429834 715289652
1772.4 715289652 718973637 722191274 725159228 727993488 730570853 732919514 735178828 737297416
1788.7 737297416 739183903 741087556 743072510 744942904 746608019 748202145 749870241 751524329
$$ packed form
1674.5C58863652Q981913Q546889Q121699R089142J1662871J1412799J0245442J1291504
1690.8D38215911J2004018J4356256J6661226J6706735J8141359J5410007J2737393
1705.1E44232905J2398600J0712445R082079P909656P084548O975293O316483M971326
1721.4F09683335M211247L871083L455043L146708K790630K858937L183424K978563
1737.7F36178970L092528L593743M045367M432142M767418N337893N920649N660415
1754F73029125N363643N315602N153954N229771M897356M344463M146040L949880L859818
1772.4G15289652L683985L217637K967954K834260K577365K348661K259314K118588
1788.7G37297416J886487J903653J984954J870394J665115J594126J668096J654088
$$ plain form
1805 751524329 753042758 754429996 755833983 757267833 758605361 759805799 761017740 762289464 763504446
1823.4 763504446 764612675 765663803 766767740 767949939 769022524 769928992 770868897 771834671 772619724
1841.7 772619724 773266375 774095356 775028527 775787413 776408672 777087450 777873576 778572202 779128313 779715240
1862.1 779715240 780394554 780946732 781292617 781756163 782476008 783176422 783661544 784090877 784670115 785319448
1882.5 785319448 785834789 786245942 786733925 787330210 787861168 788285375 788777232 789319098 789740324 790048599
1902.9 790048599 790428042 790895641 791266322 791515112 791806340 792176306 792488098 792717278 792988539 793386877
1923.3 793386877 793804228 794060647 794226050 794481397 794779897 794967473 795103669 795321226 795569122 795725167
1943.7 795725167 795828342 796023786 796322644 796551764 796658039 796830833 797136128 797400832 797531188 797664642
$$ packed form
1805G51524329J518429J387238J403987J433850J337528J200438J211941J271724J214982
1823.4G63504446J108229J051128J103937J182199J072585R06468R39905R65774P85053
1841.7G72619724O46651Q28981R33171P58886O21259O78778P86126O98626N56111N86927
1862.1G79715240O79314N52178L45885M63546P19845P00414M85122M29333N79238O49333
1882.5G85319448N15341M11153M87983N96285N30958M24207M91857N41866M21226L08275
1902.9G90048599L79443M67599L70681K48790K91228L69966L11792K29180K71261L98338
1923.3G93386877M17351K56419J65403K55347K98500J87576J36196K17557K47896J56045
1943.7G95725167J03175J95444K98858K29120J06275J72794L05295K64704J30356J33454
$$ plain form
1964.1 797664642 797899425 798134625 798264146 798381448 798618913 798887610 799021840 799070179 799222052 799423337
1984.5 799423337 799516082 799546957 799650073 799826622 799943686 799979687 800060630 800207555 800279737 800234973 800180256
2006.9 800180256 800197124 800183952 800027549 799853981 799811542 799796581 799656868 799458385 799316227 799208820
2027.3 799208820 799018800 798770666 798611701 798536658 798396826 798181832 798045397 798010111 797948122 797810793
2047.7 797810793 797726214 797764599 797818303 797797382 797782540 797889411 798038423 798094153 798114657 798229396 798384964
2070.2 798384964 798457861 798472166 798579752 798791230 798925698 798934579 798987448 799170732 799336970 799388289 799458861
2092.6 799458861 799656391 799845219 799933016 800045311 800256550 800436318 800492406 800561845 800769329 801009297
2113 801009297 801130116 801190376 801324308 801505327 801610053 801649034 801747084 801904678 801992655 802016437 802160323
$$ packed form
1964.1G97664642K34783K35200J29521J17302K37465K68697J34230M8339J51873K01285
1984.5G99423337R2745L0875J03116J76549J17064L6001Q0943J46925P2182m4764n4717
2006.9H00180256J6868j3172j56403j73568m2439j4961j39713j98483j42158j07407
2027.3G99208820j90020k48134j58965p5043j39832k14994j36435l5286o1989j37329
2047.7G97810793q4579L8385N3704k0921j4842J06871J49012N5730K0504J14739J55568
2070.2G98384964P2897J4305J07586K11478J34468Q881N2869J83284J66238N1319P0572
2092.6G99458861J97530J88828Q7797J12295K11239J79768N6088O9439K07484K39968
2113H01009297J20819O0260J33932J81019J04726L8981R8050J57594Q7977K3782J43886
$$ plain form
2135.4 802160323 802427471 802599072 802598298 802618027 802794993 802988589 803069055 803156614 803370297 803592682 803715587
2157.9 803715587 803851783 804134488 804470658 804708481 804912686 805252552 805692613 806046546 806313872 806638181
2178.2 806638181 807024121 807347417 807595730 807894707 808285654 808636248 808881044 809134185 809461594 809794903
2198.6 809794903 810072243 810348034 810680568 810981989 811169505 811364830 811687469 812027276 812249720 812405109
2219 812405109 812627494 812904716 813107371 813231409 813404262 813623071 813746035 813792109 813925922 814149439
2239.4 814149439 814289272 814325094 814408481 814576328 814712465 814756811 814806521 814935565 815078080 815141857
2259.8 815141857 815165401 815247416 815356612 815408826 815459967 815573215 815630436 815557778 815463483 815447271 815507293
2282.3 815507293 815584958 815619528 815660775 815759897 815825939 815803707 815803289 815928340 816070080 816134155 816237807
$$ packed form
2135.4H02160323K67148J71601p74J9729J76966J93596Q0466Q7559K13683K22385J22905
2157.9H03715587J36196K82705L36170K37823K04205L39866M40061L53933K67326L24309
2178.2H06638181L85940L23296K48313K98977L90947L50594K44796K53141L27409L33309
2198.6H09794903K77340K75791L32534L01421J87516J95325L22639L39807K22444J55389
2219H12405109K22385K77222K02655J24038J72853K18809J22964M6074J33813K23517
2239.4H14149439J39833L5822Q3387J67847J36137M4346M9710J29044J42515O3777
2259.8H15141857K3544Q2015J09196N2214N1141J13248N7221p2658r4295j6212O0022
2282.3H15507293P7665L4570M1247R9122O6042k2232m18J25051J41740O4075J03652
$$ plain form
2304.7 816237807 816475391 816766202 816963673 817021310 817104876 817382932 817742050 818024576 818251193 818481863
2325.1 818481863 818676949 818799436 818872094 818890870 818787456 818524778 818309128 818207264 817785323 816758275
2345.5 816758275 815838337 815760493 816469431 817404032 818119287 818657696 818797410 818343580 817594051 816708207
2365.9 816708207 815566182 814237535 812897742 811677933 810611486 809602976 808601975 807710767
2382.2 807710767 807051361 806572378 806160808 805801988 805487454 805165946 804820001 804450810 804052770 803632379
2402.6 803632379 803182602 802700341 802219093 801757753 801282823 800791502 800283432 799741328 799185455 798618853
2423 798618853 798038244 797455072 796865463 796263635 795678079 795111299 794517577 793894529 793286383 792705536
2443.4 792705536 792125821 791521072 790873051 790218353 789613545 789029777 788401783 787750781 787148118 786595166
$$ packed form
2304.7H16237807K37584K90811J97471N7637Q3566K78056L59118K82526K26617K30670
2325.1H18481863J95086J22487P2658J8776j03414k62678k15650j01864m21941j027048
2345.5H16758275r19938p7844P08938R34601P15255N38409J39714m53830p49529q85844
2365.9H16708207j142025j328647j339793j219809j066447j008510j001001q91208
2382.2H07710767o59406m78983m11570l58820l14534l21508l45945l69191l98040m20391
2402.6H03632379m49777m82261m81248m61340m74930m91321n08070n42104n55873n66602
2423G98618853n80609n83172n89609o01828n85556n66780n93722o23048o08146n80847
2443.4G92705536n79715o04749o48021o54698o04808n83768o27994o51002o02663n52952
$$ plain form
2463.8 786595166 786015093 785366237 784744203 784207225 783663690 783050835 782415390 781835973 781277716 780638754
2484.2 780638754 779981256 779416084 778873801 778270006 777678192 777178824 776698351 776120782 775492549 774966359
2504.6 774966359 774532437 774019420 773413002 772864699 772399902 771878958 771270871 770710230 770231485 769724607
2525 769724607 769126892 768495083 767912030 767344654 766688704 766000450 765412986 764854312 764195204 763485730
2545.4 763485730 762853801 762295961 761695325 761030257 760391176 759829998 759302080 758728921 758127093 757567465
2565.8 757567465 757005334 756366134 755714118 755131841 754572690 753959060 753312588 752716362 752157032 751528502
2586.2 751528502 750835657 750210106 749690950 749132335 748461008 747813404 747250915 746646404 745916486 745149672
2606.6 745149672 744450510 743752420 742957294 742115080 741302788 740479410 739552438 738553405 737598777 736684144
$$ packed form
2463.8G86595166n80073o48856o22034n36978n43535o12855o35445n79417n58257o38962
2484.2G80638754o57498n65172n42283o03795n91814m99368m80473n77569o28233n26190
2504.6G74966359m33922n13017o06418n48303m64797n20944o08087n60641m78745n06878
2525G69724607n97715o31809n83053n67376o55950o88254n87464n58674o59108p09474
2545.4G63485730o31929n57840o00636o65068o39081n61178n27918n73159o01828n59628
2565.8G57567465n62131o39200o52016n82277n59151o13630o46472n96226n59330o28530
2586.2G51528502o92845o25551n19156n58615o71327o47604n62489o04511p29918p66814
2606.6G45149672o99162o98090p95126q42214q12292q23378r26972r99033r54628r14633
$$ plain form
2626.9 736684144 735705674 734649301 733620107 732660890 731655896 730559826 729517519 728576243 727595031
2645.3 727595031 726491034 725377381 724366486 723367333 722293913 721235871 720273793 719335735 718319297
2663.7 718319297 717272401 716314673 715397537 714402199 713369429 712424636 711580753 710710108 709751725
2682 709751725 708809435 707955539 707090080 706146955 705217063 704334319 703398645 702354372 701296091 700299442
2702.4 700299442 699300110 698223412 697089314 695989430 694932044 693811059 692603230 691393733
2718.7 691393733 690246046 689136505 688035429 686991632 686018109 685039937 683983684 682907701 681957424
2737.1 681957424 681101084 680171192 679168463 678229630 677353323 676426172 675448954 674514294 673651755
2755.4 673651755 672778487 671831071 670895457 670040309 669171572 668199778 667203963 666276455 665336132 664281964
$$ packed form
2626.9G36684144r78470j056373j029194r59217j004994j096070j042307r41276r81212
2645.3G27595031j103997j113653j010895r99153j073420j058042r62078r38058j016438
2663.7G18319297j046896r57728r17136r95338j032770r44793q43883q70645r58383
2682G09751725r42290q53896q65459r43125r29892q82744r35674j044273j058281r96649
2702.4G00299442r99332j076698j134098j099884j057386j120985j207829j209497
2718.7F91393733j147687j109541j101076j043797r73523r78172j056253j075983r50277
2737.1F81957424q56340r29892j002729r38833q76307r27151r77218r34660q62539
2755.4F73651755q73268r47416r35614q55148q68737r71794r95815r27508r40323j054168
$$ plain form
2775.8 664281964 663162649 662069201 660963476 659754038 658476591 657221377 655975819 654643595
2792.2 654643595 653195202 651725829 650275230 648770213 647195876 645609558 644003034 642315209
2808.5 642315209 640543580 638742089 636937499 635071039 633088768 631044507 628991365 626882672
2824.8 626882672 624635279 622244239 619767666 617191613 614401817 611297548 607829094 603868365
2841.1 603868365 599227846 593862116 587958813 581936538 576355100 571732581 568331182 565942109
2857.4 565942109 563942552 561693907 558851600 555344760 551315784 547133744 543295801 540197611
2873.7 540197611 537910521 536252558 535029948 534069002 533164084 532131732 530904233 529498637 527921379
2892.1 527921379 526181519 524257779 522110164 519743800 517143428 514242589 510977447 507322490
$$ packed form
2775.8F64281964j119315j093448j105725j209438j277447j255214j245558j332224
2792.2F54643595j448393j469373j450599j505017j574337j586318j606524j687825
2808.5F42315209j771629j801491j804590j866460j982271k044261k053142k108693
2824.8F26882672k247393k391040k476573k576053k789796l104269l468454l960729
2841.1F03868365m640519n365730n903303o022275n581438m622519l401399k389073
2857.4E65942109j999557k248645k842307l506840m028976m182040l837943l098190
2873.7E40197611k287090j657963j222610r60946r04918j032352j227499j405596j577258
2892.1E27921379j739860j923740k147615k366364k600372k900839l265142l654957
$$ plain form
2908.4 507322490 503222883 498585582 493439645 488010854 482639492 477684736 473475844 470258325
2924.7 470258325 468180716 467277557 467476755 468750030 471103162 474383265 478300422 482551038 486785442
2943.1 486785442 490580201 493578792 495688856 497072160 497917950 498469800 499198526 500536382 502629697
2961.4 502629697 505472422 509014428 513205945 517977953 523168027 528569102 534069657 539644659
2977.8 539644659 545114636 550182700 554770827 558942854 562641680 565791368 568397760 570460200
2994.1 570460200 571958661 572851717 573164105 573045552 572588146 571825027 570871294 569862366 568854809
3012.4 568854809 567852974 566807449 565609455 564218283 562632203 560797215 558789194 556815624
3028.7 556815624 554939389 553076327 551137030 549104631 547021270 544872522 542636275 540340483
$$ packed form
2908.4E07322490m099607m637301n145937n428791n371362m954756m208892l217519
2924.7D70258325k077609r03159J99198J273275K353132L280103L917157M250616M234404
2943.1D86785442L794759K998591K110064J383304Q45790N51850P28726J337856K093315
2961.4E02629697K842725L542006M191517M772008N190074N401075N500555N575002
2977.8E39644659N469977N068064M588127M172027L698826L149688K606392K062440
2994.1E70460200J498461Q93056L12388j18553m57406p63119r53733j008928j007557
3012.4E68854809j001835j045525j197994j391172j586080j834988k008021j973570
3028.7E56815624j876235j863062j939297k032399k083361k148748k236247k295792
$$ plain form
3045.1 540340483 537990808 535598278 533213317 530845106 528474152 526116312 523785055 521534681
3061.4 521534681 519446611 517499864 515669942 513998508 512471437 510984361 509463012 507965922
3077.7 507965922 506542146 505176842 503891110 502703011 501594901 500536919 499500901 498493224
3094 498493224 497516900 496513873 495438993 494297028 493115097 491917342 490684122 489376664 488010436
3112.4 488010436 486627519 485198468 483690828 482089490 480374366 478614658 476864517 475084335
3128.7 475084335 473247617 471362054 469437957 467468679 465452939 463373423 461224586 459076971
3145 459076971 456970930 454876006 452761859 450601608 448380917 446121246 443855733 441607893 439356387
3163.4 439356387 437058300 434730768 432407260 430096060 427802742 425499350 423163921 420837104
$$ packed form
3045.1E40340483k349675k392530k384961k368211k370954k357840k331257k250374
3061.4E21534681k088070j946747j829922j671434j527071j487076j521349j497090
3077.7E07965922j423776j365304j285732j188099j108110j057982j036018j007677
3094D98493224r76324j003027j074880j141965j181931j197755j233220j307458j366228
3112.4D88010436j382917j429051j507640j601338j715124j759708j750141j780182
3128.7D75084335j836718j885563j924097j969278k015740k079516k148837k147615
3145D59076971k106041k094924k114147k160251k220691k259671k265513k247840k251506
3163.4D39356387k298087k327532k323508k311200k293318k303392k335429k326817
$$ plain form
3179.7 420837104 418531954 416218609 413901925 411624432 409403592 407198846 404967070 402721941
3196 402721941 400544852 398467928 396426469 394389838 392381161 390386552 388397098 386435807 384482592
3214.3 384482592 382533818 380605787 378667802 376728326 374800414 372842073 370849311 368837088
3230.7 368837088 366817504 364767253 362627059 360377997 358053327 355729997 353433818 351092637
3247 351092637 348639488 346098274 343531430 340992451 338509977 336048424 333553284 331059515 328679711
3265.3 328679711 326429963 324254185 322155476 320179164 318375558 316713274 315130204 313679874
3281.6 313679874 312412232 311299920 310330749 309501976 308763385 308049709 307386786 306839019 306383073
3300 306383073 305968046 305609971 305293143 304956764 304616660 304310590 304047227 303830057 303639114 303455085
$$ packed form
3179.7D20837104k305150k313345k316684k277493k220840k204746k231776k245129
3196D02721941k177089k076924k041459k036631k008677j994609j989454j961291j953215
3214.3C84482592j948774j928031j937985j939476j927912j958341j992762k012223
3230.7C68837088k019584k050251k140194k249062k324670k323330k296179k341181
3247C51092637k453149k541214k566844k538979k482474k461553k495140k493769k379804
3265.3C28679711k249748k175778k098709j976312j803606j662284j583070j450330
3281.6C13679874j267642j112312r69171q28773p38591p13676o62923n47767m55946
3300C06383073m15027l58075l16828l36379l40104l06070k63363k17170j90943j84029
$$ plain form
3320.4 303455085 303287178 303100854 302802563 302423984 302098662 301824957 301517487 301137030 300682157 300158083
3340.8 300158083 299581826 298988163 298383892 297748536 297068566 296326876 295505404 294695526 293990850 293284386
3361.2 293284386 292486370 291693330 290972441 290235937 289360940 288429379 287634939 286957949 286298305 285639852
3381.6 285639852 285014629 284479499 284087211 283809662 283472598 282977521 282486349 282221913 282151610 281967759
3402 281967759 281587690 281293511 281194031 281187892 281184435 281158686 281181782 281290442 281465113 281737238 282182902
3424.4 282182902 282803476 283518165 284225672 285006076 285958499 286865890 287551463 288222611 289116532 290231615
3444.8 290231615 291474760 292716503 293962955 295308173 296738565 298245639 299825877 301369756
3461.1 301369756 302920014 304692715 306633085 308412760 309906393 311412334 313177228 315176159
$$ packed form
3320.4C03455085j67907j86324k98291l78579l25322k73705l07470l80457m54873n24074
3340.8C00158083n76257n93663o04271o35356o79970p41690q21472q09878p04676p06464
3361.2B93284386p98016p93040p20889p36504q74997r31561p94440o76990o59644o58453
3381.6B85639852o25223n35130l92288k77549l37064m95077m91172k64436p0303j83851
3402B81967759l80069k94179r9480o139l457k5749K3096J08660J74671K72125M45664
3424.4B82182902O20574P14689P07507P80404R52423R07391O85573O71148Q93921J115083
3444.8B90231615J243145J241743J246452J345218J430392J507074J580238J543879
3461.1C01369756J550258J772701J940370J779675J493633J505941J764894J998931
$$ plain form
3477.4 315176159 317238927 319190323 321131736 323250443 325414509 327472895 329555303 331757724
3493.8 331757724 334017009 336224258 338436961 340747058 343019962 345187634 347416312 349792629
3510.1 349792629 352285206 354803115 357236475 359667361 362232685 364958972 367676526 370264828
3526.4 370264828 372862518 375591725 378463238 381464124 384460658 387374371 390411049 393649518
3542.7 393649518 396910459 400031239 403096884 406223506 409420550 412734807 416186571 419750333
3559 419750333 423352778 426890522 430445015 434351474 438545585 442633182 446615368 450716525 454987615
3577.4 454987615 459400982 463928908 468437940 472860903 477391511 482152194 486861914 491562694
3593.7 491562694 496440917 501360178 506192863 511008918 515818536 520499468 525210679 530100524
$$ packed form
3477.4C15176159K062768J951396J941413K118707K164066K058386K082408K202421
3493.8C31757724K259285K207249K212703K310097K272904K167672K228678K376317
3510.1C49792629K492577K517909K433360K430886K565324K726287K717554K588302
3526.4C70264828K597690K729207K871513L000886K996534K913713L036678L238469
3542.7C93649518L260941L120780L065645L126622L197044L314257L451764L563762
3559D19750333L602445L537744L554493L906459M194111M087597L982186M101157M271090
3577.4D54987615M413367M527926M509032M422963M530608M760683M709720M700780
3593.7D91562694M878223M919261M832685M816055M809618M680932M711211M889845
$$ plain form
3610 530100524 535045505 539987683 544770956 549462378 554437041 559423089 564032853 568274260 572647572
3628.4 572647572 577568233 582299232 586657107 590906441 595081687 599209487 603274345 607160032
3644.7 607160032 610866904 614716291 618799448 622633934 626143217 629792750 633506417 636850357
3661 636850357 639922142 642983019 645862222 648475289 651256144 653901517 656149566 658659101 661392033
3679.4 661392033 664007366 666560769 668985605 671163619 673232019 675407052 677564979 679536283
3695.7 679536283 681314826 682911813 684408188 685970247 687523365 688862920 689917445 690941393
3712 690941393 692352593 693912923 695266724 696408331 697447836 698431432 699422896 700565875 701696634
3730.3 701696634 702604175 703335047 704118431 705152035 706162870 706665754 707000136 707953751 708893657
$$ packed form
3610E30100524M944981M942178M783273M691422M974663M986048M609764M241407M373312
3628.4E72647572M920661M730999M357875M249334M175246M127800M064858L885687
3644.7F07160032L706872L849387M083157L834486L509283L649533L713667L343940
3661F36850357L071785L060877K879203K613067K780855K645373K248049K509535K732932
3679.4F61392033K615333K553403K424836K178014K068400K175033K157927J971304
3695.7F79536283J778543J596987J496375J562059J553118J339555J054525J023948
3712F90941393J411200J560330J353801J141607J039505R83596R91464J142979J130759
3730.3G01696634R07541P30872P83384J033604J010835N02884L34382R53615R39906
$$ plain form
3748.7 708893657 709381759 710066497 711144805 712134123 712841272 713555694 714369535 715133369 715837121
3767.1 715837121 716465652 717097759 717802823 718519509 719213247 719823360 720370591 720890999 721406162 721994400
3787.5 721994400 722671509 723363757 723897636 724266291 724741578 725206494 725600958 726274073 726809561 727127492
3807.8 727127492 727770865 728544176 728932202 729046226 729406476 729715049 729984045 730564892 731133938 731633723
3828.2 731633723 732087314 732489109 732978523 733311892 733360231 733597755 734107554 734611511 735097110 735640883
3848.6 735640883 735907376 735455871 735232830 735961676 736754835 737233937 737463415 737695277 738018036 738112628
3869 738112628 738159180 738478065 738928974 739340723 739524901 739708602 740019858 740235806 740537167 740829527
3889.4 740829527 740927994 741182327 741607308 741800010 741759539 741715133 741738677 742002308 742405653 742682099
$$ packed form
3748.7G08893657M88102O84738J078308R89318P07149P14422Q13841P63834P03752
3767.1G15837121O28531O32107P05064P16686O93738O10113N47231N20408N15163N88238
3787.5G21994400O77109O92248N33879L68655M75287M64916L94464O73115N35488L17931
3807.8G27127492O43373P73311L88026J14024L60250L08573K68996N80847N69046M99785
3828.2G31633723M53591M01795M89414L33369M8339K37524N09799N03957M85599N43773
3848.6G35640883K66493m51505k23041P28846P93159M79102K29478K31862L22759R4592
3869G38112628M6552L18885M50909M11749J84178J83701L11256K15948L01361K92360
3889.4G40829527R8467K54333M24981J92702m0471m4406K3544K63631M03345K76446
$$ plain form
3909.8 742682099 742895603 743103921 743181944 743188918 743334711 743546486 743647277 743723691 743865252 743995547
3930.2 743995547 744111419 744278252 744488120 744668305 744734764 744744956 744906485 745187402 745370626 745454609
3950.6 745454609 745563149 745708823 745820343 745913565 746030509 746116579 746192038 746333301 746495903 746619523
3971 746619523 746718049 746827424 746932924 746985793 747095168 747367620 747615576 747667193 747679710 747799158 747919381
3993.4 747919381 748007238 748161316
3997.5 748161316
$$ packed form
3909.8G42682099K13504K08318P8023O974J45793K11775J00791P6414J41561J30295
3930.2G43995547J15872J66833K09868J80185O6459J0192J61529K80917J83224Q3983
3950.6G45454609J08540J45674J11520R3222J16944Q6070P5459J41263J62602J23620
3971G46619523R8526J09375J05500N2869J09375K72452K47956N1617J2517J19448J20223
3993.4G47919381Q7857J54078
3997.5G48161316
##END=$$ End of the data block
