##TITLE=G04-52-CE $$ Begin of the data block
##JCAMP-DX=5.00 $$ ACD/SpecManager v 10.08
##SPECTROMETER/DATA SYSTEM=Alpha
##DATE=17 Oct 2013 10:58:30
##DATA TYPE=INFRARED SPECTRUM
##DATA CLASS=XYDATA
##ORIGIN=
##OWNER=
##NPOINTS=1765
##FIRSTX=399.75695801
##LASTX=3997.56933594
##MAXX=3997.56933594
##MINX=399.75695801
##MAXY=0.79159415
##MINY=0.11864397
##XFACTOR=1.0000000000
##YFACTOR=1.000000000000000e-9
##FIRSTY=0.37227613
##DELTAX=2.03957629
##XUNITS=1/CM
##YUNITS=ARBITRARY UNITS
##XYDATA=(X++(Y..Y))
399.8C72276127l859877k977431j453191J24574N11765L43382L97981L37302p9065
418.1C65621567q45075j208812j657992k436281k364665j622617j310110j373381p83294
436.5C52019340N84990J649826J880795J670927J304239N86420k64138p67827p67439
454.8C57897133j053900k248615k932250k607853k445221k730846k686054k282559
471.1C38909835k238065k312363j939386j310974r40532r61184r16362n95122o92875
489.5C27002972j583576k273619k070844j818478k200723k731532k738565k618641
505.8C08966994l038615l345042k898574k465308k611071k793640k436518j541794
522.1B87836432p42942m63783r2596P42674J398116J568884J968890K770394K927959
$$ plain form
399.8 372276127 368416250 365438819 363985628 364110202 364621967 364965349 365363330 365700632 365621567
418.1 365621567 364776492 363567680 361909688 359473407 357108742 355486125 354176015 352802634 352019340
436.5 352019340 352604330 354254156 356134951 357805878 359110117 359696537 359432399 358664572 357897133
454.8 357897133 356843233 354594618 351662368 349054515 346609294 343878448 341192394 338909835
471.1 338909835 336671770 334359407 332420021 331109047 330168515 329207331 328290969 327695847 327002972
489.5 327002972 325419396 323145777 321074933 319256455 317055732 314324200 311585635 308966994
505.8 308966994 305928379 302583337 299684763 297219455 294608384 291814744 289378226 287836432
522.1 287836432 287093490 286629707 286537111 287279785 288677901 290246785 292215675 294986069 297914028
540.5B97914028K059162R32842J94133k80738r23991j538992j670301j575560j832425
558.8B93278158k255291k350688k348065k600432k654165j893818o18011M05252J096100
577.2B80059040J928806K869308L386438L237903K778172K299965J669109Q13782J16706
595.6B99159229R179K27094J47044q0526Q2404M24594M24057J98006M19796J079261
616C02090138J370639J352668J912474K877712L233672K818882K460390K589524K590686
634.3C23296785K029211J497626J601160J820921J507551J062453R73999R15170N55068
652.7C35259944J31846J04487M18722L56138j0431M38750K069741K296180M8310K02119
673.1C41315806J470774K011359J708597J350969J290232J192331Q10594K99573r5815
$$ plain form
540.5 297914028 299973190 300906032 301100165 300819427 299895436 298356444 296686143 295110583 293278158
558.8 293278158 291022867 288672179 286324114 283723682 281069517 279175699 278557688 278962940 280059040
577.2 280059040 281987846 284857154 288243592 291481495 294259667 296559632 298228741 299042523 299159229
595.6 299159229 299168408 299395502 299542546 299462020 299544424 299969018 300393075 300591081 301010877 302090138
616 302090138 303460777 304813445 306725919 309603631 312837303 315656185 318116575 320706099 323296785
634.3 323296785 325325996 326823622 328424782 330245703 331753254 332815707 333789706 334704876 335259944
652.7 335259944 335391790 335496277 335914999 336271137 336260706 336699456 338769197 341065377 341113687 341315806
673.1 341315806 342786580 344797939 346506536 347857505 349147737 350340068 351150662 351450235 351354420
691.4C51354420n53578j308471j794964j299888j69843P54237J255959J850248K656817
709.8C52744937L230274L582507M060537M764855N347400N374372N285144N603016
726.1C89993042N643964M920959M033595L434122K841085K001792J203418N94169L9637
744.4D14705783n69731j111746j399040j535267j852512k173185k014786j470834p64340
762.8D01814342K69204J762777L396899M812688N904913O652236P015079O869614O088346
781.2D44586098N121768M457861L834307L204942K797097K702206K882689L256470
797.5D72843438L746093M197299M296601L797472L041923K435654J845539J033127
813.8D97237146K79933k12908p31527j577288k612710l415585l906220m253388m449248
$$ plain form
691.4 351354420 350800842 349492371 347697407 346397519 346227676 346981913 348237872 350088120 352744937
709.8 352744937 355975211 359557718 363618255 368383110 373730510 379104882 384390026 389993042
726.1 389993042 395637006 400557965 404591560 408025682 410866767 412868559 414071977 414666146 414705783
744.4 414705783 414136052 413024306 411625266 410089999 408237487 406064302 404049516 402578682 401814342
762.8 401814342 402083546 403846323 407243222 412055910 417960823 424613059 431628138 438497752 444586098
781.2 444586098 449707866 454165727 458000034 461204976 464002073 466704279 469586968 472843438
797.5 472843438 476589531 480786830 485083431 488880903 491922826 494358480 496204019 497237146
813.8 497237146 497517079 497304171 496572644 494995356 492382646 488967061 485060841 480807453 476358205
832.1D76358205m352927m119009m010618l962636l609091k934813k378047j975596
848.5D49015468j492232j045376q52465p68274j88321J514434L974915O073177P352471
866.8D63583797P938773P677912O286711M000187J476973j026928l554762n686402
883.1D80696261o872356p186919p202030p157832o785780o162465n831122o021112
899.4D27476645o457866o836801p288069p956773q408994q278757p783383p152349
915.8C67313653o177366m654914k983808j804829j224071q79168n73069l95656l75688
934.1C48245084l63618l01689m82142j299739k909809n189836p659525r590506j0513783
952.5C09934437j0552019j0250687j0036528r802759r315282q740008q300051p807016
$$ plain form
832.1 476358205 472005278 467886269 463875651 459913015 456303924 453369111 450991064 449015468
848.5 449015468 447523236 446477860 445625395 444857121 444668800 446183234 450158149 456231326 463583797
866.8 463583797 471522570 479200482 485487193 489487380 490964353 489937425 486382663 480696261
883.1 480696261 473823905 466636986 459434956 452277124 445491344 439328879 433497757 427476645
899.4 427476645 421018779 414181978 406893909 398937136 390528142 382249385 374466002 367313653
915.8 367313653 361136287 356481373 353497565 351692736 350468665 349589497 349016428 348620772 348245084
934.1 348245084 347881466 347579777 347097635 345797896 342888087 337698251 330038726 320448220 309934437
952.5 309934437 299382418 289131731 279095203 269292444 259977162 251237154 242937103 235130087
968.8B35130087o979987n921528m952327m173666l474146k864301k537444k509401
985.1B01717287k512291k408325k255917k102822j867831j411512q69707n33610m27827
1003.5A87327445m63099p10532j148701j563325j763180j736537j637771j599938j629606
1021.8A75074756j678631j717493j764267j781672j685054j608982j668781j732111
1038.1A61437765j688928j574024j439765j261264j003266o43626k02164K11761N58316
1056.5A54394805R21995J283020J575291J739353J593068Q86828k54289j107722j084849
1074.8A59947500k53261Q87290J936227K868578L634319M051387M171968M122749L907024
1093.2A85273781L521637K996593K441287J943395J573920J478180J692564K031892
$$ plain form
968.8 235130087 228150100 222228572 217276245 213102579 209628433 206764132 204226688 201717287
985.1 201717287 199204996 196796671 194540754 192437932 190570101 189158589 188288882 187755272 187327445
1003.5 187327445 186864346 186153814 185005113 183441788 181678608 179942071 178304300 176704362 175074756
1021.8 175074756 173396125 171678632 169914365 168132693 166447639 164838657 163169876 161437765
1038.1 161437765 159748837 158174813 156735048 155473784 154470518 153826892 153624728 153836489 154394805
1056.5 154394805 155316800 156599820 158175111 159914464 161507532 162394360 162140071 161032349 159947500
1074.8 159947500 159694239 160581529 162517756 165386334 169020653 173072040 177244008 181366757 185273781
1093.2 185273781 188795418 191792011 194233298 196176693 197750613 199228793 200921357 202953249
1109.5B02953249K326474K515942K564832K487362K270430J916304J599267J545802
1125.8B20179662J794845K170458K369285K217025J814201J247913N13106j92567n86629
1144.2B31527299o93992p07448o29991l22014K17929R06677J711979K595425L478795
1162.6B38084659M207417M671559M966751N317926N808801O280541O593883O805629
1178.9B82737166O928622O816268O454617N980611N344152M359425L060609J766950
1195.2C23448420O91086k19673r06676j221925j203806j025408q16435o23554m81188
1213.5C17640841m79102o30736q20667j014680j290440j658261j942039k004861j916111
1231.9C05883944j776636j542240j117468n18978J31339P24674J283884J830697K272069
$$ plain form
1109.5 202953249 205279723 207795665 210360497 212847859 215118289 217034593 218633860 220179662
1125.8 220179662 221974507 224144965 226514250 228731275 230545476 231793389 232306495 232113928 231527299
1144.2 231527299 230833307 230125859 229495868 229173854 229391783 230298460 232010439 234605864 238084659
1162.6 238084659 242292076 246963635 251930386 257248312 263057113 269337654 275931537 282737166
1178.9 282737166 289665788 296482056 302936673 308917284 314261436 318620861 321681470 323448420
1195.2 323448420 324139506 323919833 323013157 321791232 320587426 319562018 318745583 318122029 317640841
1213.5 317640841 317161739 316531003 315710336 314695656 313405216 311746955 309804916 307800055 305883944
1231.9 305883944 304107308 302565068 301447600 300928622 301059961 301784635 303068519 304899216 307171285
1250.3C07171285K507210K620697K740979K814889K730310K542228K460837K532482
1266.6C28120917K573133K438336K185017J909763J630544J353681J206398J276106
1282.9C42693895J399607J379638J190097Q91268M55767j65850q76397j414865j721502
1301.2C43831658j946598k099335k081245j865149j549035j198232p56979j88947K72036
1319.6C32418174L76284J21534m22836j199662k006352k508551k534867k191841j807213
1338C20244670j537621j219332q63463p59095r45717j241803j518727j761645k028077
1356.3C08369190k271355k583623l240615m019141m356116m187703l510595l023743
1372.6B81176299l286809l671884l866703m074633m070043l527344k624780j607030
$$ plain form
1250.3 307171285 309678495 312299192 315040171 317855060 320585370 323127598 325588435 328120917
1266.6 328120917 330694050 333132386 335317403 337227166 338857710 340211391 341417789 342693895
1282.9 342693895 344093502 345473140 346663237 347554505 348010272 347844422 346968025 345553160 343831658
1301.2 343831658 341885060 339785725 337704480 335839331 334290296 333092064 332335085 332146138 332418174
1319.6 332418174 332794458 332915992 332493156 331293494 329287142 326778591 324243724 322051883 320244670
1338 320244670 318707049 317487717 316624254 315865159 314919442 313677639 312158912 310397267 308369190
1356.3 308369190 306097835 303514212 300273597 296254456 291898340 287710637 284200042 281176299
1372.6 281176299 277889490 274217606 270350903 266276270 262206227 258678883 256054103 254447073
1388.9B54447073p17193k19315o6042R2357L33071O84291J233518J747727J971305
1407.3B59506792K044409K087444K134055K359569K690673K805323K551615K439260
1423.6B78619140K284676J824767J163989M06504o3569n16116r02743m65512K00987
1442B82552123N42224P18921P28846N42938M90278J008123K221346L073514K838522
1460.3B94716835K939224L465116L892660M747212O774009R265303R395153P575213
1476.6C42770725N899817M296571K658069R74000p51972k909720n052805n661071o069660
1495C36153954p411867p817626o971896o161809p346540j0975838j0766119q870870
1511.3B69831389q145422o780982m723936k719119k133861k464131k597138k745137
$$ plain form
1388.9 254447073 253729880 253510565 253444523 253536880 253869951 254554242 255787760 257535487 259506792
1407.3 259506792 261551201 263638645 265772700 268132269 270822942 273628265 276179880 278619140
1423.6 278619140 280903816 282728583 283892572 284299076 284235507 283719391 282816648 282351136 282552123
1442 282552123 283094347 283813268 284542114 285085052 285575330 286583453 288804799 291878313 294716835
1460.3 294716835 297656059 301121175 305013835 309761047 316535056 325800359 335195512 342770725
1476.6 342770725 348670542 352967113 355625182 356599182 355847210 352937490 347884685 342223614 336153954
1495 336153954 328742087 320924461 313952565 307790756 300444216 289468378 278702259 269831389
1511.3 269831389 261685967 254904985 250181049 247461930 245328069 242863938 240266800 237521663
1527.6B37521663k409413j979470j941801j450672o23599m16711m23804K41935J132608
1546B29650736K056450K997219L769413M389330M863635N757585N615443L803790L476947
1564.3B66380548L700912L590733L199369K477586K185703J876831J096516O64264
1580.7B85172462M21256K00719k2560l19183p88778j285077j847803k443791l100246
1599B75986999l904283m734844n523532o326676p278204p910564p979036q835986j0698795
1617.4B12795079j0044992r499878j0964602j0986805j0004953r329602p975593p089093
1633.7A36899561p333100n682007l122016j590267n28202K90297Q82060J198932J723088
1652A22738346K335623K343238K651065L570229M666135N416006N537629O394416P441953
$$ plain form
1527.6 237521663 235112250 233132780 231190979 229740307 229116708 228699997 228276193 228518128 229650736
1546 229650736 231707186 234704405 238473818 242863148 247726783 253484368 259099811 262903601 266380548
1564.3 266380548 270081460 273672193 276871562 279349148 281534851 283411682 284508198 285172462
1580.7 285172462 285593718 285794437 285771877 285452694 284663916 283378839 281531036 279087245 275986999
1599 275986999 272082716 267347872 261824340 255497664 248219460 240308896 232329860 223493874 212795079
1617.4 212795079 202750087 193250209 182285607 171298802 161293849 151964247 143988654 136899561
1633.7 136899561 129566461 123884454 120762438 119172171 118643969 118934266 119816326 121015258 122738346
1652 122738346 125073969 127417207 130068272 133638501 138304636 143720642 149258271 155652687 163094640
1670.4A63094640P161885P598445Q443102Q287862Q381278R808734J2270420J1767343
1686.7B36813709J1033446J2710169J4063269J7402142K0398438K0719707K2242665
1701C55383545J8623084J5721977J5405476J3226896J1404246J0390550R781063R259701
1717.3D59196538P375538N510002M997850M669845M005015L585219L367663L218770
1733.6D95926440K570331K366304L148020M008531M858732O045223P372260Q631170
1749.9E34927011R073734Q504391Q566677Q784115Q365274Q059025P280111O805122
1766.3F00365460O870925O506861N929231N071402M366278M187525L969908L679692
1782.6F40947282L533721L290177L083586L138662L031134K476812K216160K339840
$$ plain form
1670.4 163094640 170256525 177854970 186298072 194585934 202967212 212775946 225046366 236813709
1686.7 236813709 247847155 260557324 274620593 292022735 312421173 333140880 355383545
1701 355383545 374006629 389728606 405134082 418360978 429765224 440155774 449936837 459196538
1717.3 459196538 466572076 472082078 477079928 481749773 485754788 489340007 492707670 495926440
1733.6 495926440 498496771 500863075 504011095 508019626 512878358 518923581 526295841 534927011
1749.9 534927011 544000745 552505136 561071813 569855928 578221202 586280227 593560338 600365460
1766.3 600365460 607236385 613743246 619672477 624743879 629110157 633297682 637267590 640947282
1782.6 640947282 644481003 647771180 650854766 653993428 657024562 659501374 661717534 664057374
1798.9F64057374K429724K256334K012074K005159K166987K161443J850546J703739
1815.2F80643380J832246J944006J878917J802325J784206J777530J660525J237214
1831.5F94560349J063347J290202J395702J298547J361311J453161J148045P67171
1847.8G04337835O89745Q35479J009166J018405Q73029Q32260R51707J062572J052439
1866.2G12662637Q93116O54042N76794O32584O55174P70808R24289R01341P87139Q84056
1886.6G20341980J050592Q73506N98490N94974P16388P04885N56409M93050O33239
1904.9G26563513P25270N67376L75390M39525O73056O67512L90053L12209M50969M27842
1925.3G31592715K86996K83957M28497M57883K82705K36750M42862N51999L23474J26422
$$ plain form
1798.9 664057374 666487098 668743432 670755506 672760665 674927652 677089095 678939641 680643380
1815.2 680643380 682475626 684419632 686298549 688100874 689885080 691662610 693323135 694560349
1831.5 694560349 695623696 696913898 698309600 699608147 700969458 702422619 703570664 704337835
1847.8 704337835 705027580 705863059 706872225 707890630 708763659 709595919 710547626 711610198 712662637
1866.2 712662637 713555753 714209795 714786589 715419173 716074347 716845155 717769444 718670785 719457924 720341980
1886.6 720341980 721392572 722266078 722864568 723459542 724175930 724880815 725437224 725930274 726563513
1904.9 726563513 727288783 727856159 728231549 728671074 729344130 730011642 730401695 730713904 731164873 731592715
1925.3 731592715 731879711 732163668 732592165 733050048 733332753 733569503 734012365 734564364 734887838 735014260
1945.7G35014260K39909M20153M03940L01004L41177M43578M40716L39985L42429M49717
1966.1G38736868M25339K36451J70887L38971M25756K75851J29342J84715L02314L00467
1986.5G41526961K16544K30372K62797J55151M7087O4373J62483J65581J8359j25468
2006.9G42724240j07646m9889j19567k40207k64823k21670k65658l59774l86238l32296
2027.3G40376472l31997m06921m27783l43203k60771k91943l19541k45452j68264j80065
2047.7G37400532j86026j03116J1563M8697L6776R8944J84238J66595R6082J12951
2068.1G37867236J50204J47521J55270J65642J43587J12713R9420J16945J57833J68144
2088.5G39284515J62542J76072K10584K05755J71363J89185K48015K65956K23100K06471
$$ plain form
1945.7 735014260 735254169 735674322 736078262 736379266 736720443 737164021 737604737 737944722 738287151 738736868
1966.1 738736868 739162207 739398658 739569545 739908516 740334272 740610123 740739465 740924180 741226494 741526961
1986.5 741526961 741743505 741973877 742236674 742391825 742438912 742503285 742665768 742831349 742849708 742724240
2006.9 742724240 742616594 742566705 742447138 742206931 741942108 741720438 741454780 741095006 740708768 740376472
2027.3 740376472 740044475 739637554 739209771 738866568 738605797 738313854 737994313 737748861 737580597 737400532
2047.7 737400532 737214506 737111390 737122953 737171650 737208426 737307370 737491608 737658203 737754285 737867236
2068.1 737867236 738017440 738164961 738320231 738485873 738629460 738742173 738841593 738958538 739116371 739284515
2088.5 739284515 739447057 739623129 739833713 740039468 740210831 740400016 740648031 740913987 741137087 741343558
2108.9G41343558K31504K24948J66595J46866J64986J27792N8651Q0347J71781J74641
2129.3G42891669J01328R5189J66297J74522R9123O7353J55389K48373J85191Q3030
2149.7G44267464J43885K90036L17157K44140K63870M14551M98354M38332M27664N81622
2170.1G47887075O97255O17504N28813N69462O37949O08921N49138N84125O38545N90682
2190.5G53909469M90188N00858N94437N76437M56929M39405N51522N84841M74393M38094
2210.9G59016573N63622O26743M94361L57091M15087N22852M59552L01599K68459L61085
2231.3G63387024L40701J91986J67549K99811L52085K57969J81675K38418K91825K10166
2251.7G65919209J50799K04981K73227K58863J85371J66178K30193K57969J71661R6977
$$ plain form
2108.9 741343558 741575062 741800010 741966605 742113471 742278457 742406249 742464900 742545247 742717028 742891669
2129.3 742891669 742992997 743088186 743254483 743429005 743528128 743595481 743750870 743999243 744184434 744267464
2149.7 744267464 744411349 744701385 745018542 745262682 745526552 745941103 746439457 746877789 747305453 747887075
2170.1 747887075 748584330 749201834 749730647 750300109 750938058 751546979 752096117 752680242 753318787 753909469
2190.5 753909469 754399657 754900515 755494952 756071389 756528318 756967723 757519245 758104086 758578479 759016573
2210.9 759016573 759580195 760206938 760701299 761058390 761473477 761996329 762455881 762757480 763025939 763387024
2231.3 763387024 763727725 763919711 764087260 764387071 764739156 764997125 765178800 765417218 765709043 765919209
2251.7 765919209 766070008 766274989 766548216 766807079 766992450 767158628 767388821 767646790 767818451 767915428
2272.1G67915428J31547J58548K0504j39176l6121K31683L21866K57849K99633M20689
2292.5G69582450M29452L12865K91168M36247N62310O32226P86543R77874R77814P16508
2312.9G75705457N80668R94563J579225J652837J222432Q99553R66132J048147O81103
2331.2G85330117J36792P0811K99394L51071j7464j272798l286838l289521o13808
2349.6G77707756K497732M236579L918529K493918P39634p80523k088249l171742l836095
2367.9G81717539m074752m026533l792345l444553l090798k773464k415836j919985
2384.2G56179273j360714r15468o88672o21736n94855o03258o59764o92248o66619
2402.6G49375939o53624p03693p70211p93755q01384q29757q74221r17971r45091r72629
$$ plain form
2272.1 767915428 768046975 768205523 768226027 768086851 768050730 768282413 768604279 768862128 769161761 769582450
2292.5 769582450 770011902 770324767 770615935 771052182 771614492 772246718 773033261 774011135 774988949 775705457
2312.9 775705457 776286125 777280688 778859913 780512750 781735182 782634735 783600867 784649014 785330117
2331.2 785330117 785466909 785537720 785837114 786188185 786170721 784897923 781611085 778321564 777707756
2349.6 777707756 780205488 784442067 788360596 790854514 791594148 790813625 788725376 785553634 781717539
2367.9 781717539 777642787 773616254 769823909 766379356 763288558 760515094 758099258 756179273
2384.2 756179273 754818559 753903091 753214419 752592683 751997828 751394570 750734806 750042558 749375939
2402.6 749375939 748722315 748018622 747248411 746454656 745653272 744823515 743949294 743031323 742086232 741113603
2423G41113603j014054j014530r67801r74059j039207j069367j049340j050949j073360
2441.3G31860936j052976j028419j061260j088619j059473j023173j004935j018047
2457.7G23524034j029432r99272r73522r80378r99093r81152r47892r70245j016497
2476G14626551r93491r46819r61304r85801r53794q92997q90195r36687r44793q71003
2496.4G05249667p92444q12172q66533q62658q29160q33988q63791q43405q07465q46743
2516.8F96891308r01401q96514q75175q99255r73463j018584j001060r81211j007379
2535.2F88337266j057684j052618j006007j004338j028002j023292r92775r68576r85861
2553.5F79218113r96053r33230q92997r68813j019717r46223r02653r56416r78530
$$ plain form
2423 741113603 740099549 739085019 738117218 737143159 736103952 735034585 733985245 732934296 731860936
2441.3 731860936 730807960 729779541 728718281 727629662 726570189 725547016 724542081 723524034
2457.7 723524034 722494602 721495330 720521808 719541430 718542337 717561185 716613293 715643048 714626551
2476 714626551 713633060 712686241 711724937 710739136 709785342 708892345 708002150 707065463 706120670 705249667
2496.4 705249667 704457223 703645051 702778518 701915860 701086700 700252712 699388921 698545516 697738051 696891308
2516.8 696891308 695989907 695093393 694218218 693318963 692345500 691326916 690325856 689344645 688337266
2535.2 688337266 687279582 686226964 685220957 684216619 683188617 682165325 681172550 680203974 679218113
2553.5 679218113 678222060 677288830 676395833 675427020 674407303 673461080 672558427 671602011 670623481
2571.9F70623481r47535r27984r35317r69350r60171r06110r20892j007259j031339
2590.2F62017524r43720q77559r15766r75370r87113r82165j037598j158595j206338
2608.6F52933300j158238j197755j346410j432240j409292j428246j547695j610755
2624.9F41802669j574099j597643j703442j742363j674473j632213j703442j770257
2641.2F28404737j732827j664281j650571j701713j733780j663208j597404j676739
2657.5F14984214j769542j689852j560330j565337j623333j593053j501978j484453
2673.9F02196336j524985j485765j392484j367390j412570j416982j371026j359641
2690.2E90865493j411438j485050j517177j515150j544237j606047j618206j605094
$$ plain form
2571.9 670623481 669675946 668747962 667812645 666843295 665883124 664977014 664056122 663048863 662017524
2590.2 662017524 661073804 660196245 659280479 658305109 657317996 656335831 655298233 654139638 652933300
2608.6 652933300 651775062 650577307 649230897 647798657 646389365 644961119 643413424 641802669
2624.9 641802669 640228570 638630927 636927485 635185122 633510649 631878436 630174994 628404737
2641.2 628404737 626671910 625007629 623357058 621655345 619921565 618258357 616660953 614984214
2657.5 614984214 613214672 611524820 609964490 608399153 606775820 605182767 603680789 602196336
2673.9 602196336 600671351 599185586 597793102 596425712 595013142 593596160 592225134 590865493
2690.2 590865493 589454055 587969005 586451828 584936678 583392441 581786394 580168188 578563094
2706.5E78563094j670658j766563j757383j677513j676262j756489j790524j721322
2722.8E64746380j624227j570105j559735j529693j459897j430988j435757j402080
2739.1E52733898j369059j381278j384556j347482j293183j275301j301229j309395
2755.4E42072415j281082j268268j302898j329720j305818j284242j343191j451313
2771.8E31505883j485944j451135j485467j605332j687705j706958j749277j845419
2788.1E18488646j920343j938105j982986k092481k176106k178431k177000k273738
2804.4E01749456k445519k540201k519280k541274k639800k706110k765149k876044
2820.7D80716079l005802l124267l244460l367722l520041l749699m029333m370541
$$ plain form
2706.5 578563094 576892436 575125873 573368490 571690977 570014715 568258226 566467702 564746380
2722.8 564746380 563122153 561552048 559992313 558462620 557002723 555571735 554135978 552733898
2739.1 552733898 551364839 549983561 548599005 547251523 545958340 544683039 543381810 542072415
2755.4 542072415 540791333 539523065 538220167 536890447 535584629 534300387 532957196 531505883
2771.8 531505883 530019939 528568804 527083337 525478005 523790300 522083342 520334065 518488646
2788.1 518488646 516568303 514630198 512647212 510554731 508378625 506200194 504023194 501749456
2804.4 501749456 499303937 496763736 494244456 491703182 489063382 486357272 483592123 480716079
2820.7 480716079 477710277 474586010 471341550 467973828 464453787 460704088 456674755 452304214
2837D52304214m874110n626887o576240p530749q258611q442342p783532o288052m445434
2855.4C92478257k986848k356321k555847l312289m229129m945487n191832m844666
2871.7C62055838m013508k989740k112716j566798j319021j261085j358121j575649
2888C45859200j810462k042949k279937k458394k615839k860069l183395l551304l993154
2906.4C21063697m512697n055487n587280o060690o331801o247938n720675m792094
2922.7B76755035l589690k232015q59261M67212J762479K969563M006624M788459N175501
2941B89243907N073070M551739L781974K879381J979798J292855J032710J302779J967698
2959.4C13105911K822042L763139M755884N659908O330699O808817P119716P218360
$$ plain form
2837 452304214 447430104 441803217 435226977 427696228 419437617 410995275 403211743 396923691 392478257
2855.4 392478257 389491409 387135088 384579241 381266952 377037823 372092336 366900504 362055838
2871.7 362055838 358042330 355052590 352939874 351373076 350054055 348792970 347434849 345859200
2888 345859200 344048738 342005789 339725852 337267458 334651619 331791550 328608155 325056851 321063697
2906.4 321063697 316551000 311495513 305908233 299847543 293515742 287267804 281547129 276755035
2922.7 276755035 273165345 270933330 270074069 270541281 272303760 275273323 279279947 284068406 289243907
2941 289243907 294316977 298868716 302650690 305530071 307509869 308802724 309835434 311138213 313105911
2959.4 313105911 315927953 319691092 324446976 330106884 336437583 343246400 350366116 357584476
2975.7C57584476P106066O840408O468386O008654N456537M799724M094064L400833
2992D01759148K698868J956612J184613M10884k93314q47340j226783j423478j435160
3010.4D02784050j308740j117378r92268j055450j306027j682728k037466k228051
3026.7C91055942k306909k349496k382248k438844k525746k637238k723992k779334
3043C70912135k841741k910525k955377k925604k879709k892793k905905k833247k674669
3061.4C45092565k520532k392977k216548k029776j927674j897961j840025j707346
3077.7C28559726j619577j621991j597524j484841j334399j213163j153529j173586
3094C17361116j241535j290857j300484j311779j359523j445174j501441j487285j509577
$$ plain form
2975.7 357584476 364690542 371530950 377999336 384007990 389464527 394264251 398358315 401759148
2992 401759148 404458016 406414628 407599241 408010125 407716811 406869471 405642688 404219210 402784050
3010.4 402784050 401475310 400357932 399365664 398310214 397004187 395321459 393283993 391055942
3026.7 391055942 388749033 386399537 384017289 381578445 379052699 376415461 373691469 370912135
3043 370912135 368070394 365159869 362204492 359278888 356399179 353506386 350600481 347767234 345092565
3061.4 345092565 342572033 340179056 337962508 335932732 334005058 332107097 330267072 328559726
3077.7 328559726 326940149 325318158 323720634 322235793 320901394 319688231 318534702 317361116
3094 317361116 316119581 314828724 313528240 312216461 310856938 309411764 307910323 306423038 304913461
3112.4C04913461j610637j684546j693934j733363j849890j939207j963526j989096
3128.7B90449262k021462k056956k106369k167731k196014k178133k173126k219349
3145B73330122k275228k267719k247274k261638k269179k284109k320439k313972k271384
3163.4B52819180k266526k312958k341405k311453k291038k277762k258346k248734
3179.7B34510958k224982k210706k200738k156675k117216k119079k111659k044245
3196B17325658j976878j943827j874417j816764j817793j802474j743376j710296j727402
3214.3B00912431j698107j631841j599341j606912j663536j744821j763016j704380
3230.7A87500477j671046j747817j866266j882583j872033j920804j966447k013385
$$ plain form
3112.4 304913461 303302824 301618278 299924344 298190981 296341091 294401884 292438358 290449262
3128.7 290449262 288427800 286370844 284264475 282096744 279900730 277722597 275549471 273330122
3145 273330122 271054894 268787175 266539901 264278263 262009084 259724975 257404536 255090564 252819180
3163.4 252819180 250552654 248239696 245898291 243586838 241295800 239018038 236759692 234510958
3179.7 234510958 232285976 230075270 227874532 225717857 223600641 221481562 219369903 217325658
3196 217325658 215348780 213404953 211530536 209713772 207895979 206093505 204350129 202639833 200912431
3214.3 200912431 199214324 197582483 195983142 194376230 192712694 190967873 189204857 187500477
3230.7 187500477 185829431 184081614 182215348 180332765 178460732 176539928 174573481 172560096
3247A72560096k049998k052098k089054k149328k139926k080068k028898k010405j997217
3265.3A53963104j932487j830101j695365j533389j396328j304910j221075j109571
3281.6A41939878r91255q43480p00131o44386n80176m50194l55140k91884k12431j83552
3302A36687249j59741p7292n1126o9245j043R9957J26361R9063R2656J09836J11818
3324.5A36968493J11357J07288J06931J08421R7230Q0138O3524N8860L2171k9087q0660
3346.9A37624666o6474n305k7552j27047j32382m6045l1397r9927j12235p3344p5027
3369.3A36827931j27450j65343j09404n6789j02684j38610o1378N3093J20580J34110
3389.7A36374056P3433k5227m3780R1031K54616K15814Q1688J36912K29433K25484
$$ plain form
3247 172560096 170510098 168458000 166368946 164219618 162079692 159999624 157970726 155960321 153963104
3265.3 153963104 152030617 150200516 148505151 146971762 145575434 144270524 143049449 141939878
3281.6 141939878 140948623 140105143 139405012 138760626 138180450 137730256 137375116 137083232 136870801 136687249
3302 136687249 136527508 136450216 136399090 136329845 136328802 136428759 136555120 136654183 136746839 136856675 136968493
3324.5 136968493 137079850 137187138 137294069 137402490 137499720 137579858 137643382 137702242 137734413 137705326 137624666
3346.9 137624666 137558192 137552887 137525335 137398288 137265906 137219861 137188464 137088537 136976302 136902958 136827931
3369.3 136827931 136700481 136535138 136425734 136368945 136266261 136127651 136066273 136119366 136239946 136374056
3389.7 136374056 136447489 136422262 136378482 136469513 136724129 136939943 137021631 137158543 137387976 137613460
3410.1A37613460K49327L16366L65675M03464M29451M36381N47394P10621Q01802Q06242
3430.5A42680183Q15168Q93340Q55326P14779P37906Q90463R99108J059219J038760
3448.9A50684252J014993J094237J213476J306027J353324J295760J252100J408160
3465.2A60622329J590982J513332J268267J267001J497925J706511J775175J664147
3481.5A72905669J618087J768842J862780J832410J831085J880333J949563J971781
3497.8A87620550K016515K047405J927495J863658J992464K112776K186388K235263
3514.2B04002514K192379K201825K335876K506346K514079K379447K358794K453953
3530.5B22945213K552852K695367K793774K749503K812177L000587L066093K948433
$$ plain form
3410.1 137613460 137862787 138179153 138544828 138948292 139377743 139814124 140361518 141072139 141873941 142680183
3430.5 142680183 143495351 144388691 145244017 145958796 146696702 147587165 148586273 149645492 150684252
3448.9 150684252 151699245 152793482 154006958 155312985 156666309 157962069 159214169 160622329
3465.2 160622329 162213311 163726643 164994910 166261911 167759836 169466347 171241522 172905669
3481.5 172905669 174523756 176292598 178155378 179987788 181818873 183699206 185648769 187620550
3497.8 187620550 189637065 191684470 193611965 195475623 197468087 199580863 201767251 204002514
3514.2 204002514 206194893 208396718 210732594 213238940 215753019 218132466 220491260 222945213
3530.5 222945213 225498065 228193432 230987206 233736709 236548886 239549473 242615566 245563999
3546.8B45563999K909869L012195L083885L151416L258944L396273L534734L627837
3563.1B71539152L726780L863096L814817L735959L866107M067897M225552M371286
3579.4C03210646M500985M597187M667848M673243M669160M684984M772783M884422
3595.7C40661258M976123N046696N038082M982561M982919N080908N134255N197644
3612.1C81100446N294085N312025N433679N500614N237043N183578N415737N594701
3628.4D24071908N320907M827112M836112M968047M954547M988879N104214N269140
3644.7D64340866N423307N354852M791200M256457M286825M529596M446476M264325
3661E01693904M248739M382908M461169M323423M108131L911257L604293L111541K880991
$$ plain form
3546.8 245563999 248473868 251486063 254569948 257721364 260980308 264376581 267911315 271539152
3563.1 271539152 275265932 279129028 282943845 286679804 290545911 294613808 298839360 303210646
3579.4 303210646 307711631 312308818 316976666 321649909 326319069 331004053 335776836 340661258
3595.7 340661258 345637381 350684077 355722159 360704720 365687639 370768547 375902802 381100446
3612.1 381100446 386394531 391706556 397140235 402640849 407877892 413061470 418477207 424071908
3628.4 424071908 429392815 434219927 439056039 444024086 448978633 453967512 459071726 464340866
3644.7 464340866 469764173 475119025 479910225 484166682 488453507 492983103 497429579 501693904
3661 501693904 505942643 510325551 514786720 519110143 523218274 527129531 530733824 533845365 536726356
3679.4E36726356K976477L268122L617108L696144L141045K379179K176464K355576
3695.7E60336471K516746K475977K250373K030373K083361K270460K105654J470923
3712E77540338J195490J506567J900256K113640J991809J603126J304031J490891J845777
3730.3E92491925J894533J484275Q62301P39276J189768J438976J155972J180709J402437
3748.7F03840172Q92282L68535P62284J190543J040817Q04722R80258J155138J104414
3767.1F12139165R57609P50005P32779R83715J220525J118839Q54611P60078O79434
3785.4F20196760O61790Q41379J001179J044333J056374J130104J098454P48157N84781
3803.8F28363311O04213M06742M42743Q65042J151383J054645R95576P62701J60515
$$ plain form
3679.4 536726356 539702833 542970955 546588063 550284207 553425252 555804431 557980895 560336471
3695.7 560336471 562853217 565329194 567579567 569609940 571693301 573963761 576069415 577540338
3712 577540338 578735828 580242395 582142651 584256291 586248100 587851226 589155257 590646148 592491925
3730.3 592491925 594386458 595870733 596733034 597472310 598662078 600101054 601257026 602437735 603840172
3748.7 603840172 604732454 605100989 605863273 607053816 608094633 608899355 609879613 611034751 612139165
3767.1 612139165 613096774 613846779 614579558 615563273 616783798 617902637 618757248 619517326 620196760
3785.4 620196760 620858550 621699929 622701108 623745441 624801815 625931919 627030373 627778530 628363311
3803.8 628363311 628967524 629374266 629817009 630682051 631833434 632888079 633883655 634646356 634806871
3822.1F34806871J40906N13613O78420P53999Q81612J059532R20832L84450J09792
3840.5F40250027J44184K05397M98593J061797J411200P72893l45170j58668M62056
3858.8F44302309P28666O70851M97400N18144M75168K61128J61767K25126M56751N59687
3879.2F48856997M72844M86076L48151J50680J94073J52886J33276M26114O75916O07133
3899.6F52504146L53813L1948j92642j63138M649K44379M40598L98755K01464J28329
3920F53952301J69098J59502J48058K15411K29716J03057K9206J39475K75314K80261
3940.4F55701399J74820J55211K38836J96218O6817Q8930K21252K45631J50919P8023
3960.8F57318056J13010J66357J28030J54794K57730K13146Q0049L8803J00493K07305
$$ plain form
3822.1 634806871 634947777 635461390 636139810 636893809 637775421 638834953 639755785 640140235 640250027
3840.5 640250027 640394211 640599608 641098201 642159998 643571198 644344091 643998921 643840253 644302309
3858.8 644302309 645030975 645701826 646199226 646717370 647192538 647453666 647615433 647840559 648297310 648856997
3879.2 648856997 649329841 649815917 650164068 650314748 650508821 650661707 650794983 651221097 651897013 652504146
3899.6 652504146 652857959 652889907 652697265 652534127 652538776 652783155 653223753 653622508 653823972 653952301
3920 653952301 654121399 654280901 654428959 654644370 654874086 654977143 655006349 655145824 655421138 655701399
3940.4 655701399 655876219 656031430 656270266 656466484 656533301 656622231 656843483 657089114 657240033 657318056
3960.8 657318056 657431066 657597423 657725453 657880247 658137977 658351123 658431172 658469975 658570468 658777773
3981.2F58777773K28465J46747J06811J35780J48654J57713K05875K73228
3997.5F60181046
$$ plain form
3981.2 658777773 659006238 659152985 659259796 659395576 659544230 659701943 659907818 660181046
3997.5 660181046
##END=$$ End of the data block
