##TITLE=G04-52-CE $$ Begin of the data block
##JCAMP-DX=5.00 $$ ACD/SpecManager v 10.08
##SPECTROMETER/DATA SYSTEM=Alpha
##DATE=17 Oct 2013 10:58:30
##DATA TYPE=INFRARED SPECTRUM
##DATA CLASS=XYDATA
##ORIGIN=
##OWNER=
##NPOINTS=1765
##FIRSTX=399.75695801
##LASTX=3997.56933594
##MAXX=3997.56933594
##MINX=399.75695801
##MAXY=0.79182404
##MINY=0.11868542
##XFACTOR=1.0000000000
##YFACTOR=1.000000000000000e-9
##FIRSTY=0.37022856
##DELTAX=2.03957629
##XUNITS=1/CM
##YUNITS=ARBITRARY UNITS
##XYDATA=(X++(Y..Y))
399.8C70228559l790379k647608j137644J57773O09487M31568M90725O09100r7573
$$ 370228559 366438180 363790572 362652928 362810701 363420188 363851756 364342481 364951581 364854008
418.1C64854008j425386j804053j597405j669943j743496j687496j495690j187443
$$ 364854008 363428622 361624569 360027164 358357221 356613725 354926229 353430539 352243096
434.4C52243096p37489J98692J425356K036661J771659J347601P02977k36481p60794
$$ 352243096 351505607 351704299 353129655 355166316 356937975 358285576 358988553 358752072 357991278
452.8C57991278o89685r94235k173990k781898k552361k569526k880305k816379k445608
$$ 357991278 357301593 356307358 354133368 351351470 348799109 346229583 343349278 340532899 338087291
471.1C38087291k256483k085150j750677j268506q75891q69065r37313p28250p66784
$$ 338087291 335830808 333745658 331994981 330726475 329850584 328981519 328044206 327315956 326549172
489.5C26549172j573085k284259k138078j923830k187192k636105k865314k827078
$$ 326549172 324976087 322691828 320553750 318629920 316442728 313806623 310941309 308114231
505.8C08114231k873034k967476k819479k506763k517193k748192k446085j544058
$$ 308114231 305241197 302273721 299454242 296947479 294430286 291682094 289236009 287691951
522.1B87691951p23034m87864k39879O20275J337111J526833J979291K804488K974749
$$ 287691951 286968917 286481053 286241174 286861449 288198560 289725393 291704684 294509172 297483921
540.5B97483921K050668Q80212K65360k11299r50038j433164j417637j407832j956284
$$ 297483921 299534589 300414801 300680161 300468862 299518824 298085660 296668023 295260191 293303907
558.8B93303907k599031k579778k324611k467424k595603j941055n71639N48750J121223
$$ 293303907 290704876 288125098 285800487 283333063 280737460 278796405 278224766 278773516 279894739
577.2B79894739J916498K900601L337979L145903K781421K429337J784354P59184N6834
$$ 279894739 281811237 284711838 288049817 291195720 293977141 296406478 298190832 298950016 299006850
595.6B99006850O6429K46525J04278k13414m7714M68254N13375K74330M39704R55790
$$ 299006850 299073279 299319804 299424082 299210668 299162954 299631208 300144583 300418913 300858617 301814407
616C01814407J289845J456678K047807K887517L127575K714157K451539K646774K630889
$$ 301814407 303104252 304560930 306608737 309496254 312623829 315337986 317789525 320436299 323067188
634.3C23067188K101153J665563J718908J794786J392871R12875R28849J013934O51658
$$ 323067188 325168341 326833904 328552812 330347598 331740469 332653344 333582193 334596127 335247785
652.7C35247785J83284J00196L32236L29524P5877M79370J945526K151519J62840K98261
$$ 335247785 335431069 335531265 335863501 336193025 336268902 336748272 338693798 340845317 341008157 341306418
673.1C41306418J403034J953483J716822J360297J443237J431257Q13782J22309k20239
$$ 341306418 342709452 344662935 346379757 347740054 349183291 350614548 351428330 351550639 351330400
691.4C51330400o07074j276910j744241j323402j99109P52211J263559J839071K611876
$$ 351330400 350723326 349446416 347702175 346378773 346179664 346931875 348195434 350034505 352646381
709.8C52646381L251284L618658L985971M690736N333960N419821N403548N634398
$$ 352646381 355897665 359516323 363502294 368193030 373526990 378946811 384350359 389984757
726.1C89984757N551040M866570M049957L461957K875507K034902J179517N14686K0921
$$ 389984757 395535797 400402367 404452324 407914281 410789788 412824690 414004207 414518893 414539814
744.4D14539814m84705j043677j411736j550377j831382k186150k112448j580059q01981
$$ 414539814 414055109 413011432 411599696 410049319 408217937 406031787 403919339 402339280 401537299
762.8D01537299K77132J778305L435224M903108N992680O687314P048160O883442O102294
$$ 401537299 401814431 403592736 407027960 411931068 417923748 424611062 431659222 438542664 444644958
781.2D44644958N140096M412442L795296L169298K723873K717704K975255L255874
$$ 444644958 449785054 454197496 457992792 461162090 463885963 466603667 469578922 472834796
797.5D72834796L749072M305929M326612L729075K997518K387672J759619R81241L02256
$$ 472834796 476583868 480889797 485216409 488945484 491943002 494330674 496090293 497071534 497373790
815.8D97373790j21683o08266j540661k676487l476679l948659m289627m418254m313558
$$ 497373790 497252107 496643841 495103180 492426693 488950014 485001355 480711728 476293474 471979916
834.2D71979916m194915m139692m032790l598929k859205k275973j942546j538962
$$ 471979916 467785001 463645309 459612519 456013590 453154385 450878412 448935866 447396904
850.5D47396904j049787p88301p38621k06798J508504L962219O033450P313699P947832
$$ 447396904 446347117 445558816 444820195 444613397 446121901 450084120 456117570 463431269 471379101
868.9D71379101P716626O278277L953278J423418j033216l444285n553186o869435
$$ 471379101 479095727 485374004 489327282 490750700 489717484 486273199 480720013 473850578
885.2D73850578p299781p308572p210106o809860o147653n793393o020665o468773
$$ 473850578 466550797 459242225 452032119 445222259 439074606 433281213 427260548 420791775
901.5D20791775o847560p331640p967293q376301q286386p802010p123917o122112
$$ 420791775 413944215 406612575 398645282 390268981 381982595 374180585 367056668 360934556
917.8C60934556m593373k957791j870692j326024q94577m99069l47972l92288l65228
$$ 360934556 356341183 353383392 351512700 350186676 349292099 348793030 348445058 348052770 347687542
936.2C47687542k62171m53114j327396k994954n256564p647544r547501j0495365j0558456
$$ 347687542 347425371 346972257 345644861 342649907 337393343 329745799 320198298 309702933 299144477
954.5B99144477j0247112r969055r707064r312629q831054q343861p773966o977900
$$ 299144477 288897365 278928310 269221246 259908617 251077563 242733702 234959736 227981836
970.8B27981836n951777m943967m151360l485411k889991k534300k496257k521068
$$ 227981836 222030059 217086092 212934732 209449321 206559330 204025030 201528773 199007705
987.1A99007705k407462k254799k103731j825496j391992r27195n63696l68342m00618
$$ 199007705 196600243 194345444 192241713 190416217 189024225 188097030 187533334 187164992 186764374
1005.5A86764374p10412j183257j582056j736462j683504j609042j636848j688257
$$ 186764374 186053962 184870705 183288649 181552187 179868683 178259641 176622793 174934536
1021.8A74934536j678809j715198j803235j787096j660272j583025j650259j756698
$$ 174934536 173255727 171540529 169737294 167950198 166289926 164706901 163056642 161299944
1038.1A61299944j717404j563713j420185j274272j045183o79582k38970J97411O09025
$$ 161299944 159582540 158018827 156598642 155324370 154279187 153599605 153360635 153558046 154167071
1056.5A54167071R98870J319974J568183J726211J562878Q53151k30595j051858j047358
$$ 154167071 155165941 156485915 158054098 159780309 161343187 162196338 161965743 160913885 159866527
1074.8A59866527k50429Q61689J945377K888709L585875M029408M220799M135593L880010
$$ 159866527 159616098 160477787 162423164 165311873 168897748 172927156 177147955 181283548 185163558
1093.2A85163558L494113K976090K428412J928002J585215J510173J701177K038329
$$ 185163558 188657671 191633761 194062173 195990175 197575390 199085563 200786740 202825069
1109.5B02825069K349690K535358K542362K414018K230882J942769J645043J610801
$$ 202825069 205174759 207710117 210252479 212666497 214897379 216840148 218485191 220095992
1125.8B20095992J859740K178400K333865K209857J845553J263559M92648k28450o15552
$$ 220095992 221955732 224134132 226467997 228677854 230523407 231786966 232279614 232051164 231435612
1144.2B31435612p02277o99967o20827l15950K21715Q88899J673788K588316L520653
$$ 231435612 230733335 230033368 229412541 229096591 229318306 230207205 231880993 234469309 237989962
1162.6B37989962M250616M653916M912331N311847N845547O304234O591857O786853
$$ 237989962 242240578 246894494 251806825 257118672 262964219 269268453 275860310 282647163
1178.9B82647163O900340O789118O450743O014138N362868M324794L027797J739621
$$ 282647163 289547503 296336621 302787364 308801502 314164370 318489164 321516961 323256582
1195.2C23256582O45250k26259q56787j175404j206040j069546q41230o02931m53233
$$ 323256582 323901832 323675573 322818786 321643382 320437342 319367796 318526566 317923635 317470402
1213.5C17470402m41701n93871q36819j063317j316786j661956j940340j992762j903862
$$ 317470402 317028701 316434830 315598011 314534694 313217908 311555952 309615612 307622850 305718988
1231.9C05718988j764685j511156j093328n05597J53691P38650J286149J824767K265304
$$ 305718988 303954303 302443147 301349819 300844222 300997913 301736563 303022712 304847479 307112783
1250.3C07112783K525419K653271K737165K772450K711117K552569K461314K530247
$$ 307112783 309638202 312291473 315028638 317801088 320512205 323064774 325526088 328056335
1266.6C28056335K575189K439320K187074J903385J619905J356482J221925J292467
$$ 328056335 330631524 333070844 335257918 337161303 338781208 340137690 341359615 342652082
1282.9C42652082J395196J346320J175582R32694N01662j72615r12547j423001j694202
$$ 342652082 344047278 345393598 346569180 347501874 348003536 347830921 346918374 345495373 343801171
1301.2C43801171j937449k128423k099752j865059j564443j206100p30813j61171K75344
$$ 343801171 341863722 339735299 337635547 335770488 334206045 332999945 332269132 332107961 332383305
1319.6C32383305L60250R9451m40896j191407j969666k483129k531976k204656j827836
$$ 332383305 332743555 332843006 332402110 331210703 329241037 326757908 324225932 322021276 320193440
1338C20193440j535088j190066q33750p42227r57966j287639j542419j739741k006203
$$ 320193440 318658352 317468286 316634536 315892309 314934343 313646704 312104285 310364544 308358341
1356.3C08358341k260506k574563l245026m037052m367948m190594l529310l065198
$$ 308358341 306097835 303523272 300278246 296241194 291873246 287682652 284153342 281088144
1372.6B81088144l323317l681600l850371m043668m035652l498197k619862j621068
$$ 281088144 277764827 274083227 270232856 266189188 262153536 258655339 256035477 254414409
1388.9B54414409p22766k13921o1839P9721L19510O88315J235336J745641J959205
$$ 254414409 253691643 253477722 253415883 253495604 253815114 254503429 255738765 257484406 259443611
1407.3B59443611K022535K112478K193570K347082K611637K793461K598256K442479
$$ 259443611 261466146 263578624 265772194 268119276 270730913 273524374 276122630 278565109
1423.6B78565109K264589J809835J164943M32372p0691n64545r04411m24505K27333
$$ 278565109 280829698 282639533 283804476 284236848 284166157 283601612 282697201 282272696 282500029
1442B82500029N54353P16686P15762N42403M93168R73016K128780L030062K906412
$$ 282500029 283054382 283771068 284486830 285029233 285522401 286495417 288624197 291654259 294560671
1460.3B94560671L004521L476083L881663M722059O715953R224862R424180P620484
$$ 294560671 297565192 301041275 304922938 309644997 316360950 325585812 335009992 342630476
1476.6C42630476N922317M302800K653629R46402q14646k970130n041033n614221o065160
$$ 342630476 348552793 352855593 355509222 356455624 355640978 352670848 347629815 342015594 335950434
1495C35950434p433086p822335o973028o180138p381677j0969133j0701298q814246
$$ 335950434 328517348 320695013 313721985 307541847 300160170 289191037 278489739 269675493
1511.3B69675493q108228o786436m778028k759635k123877k422393k552405k712518
$$ 269675493 261567265 254780829 250002801 247243166 245119289 242696896 240144491 237431973
1527.6B37431973k388164j950905j921415j475126o78137m44621l51354L40372J164228
$$ 237431973 235043809 233092904 231171489 229696363 229018226 228573605 228222251 228562623 229726851
1546B29726851K042547K993092L773898M361316M796431N704492N663306L871917L496826
$$ 229726851 231769398 234762490 238536388 242897704 247694135 253398627 259061933 262933850 266430676
1564.3B66430676L686875L553838L184616K500236K210140J901389J114249O58959
$$ 266430676 270117551 273671389 276856005 279356241 281566381 283467770 284582019 285240978
1580.7B85240978M00126J87129k4706l25114p96348j286328j857996k460599l097295
$$ 285240978 285641104 285828233 285803527 285478413 284682065 283395737 281537741 279077142 275979847
1599B75979847l890783m727393n501151o296069p282138p935300q001402q857772j0688335
$$ 275979847 272089064 267361671 261860520 255564451 248282313 240347013 232345611 223487839 212799504
1617.4B12799504j0029554r522557j0987461j0995522j0005623r308517p966980p117436
$$ 212799504 202769950 193247393 182259932 171264410 161258787 151950270 143983290 136865854
1633.7A36865854p365584n657546l062785j554340n40175K30290Q31612J181192J690619
$$ 136865854 129500270 123842724 120779939 119225599 118685424 118915714 119747326 120928518 122619137
1652A22619137K340138K402678K675414L568709M677892N432159N537763O386250P462427
$$ 122619137 124959275 127361953 130037367 133606076 138283968 143716127 149253890 155640140 163102567
1670.4A63102567P195309P594556Q403614Q245632Q358702R821013J2318149J1787489
$$ 163102567 170297876 177892432 186296046 194541678 202900380 212721393 225039542 236827031
1686.7B36827031J1011347J2695551J4056563J7360777K0323902K0655275K2242635
$$ 236827031 247838378 260533929 274590492 291951269 312275171 332930446 355173081
1701C55173081J8681526J5792013J5479683J3246388J1360049J0360360R782851R263605
$$ 355173081 373854607 389646620 405126303 418372691 429732740 440093100 449875951 459139556
1717.3D59139556P432729N606681N038082M656524M001260L579586L336162L213167
$$ 459139556 466572285 472178966 477217048 481873572 485874832 489454418 492790580 496003747
1733.6D96003747K613366K388715L152848M019737M855871O027460P355333Q621871
$$ 496003747 498617113 501005828 504158676 508178413 513034284 519061744 526417077 535038948
1749.9E35038948R103477Q556962Q583903Q767307Q328855Q028686P290304O816387
$$ 535038948 544142425 552699387 561283290 570050597 578379452 586408138 593698442 600514829
1766.3F00514829O847263O477415N945265N104125M369736M197120L984452L673136
$$ 600514829 607362092 613839507 619784772 624888897 629258633 633455753 637440205 641113341
1782.6F41113341L524661L286719L066242L098726L017128K518058K264380K360463
$$ 641113341 644638002 647924721 650990963 654089689 657106817 659624875 661889255 664249718
1798.9F64249718K430499K270639K027392J988053K131939K156973J879692J708806
$$ 664249718 666680217 668950856 670978248 672966301 675098240 677255213 679134905 680843711
1815.2F80843711J810431J931250J867772J791060J794815J788377J650691J251042
$$ 680843711 682654142 684585392 686453164 688244224 690039039 691827416 693478107 694729149
1831.5F94729149J114548J328170J377880J246572J316130J420975J160920Q12947
$$ 694729149 695843697 697171867 698549747 699796319 701112449 702533424 703694344 704507291
1847.8G04507291P08461Q40247J041531J064837Q93414Q17120R12190J021087J028717
$$ 704507291 705215752 706055999 707097530 708162367 709055781 709872901 710785091 711806178 712834895
1866.2G12834895Q87632O74963N97477O34015O66201P84337R17495Q88109P88450Q85665
$$ 712834895 713722527 714397490 714994967 715628982 716295183 717079520 717997015 718885124 719673574 720559239
1886.6G20559239J037062Q62658N94139N96583P25865P12752N60165M85122O24895
$$ 720559239 721596301 722458959 723053098 723649681 724375546 725088298 725648463 726133585 726758480
1904.9G26758480P44164N98610L74078M02034O36518O62386M34041L54230M40002M19795
$$ 726758480 727502644 728101254 728475332 728877366 729513884 730176270 730610311 730964541 731404543 731824338
1925.3G31824338L03269K77400M20093M85480L10958K27928M01139N09143L16024J44243
$$ 731824338 732127607 732405007 732825100 733310580 733621538 733849466 734250605 734759748 735075772 735220015
1945.7G35220015K59399M41492M17709K95401L42250M71830M71533L44336L19838M33743
$$ 735220015 735479414 735920906 736338615 736634016 736976266 737448096 737919629 738263965 738583803 739017546
1966.1G39017546M25935K40207J67608L16143M08947K83242J37865J86622L06845L12209
$$ 739017546 739443481 739683688 739851296 740167439 740576386 740859628 740997493 741184115 741490960 741803169
1986.5G41803169K29776K25663K57612J84655O8545K9206J09196J38581K6584q3268
$$ 741803169 742032945 742258608 742516220 742700875 742769420 742798626 742907822 743046403 743072987 742989719
2006.9G42989719o0737l2068j31845k54393k79247k54572l06904l75986l41296k72870
$$ 742989719 742928982 742896914 742765069 742510676 742231429 741976857 741669953 741293967 740952671 740679801
2027.3G40679801l34681m45067m25518l06070k49147k86162k99215k52426j85132j65999
$$ 740679801 740345120 739900053 739474535 739168465 738919318 738633156 738333941 738081515 737896383 737730384
2047.7G37730384j69397j10566j3769K8193L9280R4115J73211J76013J09792J29819
$$ 737730384 737560987 737450421 737436652 737464845 737504125 737598240 737771451 737947464 738057256 738187075
2068.1G38187075J74164J50502J48416J65105J12295O6459R2983J42813J78993J86741
$$ 738187075 738361239 738511741 738660157 738825262 738937557 739004016 739096999 739239812 739418805 739605546
2088.5G39605546J76787J71662K12729K18987J80662J89721K22326K38120K27213K21253
$$ 739605546 739782333 739953995 740166724 740385711 740566373 740756094 740978420 741216540 741443753 741665006
2108.9G41665006K37822K22266J61946J42872J53422J24991Q4162J10209J80245J76549
$$ 741665006 741902828 742125094 742287040 742429912 742583334 742708325 742792487 742902696 743082941 743259490
2129.3G43259490J02281Q2135J61052J96397J17958O5327J22606J85192J59264J15752
$$ 743259490 743361771 743443906 743604958 743801355 743919313 743984640 744107246 744292438 744451702 744567454
2149.7G44567454J76310K80977K82824K38955K96652M27544M69327M29094M59015N93782
$$ 744567454 744743764 745024741 745307565 745546520 745843172 746270716 746740043 747169137 747628152 748221934
2170.1G48221934O93798O39558N37514N55516O33895N87463N23329N96762O64413O08563
$$ 748221934 748915732 749555290 750092804 750648320 751282215 751869678 752393007 752989769 753654182 754262745
2190.5G54262745M90666M82082O05285O18816M75764M36246N54622N82397M60267M28140
$$ 754262745 754753411 755235493 755840778 756459594 756935358 757371604 757926226 758508623 758968890 759397030
2210.9G59397030N44906O11484N16414L69728L82423M95613M47988K97606L03686L89755
$$ 759397030 759941936 760553420 761069834 761439562 761821985 762317598 762765586 763063192 763366878 763756633
2231.3G63756633L25620J79410J67727L06249L63946K54631J72258K31564K80082K07424
$$ 763756633 764082253 764261663 764429390 764735639 765099585 765354216 765526474 765758038 766038120 766245544
2251.7G66245544J53780J98305K65240K55168J72674J45317K38776K90870J77563Q7857
$$ 766245544 766399324 766597629 766862869 767118037 767290711 767436028 767674804 767965674 768143237 768231094
2272.1G68231094J40488J58608L397j42216k8193K28226L06249K52366L10659M10676
$$ 768231094 768371582 768530190 768533587 768391371 768363178 768591404 768897653 769150019 769460678 769871354
2292.5G69871354L93570L03089L14176M50969N63502O35922P90000R75967R61244P02143
$$ 769871354 770264924 770568013 770882189 771333158 771896660 772532582 773322582 774298549 775259793 775961936
2312.9G75961936N90980R69767J486659J602590J279354R58324R75549J055598O88434
$$ 775961936 776552916 777522683 779009342 780611932 781891286 782849610 783825159 784880757 785569191
2331.2G85569191J58906J32143L25144L01719q0646j274406l221751l252327o32227
$$ 785569191 785728097 785860240 786185384 786487103 786406457 785132051 781910300 778657973 778025746
2349.6G78025746K445758M201114L935218K504349P11858q11339k004563l028751l802478
$$ 778025746 780471504 784672618 788607836 791112185 791824043 791012704 789008141 785979390 782176912
2367.9G82176912m139662m107296l822864l428459l085077k772569k384722j876593
$$ 782176912 778037250 773929954 770107090 766678631 763593554 760820985 758436263 756559670
2384.2G56559670j354396r59874p22289o04391n64933n84304o44147o97673p01904
$$ 756559670 755205274 754245400 753523111 752918720 752353787 751769483 751125336 750427663 749725759
2402.6G49725759o87003p12454p59423p90298q22604q42810q52286q94368r53794r91880
$$ 749725759 749038756 748326302 747566879 746776581 745953977 745111167 744258881 743364513 742410719 741418839
2423G41418839j005948r94861r88364j008690j027465j039266j048088j069725j084626
$$ 741418839 740412891 739418030 738429666 737420976 736393511 735354245 734306157 733236432 732151806
2441.3G32151806j055836j022339j028717j059115j072168j052916j023233j018167
$$ 732151806 731095970 730073631 729044914 727985799 726913631 725860715 724837482 723819315
2457.7G23819315j016616r78649r54270r95219j019478r70066r50873r99033j014173
$$ 723819315 722802699 721824050 720869780 719874561 718855083 717885017 716934144 715935111 714920938
2476G14920938r58562r23633r66251j011551r63270q61943q53837r29296r48190q85070
$$ 714920938 713962376 713038743 712072492 711060941 710097671 709235728 708381891 707452595 706504405 705619335
2496.4G05619335q34226q53301q75651q25465p62642p99894q88526q83997q38637q67546
$$ 705619335 704785109 703931808 703056157 702230692 701468050 700668156 699779630 698895633 698056996 697189450
2516.8F97189450r05692r08017r05335q94368r10878r65476j003981j009345j023233
$$ 697189450 696283758 695375741 694470406 693576038 692665160 691699684 690695703 689686358 688663125
2535.2F88663125j070678j072467j013279r99212j020431j000941r69291r78112j008332
$$ 688663125 687592447 686519980 685506701 684507489 683487058 682486117 681516826 680538714 679530382
2553.5F79530382j004636r55224r28998r72271r87232r11176q69334r45926j006543
$$ 679530382 678525746 677570522 676641524 675669253 674682021 673770845 672901511 671955585 670949042
2571.9F70949042r59456r03487r23455r93133j001060r30249r11653r56119r68813
$$ 670949042 669989586 669086099 668162644 667169511 666168451 665238202 664326549 663370430 662401617
2590.2F62401617r35555r12011r43124r87530r80377r57846j019776j143873j198173
$$ 662401617 661466062 660554051 659610927 658623397 657643020 656685174 655665398 654521525 653323352
2608.6F53323352j176059j206577j350939j466095j442254j437485j525462j575291
$$ 653323352 652147293 650940716 649589777 648123682 646681428 645243943 643718481 642143190
2624.9F42143190j558185j582145j695931j763165j701594j656353j704514j748801
$$ 642143190 640585005 639002860 637306929 635543764 633842170 632185817 630481303 628732502
2641.2F28732502j723885j658619j643955j713097j743555j653791j590550j686632
$$ 628732502 627008617 625349998 623706043 621992946 620249391 618595600 617005050 615318418
2657.5F15318418j796782j719475j560688j555026j603722j535416j465917j490950
$$ 615318418 613521636 611802161 610241473 608686447 607082725 605547309 604081392 602590442
2673.9F02590442j530111j513004j432658j360774j387000j423180j386344j375139
$$ 602590442 601060331 599547327 598114669 596753895 595366895 593943715 592557371 591182232
2690.2E91182232j435399j476646j463592j473009j544714j616776j624048j623511
$$ 591182232 589746833 588270187 586806595 585333586 583788872 582172096 580548048 578924537
2706.5E78924537j697421j779497j747787j679182j707673j775086j776338j682162
$$ 578924537 577227116 575447619 573699832 572020650 570312977 568537891 566761553 565079391
2722.8E65079391j598418j606285j597405j511991j420379j399457j443744j454055
$$ 565079391 563480973 561874688 560277283 558765292 557344913 555945456 554501712 553047657
2739.1E53047657j392126j343966j376330j400888j334250j278043j278103j273274
$$ 553047657 551655531 550311565 548935235 547534347 546200097 544922054 543643951 542370677
2755.4E42370677j273990j300454j320064j317322j310587j302540j350582j458049
$$ 542370677 541096687 539796233 538476169 537158847 535848260 534545720 533195138 531737089
2771.8E31737089j477480j426339j468837j595676j683533j711011j771271j875639
$$ 531737089 530259609 528833270 527364433 525768757 524085224 522374213 520602942 518727303
2788.1E18727303j931489j951277j997233k062261k131998k180040k214670k292157
$$ 518727303 516795814 514844537 512847304 510785043 508653045 506473005 504258335 501966178
2804.4E01966178k417832k508939k498537k513140k628237k719999k791404k903700
$$ 501966178 499548346 497039407 494540870 492027730 489399493 486679494 483888090 480984390
2820.7D80984390l023505l116191l208190l352732l550887l772735m023254m372776
$$ 480984390 477960885 474844694 471636504 468283772 464732885 460960150 456936896 452564120
2837D52564120m881829n614459o566823p552743q296758q451759p754773o286115m496991
$$ 452564120 447682291 442067832 435501009 427948266 419651508 411199749 403444976 397158861 392661870
2855.4C92661870l027440k355873k537936l298491m238904m980445n229115m842431
$$ 392661870 389634430 387278557 384740621 381442130 377203226 372222781 366993666 362151235
2871.7C62151235l966987k959311k120703j569212j304984j273811j392096j598567
$$ 362151235 358184248 355224937 353104234 351535022 350230038 348956227 347564131 345965564
2888C45965564j822442k017438k212673k424777k647698k904951l220171l560841l943503
$$ 345965564 344143122 342125684 339913011 337488234 334840536 331935585 328715414 325154573 321211070
2906.4C21211070m462362n063086n615950o083339o363422o277114n724043m760504
$$ 321211070 316748708 311685622 306069672 299986333 293622911 287345797 281621754 276861250
2922.7B76861250l557890k241671q72165M61310J733690K953917M022986M800647N163998
$$ 276861250 273303360 271061689 270189524 270650834 272384524 275338441 279361427 284162074 289326072
2941B89326072N081057M588098L782123K861410J993150J324951J062066J313627J959115
$$ 289326072 294407129 298995227 302777350 305638760 307631910 308956861 310018927 311332554 313291669
2959.4C13291669K800107L743380M745096N658776O355256O851255P142514P214129
$$ 313291669 316091776 319835156 324580252 330239028 336594284 343445539 350588053 357802182
2975.7C57802182P127315O899953O491602N960792N408138M804462M119426L421605
$$ 357802182 364929497 371829450 378321052 384281844 389689982 394494444 398613870 402035475
2992D02035475K724617J989186J215577M44234k49863q32259j269997j487523j474500
$$ 402035475 404760092 406749278 407964855 408409089 408159226 407326967 406056970 404569447 403094947
3010.4D03094947j298427j078427r70453j047820j295507j678079k029300k226323
$$ 403094947 401796520 400718093 399747640 398699820 397404313 395726234 393696934 391470611
3026.7C91470611k332270k373934k402782k467007k514869k588540k720147k835066
$$ 391470611 389138341 386764407 384361625 381894618 379379749 376791209 374071062 371235996
3043C71235996k887070k894699k903044k900273k889931k895683k865017k792001k703994
$$ 371235996 368348926 365454227 362551183 359650910 356760979 353865296 351000279 348208278 345504284
3061.4C45504284k575487k417177k233535k038449j914829j881510j832098j706004
$$ 345504284 342928797 340511620 338278085 336239636 334324807 332443297 330611199 328905195
3077.7C28905195j619160j620799j582742j465947j344233j253903j213402j204133
$$ 328905195 327286035 325665236 324082494 322616547 321272314 320018411 318805009 317600876
3094C17600876j187533j208276j291841j366973j401543j453072j501411j503379j537174
$$ 317600876 316413343 315205067 313913226 312546253 311144710 309691638 308190227 306686848 305149674
3112.4C05149674j613378j645446j674503j766622j864791j906246j917630j965255
$$ 305149674 303536296 301890850 300216347 298449725 296584934 294678688 292761058 290795803
3128.7B90795803k025038k067983k116233k150864k162963k169728k179235k217680
$$ 290795803 288770765 286702782 284586549 282435685 280272722 278102994 275923759 273706079
3145B73706079k278626k299279k270788k243102k269447k323448k331228k305448k303898
$$ 273706079 271427453 269128174 266857386 264614284 262344837 260021389 257690161 255384713 253080815
3163.4B53080815k322048k339244k330228k272636k253279k287597k290860k267748
$$ 253080815 250758767 248419523 246089295 243816659 241563380 239275783 236984923 234717175
3179.7B34717175k254828k240301k204090k151713k099469k078012k077296k050281
$$ 234717175 232462347 230222046 228017956 225866243 223766774 221688762 219611466 217561185
3196B17561185j988813j916170j861692j846328j842379j800538j745760j735985j747802
$$ 217561185 215572372 213656202 211794510 209948182 208105803 206305265 204559505 202823520 201075718
3214.3B01075718j735881j695678j642674j609892j611232j648322j704887j739159
$$ 201075718 199339837 197644159 196001485 194391593 192780361 191132039 189427152 187687993
3230.7A87687993j744419j789078j863495j883611j886174j918689j956716j981124
$$ 187687993 185943574 184154496 182291001 180407390 178521216 176602527 174645811 172664687
3247A72664687k026394k091482k115906k101749k090543k084866k056167k012849j968205
$$ 172664687 170638293 168546811 166430905 164329156 162238613 160153747 158097580 156084731 154116526
3265.3A54116526j888171j779019j684726j588553j465887j345768j223877j077682
$$ 154116526 152228355 150449336 148764610 147176057 145710170 144364402 143140525 142062843
3281.6A42062843r54583q45179p28503o39901n37455m33162l80516l28436k59936k04772
$$ 142062843 141108260 140263081 139534578 138894677 138357222 137924060 137543544 137215108 136955172 136750400
3302A36750400j30504n5850m8905m0502L2365P5192P0989R4846J26794J16706R2551
$$ 136750400 136619896 136564046 136515141 136474639 136507004 136582196 136653185 136748031 136874825 136991531 137084082
3324.5A37084082P8037P3150J19567J56179J29878Q9616M5836J9044J222n7266r4965
$$ 137084082 137162119 137235269 137354836 137511015 137640893 137730509 137776345 137795389 137796611 137739345 137644380
3346.9A37644380n5745m3169r8332j20327o2689j2130l5226j09867j53094r9957m4599
$$ 137644380 137588635 137545466 137447134 137326807 137264118 137251988 137216762 137106895 136953801 136853844 136809245
3369.3A36809245r8199j86220j69262q4817n5239n5552l486N2496R5487J35675R1404
$$ 136809245 136711046 136524826 136355564 136270747 136215508 136159956 136156470 136208966 136304453 136440128 136531532
3391.8A36531532o542k2054R0734K19285J92076O4686P6011K12207K93836K89828L07247
$$ 136531532 136524990 136502936 136593670 136812955 137005031 137069717 137145728 137357935 137651771 137941599 138248846
3414.2A38248846L79205M27276M12061M17307N46575P02798P91714P99298Q02174Q62554
$$ 138248846 138628051 139055327 139467388 139884695 140431270 141134068 141925782 142725080 143527254 144389808
3434.6A44389808Q43361P40305P48485Q65340R87947J079157J071230J062766J119792
$$ 144389808 145233169 145973474 146721959 147587299 148575246 149654403 150725633 151788399 152908191
3453A52908191J185387J243651J267374J265749J340807J472577J542300J475558J302346
$$ 152908191 154093578 155337229 156604603 157870352 159211159 160683736 162226036 163701594 165003940
3471.3A65003940J301319J511723J725673J777664J664236J639903J778170J845658
$$ 165003940 166305259 167816982 169542655 171320319 172984555 174624458 176402628 178248286
3487.6A78248286J812592J828954J871318J920476J967982K039835K053841J907528
$$ 178248286 180060878 181889832 183761150 185681626 187649608 189689443 191743284 193650812
3504A93650812J848593K004549K121374K187833K266929K209648K161131K325549K543226
$$ 193650812 195499405 197503954 199625328 201813161 204080090 206289738 208450869 210776418 213319644
3522.3B13319644K493188K328724K358779K492398K614871K761811K813786K734914
$$ 213319644 215812832 218141556 220500335 222992733 225607604 228369415 231183201 233918115
3538.6B33918115K817184L004879L038675K914577K899632L034145L124684L177911
$$ 233918115 236735299 239740178 242778853 245693430 248593062 251627207 254751891 257929802
3554.9B57929802L281712L428817L539384L625273L733367L849387L805310L732860
$$ 257929802 261211514 264640331 268179715 271804988 275538355 279387742 283193052 286925912
3571.3B86925912L868610M114955M274458M356891M448324M556060M675657M725307
$$ 286925912 290794522 294909477 299183935 303540826 307989150 312545210 317220867 321946174
3587.6C21946174M706412M686684M792839M933447M972547M971862M984319N017698
$$ 321946174 326652586 331339270 336132109 341065556 346038103 351009965 355994284 361011982
3603.9C61011982N046427N100012N114764N180568N302488N316228N405724N522132
$$ 361011982 366058409 371158421 376273185 381453753 386756241 392072469 397478193 403000325
3620.2D03000325N333036N179614N296767N511045N346805M946828M918128M923761
$$ 403000325 408333361 413512975 418809742 424320787 429667592 434614420 439532548 444456309
3636.5D44456309M896820N028456N164504N241215N349070N335778M839957M303366
$$ 444456309 449353129 454381585 459546089 464787304 470136374 475472152 480312109 484615475
3652.8D84615475M286468M549533M525125M291475M197478M306734M416466M302024
$$ 484615475 488901943 493451476 497976601 502268076 506465554 510772288 515188754 519490778
3669.2E19490778M030705L834665L625273L204585K950847L017425L274620L559053
$$ 519490778 523521483 527356148 530981421 534186006 537136853 540154278 543428898 546987951
3685.5E46987951L617525L128827K452731K265036K385199K474665K431572K230942
$$ 546987951 550605476 553734303 556187034 558452070 560837269 563311934 565743506 567974448
3701.8E67974448K014518K051234K223492K107561J528263J268088J564563J898706
$$ 567974448 569988966 572040200 574263692 576371253 577899516 579167604 580732167 582630873
3718.1E82630873K076864J977861J593411J283228J518548J957595J972139J388013
$$ 582630873 584707737 586685598 588279009 589562237 591080785 593038380 595010519 596398532
3734.4E96398532P29382P22766J184047J346051J082063J175106J346171Q88049M92394
$$ 596398532 597127914 597850680 599034727 600380778 601462841 602637947 603984118 604872167 605364561
3752.8F05364561Q64506J237511J069487Q16285J001418J195729J092255R01282P45952
$$ 605364561 606229067 607466578 608536065 609352350 610353768 611549497 612641752 613543034 614288986
3771.1F14288986P82907J011491J182019J056850Q29280P67052P05004P06613Q77142
$$ 614288986 615071893 616083384 617265403 618322253 619151533 619918585 620623589 621330202 622207344
3789.5F22207344J010954J023292R89080J051009J029610P20084O35028O44326L95239
$$ 622207344 623218298 624241590 625230670 626281679 627311289 628031373 628666401 629310727 629705966
3807.8F29705966M49717R16898J173079R74178Q77857P39277K93374K97248N47588
$$ 629705966 630155683 631072581 632245660 633219838 634097695 634836972 635130346 635427594 635975182
3826.2F35975182O29842O91176Q44180J033605Q32259L08514J77979L00825L19064
$$ 635975182 636605024 637296200 638140380 639173985 640006244 640314758 640492737 640793562 641112626
3844.6F41112626N17428J026630J340210O85454l43085p5697N17606P20680O16789
$$ 641112626 641630054 642656684 643996894 644682348 644339263 644263566 644781172 645501852 646118641
3862.9F46118641M65512M95017M21285K54870J99377K61546M97520N94794N09262M76480
$$ 646118641 646584153 647079170 647500455 647755325 647954702 648216248 648713768 649308562 649817824 650294304
3883.3F50294304K82705J62482K90990J82032P8917M05848O94394N53727K27750L337
$$ 650294304 650577009 650739491 651030481 651212513 651291430 651697278 652391672 652945399 653173149 653176486
3903.7F53176486j06930o8963R3699K86340M03881L71099K11477J27316J61290J11878
$$ 653176486 653069556 653000593 653094292 653380632 653784513 654155612 654367089 654494405 654655695 654767573
3924.1F54767573O0379K02895K80082J17600M5597J68205K73168K87115K18571J49607
$$ 654767573 654827952 655030847 655310929 655428529 655474126 655642331 655915499 656202614 656421185 656570792
3944.5F56570792J52052J57952J30057J47105K05516K02418J53362J29581J47581J63853
$$ 656570792 656722844 656880796 657010853 657157958 657363474 657565892 657719254 657848835 657996416 658160269
3964.9F58160269J49310J53422J67728J29819Q6307J27852K00689K12729J73926J31429
$$ 658160269 658309579 658463001 658630729 658760548 658846855 658974707 659175396 659388125 659562051 659693480
3985.3F59693480J20699J40190J24097J00076J52767K39432
$$ 659693480 659814179 659954369 660078466 660178542 660331309 660570741
3997.5F60570741
$$ 660570741
##END=$$ End of the data block
