##TITLE=G04-52-CE $$ Begin of the data block
##JCAMP-DX=5.00 $$ ACD/SpecManager v 10.08
##SPECTROMETER/DATA SYSTEM=Alpha
##DATE=17 Oct 2013 10:58:30
##DATA TYPE=INFRARED SPECTRUM
##DATA CLASS=XYDATA
##ORIGIN=
##OWNER=
##NPOINTS=1765
##FIRSTX=399.75695801
##LASTX=3997.56933594
##MAXX=3997.56933594
##MINX=399.75695801
##MAXY=0.79150492
##MINY=0.11899525
##XFACTOR=1.0000000000
##YFACTOR=1.000000000000000e-9
##FIRSTY=0.37042344
##DELTAX=2.03957629
##XUNITS=1/CM
##YUNITS=ARBITRARY UNITS
##XYDATA=(X++(Y..Y))
399.8C70423436l622830k629161j019477J99407M73410L80993N38349N44876k44469
418.1C65044534j274854j368522j578510k064496j844347j463622j534849j560539
434.4C52354795q20309O64681J722038J845836J678855J364439P26194J04457l50654
452.8C59290332p51347j457214k442241k656817k432585k635241k976477k903253k516835
471.1C38518322k340675k207935j726746j046658n57423o16967r34482r40203r81391
489.5C27165842j625925k259642k103239j853526k313346k894580k763569k498270
505.8C08853745k808511l057271k768010k368480k467185k888233k618998j600116
522.1B88276941p98226n84602k44469O37949J330614J630187K230853L014177L026575
$$ plain form
399.8 370423436 366800606 364171445 363151968 363351375 363824785 364205778 364744127 365289003 365044534
418.1 365044534 363769680 362401158 360822648 358758152 356913805 355450183 353915334 352354795
434.4 352354795 351534486 352199167 353921205 355767041 357445896 358810335 359536529 359640986 359290332
452.8 359290332 358538985 357081771 354639530 351982713 349550128 346914887 343938410 341035157 338518322
471.1 338518322 336177647 333969712 332242966 331196308 330638885 330021918 329087436 328147233 327165842
489.5 327165842 325539917 323280275 321177036 319323510 317010164 314115584 311352015 308853745
505.8 308853745 306045234 302987963 300219953 297851473 295384288 292496055 289877057 288276941
522.1 288276941 287478715 286894113 286649644 287287593 288618207 290248394 292479247 295493424 298519999
540.5B98519999J989692P30127J16408j64509q04901j477837j592368j451105j790583
558.8B94074923k347112k453834k437770k686232k688975j839667m48823N43564R75311
577.2B80691385J646996K764791L514528L347278K816379K428502J831770P78943K3484
595.6B99844056J02431L04133L4511k31505N6953M78357L87370J31220N32806J288056
616C02928388J482666J422941J981408K919912L272832K871990K521246K606601K593666
634.3C24601650K115876J625687J663506J856506J531630R77218Q65579R12398N36114
652.7C36686164N0217J12593N17130M52340O4790M61310J958460K045542j9312L03477
673.1C42632711J593351K062023J686543J362086J396030J352578R24558L41534r6917
$$ plain form
540.5 298519999 300509691 301239818 301356226 301191717 300386816 298908979 297316611 295865506 294074923
558.8 294074923 291727811 289273977 286836207 284149975 281461000 279621333 279172510 279716074 280691385
577.2 280691385 282338381 285103172 288617700 291964978 294781357 297209859 299041629 299820572 299844056
595.6 299844056 299946487 300250620 300285131 300053626 300110579 300588936 300976306 301107526 301640332 302928388
616 302928388 304411054 305833995 307815403 310735315 314008147 316880137 319401383 322007984 324601650
634.3 324601650 326717526 328343213 330006719 331863225 333394855 334372073 335237652 336150050 336686164
652.7 336686164 336736381 336848974 337366104 337818444 337883234 338344544 340303004 342348546 342329234 342632711
673.1 342632711 344226062 346288085 347974628 349336714 350732744 352085322 353009880 353351414 353254497
691.4C53254497o20723j387685j854420j367688k27958P20411J286567J921415K736270
709.8C54460686L362209L647834L979355M687697N312562N387843N422115N711019
726.1C91971320N605578M909844M079699L429055K861887K011896J056075M52012P5250
744.4D16452616m97460j115918j461357j631290j944691k291917k147437j483619o91026
762.8D03187901K52187J687259L396987M878432N986929O743133P064790O840527O074726
781.2D46112871N130500M401207L774881L193766K807707K730727K886206L219574
797.5D74257439L767699M301936M353314L750682K985061K384275J747727R22620J98186
815.8D98668939k08408o67810j556397k633482l480166m010975m359663m564583m471571
$$ plain form
691.4 353254497 352633774 351246089 349391669 348023981 347796023 348516434 349803001 351724416 354460686
709.8 354460686 357822895 361470729 365450084 370137781 375450343 380838186 386260301 391971320
726.1 391971320 397576898 402486742 406566441 409995496 412857383 414869279 415925354 416377366 416452616
744.4 416452616 415955156 414839238 413377881 411746591 409801900 407509983 405362546 403878927 403187901
762.8 403187901 403440088 405127347 408524334 413402766 419389695 426132828 433197618 440038145 446112871
781.2 446112871 451243371 455644578 459419459 462613225 465420932 468151659 471037865 474257439
797.5 474257439 478025138 482327074 486680388 490431070 493416131 495800406 497548133 498470753 498668939
815.8 498668939 498460531 497792721 496236324 493602842 490122676 486111701 481752038 477187455 472715884
834.2D72715884m200965m069626m024059l656596k959132k360880j958281j545399
850.5D47940946j072705q01057p73817k37793J513839L946751N971164P303506Q029908
868.9D71820742P786661O271303L888637J362264j120359l620326n727828o914168
885.2D73746926p251382p305771p248581o800771o108045n796969o073654o510168
901.5D20651585o841928p319420q018762q440346q267671p749557p093519o108523
917.8C60811859m599988k934843j784832j273304r56774n92261l56138l54707l64661
936.2C47594351k78145m56006j320869k983123n281776p727057r600341j0476053j0505288
954.5B98965693j0196358r964556r751826r339005q793801q291766p761613o968796
$$ plain form
834.2 472715884 468514919 464445293 460421234 456764638 453805506 451444626 449486345 447940946
850.5 447940946 446868241 446067184 445293367 445055574 446569413 450516164 456487328 463790834 471820742
868.9 471820742 479607403 485878706 489767343 491129607 490009248 486388922 480661094 473746926
885.2 473746926 466495544 459189773 451941192 445140421 439032376 433235407 427161753 420651585
901.5 420651585 413809657 406490237 398471475 390031129 381763458 374013901 366920382 360811859
917.8 360811859 356211871 353277028 351492196 350218892 349262118 348669857 348313719 347959012 347594351
936.2 347594351 347316206 346860200 345539331 342556208 337274432 329547375 319947034 309470981 298965693
954.5 298965693 288769335 278804779 269052953 259713948 250920147 242628381 234866768 227897972
970.8B27897972n926281m939005m160792l467962k855241k511054k485917k527669
987.1A99024051k422496k246470k081647j818270j373022q94174n51686m13164n04122
1005.5A86719000p74815j163408j552910j736611j703874j647785j658007j671657
1021.8A74809933j651600j680836j781956j797884j673982j602769j669198j723811
1038.1A61227897j669079j564354j428977j245245j017064o68555k03044K32220N87717
1056.5A54251516R59843J331970J591966J695052J509934Q34182k08392j022742j016795
1074.8A59926534k27586Q50618J922697K883702L630743M062235M176081M090413L876984
1093.2A85192421L523350L003269K423033J921863J575142J476854J669988K056286
$$ plain form
970.8 227897972 221971691 217032686 212871894 209403932 206548691 204037637 201551720 199024051
987.1 199024051 196601555 194355085 192273438 190455168 189082146 188187972 187636286 187223122 186719000
1005.5 186719000 185944185 184780777 183227867 181491256 179787382 178139597 176481590 174809933
1021.8 174809933 173158333 171477497 169695541 167897657 166223675 164620906 162951708 161227897
1038.1 161227897 159558818 157994464 156565487 155320242 154303178 153634623 153431579 153663799 154251516
1056.5 154251516 155211359 156543329 158135295 159830347 161340281 162174463 161966071 160943329 159926534
1074.8 159926534 159698948 160549566 162472263 165355965 168986708 173048943 177225024 181315437 185192421
1093.2 185192421 188715771 191719040 194142073 196063936 197639078 199115932 200785920 202842206
1109.5B02842206K423733K600134K574265K432182K228126J954123J674548J594737
1125.8B20324054J818434K167359K334118K175539J783476J217618M79415j92567n45472
1144.2B31561974o74725p14034o02230k83554K11611Q76948J710236K635554L523305
1162.6B38245085M225328M639194M901185N282134N792231O245076O555260O784796
1178.9B82670289O890029O746590O416470N978674N320191M306912L034741J761705
1195.2C23125601O56068k22295q55118j217544j250804j052558p99209n78761m50135
1213.5C17355245m69088o27190q23319j025319j307696j664937j935929k013832j922041
1231.9C05565894j718581j436085j027494m65572J38372P08789J290261J847744K278120
$$ plain form
1109.5 202842206 205265939 207866073 210440338 212872520 215100646 217054769 218729317 220324054
1125.8 220324054 222142488 224309847 226643965 228819504 230602980 231820598 232300013 232107446 231561974
1144.2 231561974 230887249 230173215 229570985 229287431 229499042 230375990 232086226 234721780 238245085
1162.6 238245085 242470413 247109607 252010792 257292926 263085157 269330233 275885493 282670289
1178.9 282670289 289560318 296306908 302723378 308702052 314022243 318329155 321363896 323125601
1195.2 323125601 323781669 323559374 322704256 321486712 320235908 319183350 318384141 317805380 317355245
1213.5 317355245 316886157 316258967 315435648 314410329 313102633 311437696 309501767 307487935 305565894
1231.9 305565894 303847313 302411228 301383734 300918162 301056534 301765323 303055584 304903328 307181448
1250.3C07181448K510816K615600K706856K768993K719522K583295K517283K552420
1266.6C28156233K548992K408177K185434J939118J662046J372933J200885J241386
1282.9C42715204J361400J348853J174956R30876N19186j43826q76039j411051j717537
1301.2C43902022j929164k072811k063424j859605j555771j197159p34597j74165K62201
1319.6C32577527L60697J13756m35621j210034j995176k485126k519131k213627j859039
1338C20334226j568973j215190q42661p45475r55820j261204j530886j785636k059132
1356.3C08369249k269477k576351l261119m030287m364044m222154l566921l072619
1372.6B81006277l290296l641844l830850m042894m043400l505230k621531j599431
$$ plain form
1250.3 307181448 309692264 312307864 315014720 317783713 320503235 323086530 325603813 328156233
1266.6 328156233 330705225 333113402 335298836 337237954 338900000 340272933 341473818 342715204
1282.9 342715204 344076604 345425457 346600413 347531289 348050475 347906649 347030610 345619559 343902022
1301.2 343902022 341972858 339900047 337836623 335977018 334421247 333224088 332489491 332315326 332577527
1319.6 332577527 332938224 333051980 332616359 331406325 329411149 326926023 324406892 322193265 320334226
1338 320334226 318765253 317550063 316707402 315961927 315006107 313744903 312214017 310428381 308369249
1356.3 308369249 306099772 303523421 300262302 296232015 291867971 287645817 284078896 281006277
1372.6 281006277 277715981 274074137 270243287 266200393 262156993 258651763 256030232 254430801
1388.9B54430801o89835k16901q4639R6202L82752P78824J308947J787782K009988
1407.3B59803921K079129K126694K168059K312780K565145K763301K618641K478808
1423.6B78916478K275974J787275J149118M36634j11103o43164r00537l63797K52187
1442B82799065N57274P09921O99490N28574M68522R02653K044171L064484K989590
1460.3B94763744K988487L406883L885090M741192O606787R036541R343088P628053
1476.6C42399865N912960M251510K575904Q41081r55343l081024n051523n609542o143600
1495C35140288p511377p779778o890147o194801p552295j1061311j0488749q591592
1511.3B69070238q019149o738782m703224k727926k097130k290427k407745k605036
$$ plain form
1388.9 254430801 253740966 253524065 253439426 253535628 253918380 254697204 256006151 257793933 259803921
1407.3 259803921 261883050 264009744 266177803 268490583 271055728 273819029 276437670 278916478
1423.6 278916478 281192452 282979727 284128845 284565479 284454376 283811212 282910675 282546878 282799065
1442 282799065 283356339 284066260 284765750 285294324 285762846 286665499 288709670 291774154 294763744
1460.3 294763744 297752231 301159114 305044204 309785396 316392183 325428724 334771812 342399865
1476.6 342399865 348312825 352564335 355140239 355981320 355025977 351944953 346893430 341283888 335140288
1495 335140288 327628911 319849133 312958986 306764185 299211890 288150579 277661830 269070238
1511.3 269070238 261051089 254312307 249609083 246881157 244784027 242493600 240085855 237480819
1527.6B37480819k312407j951798j909227j386448o80045n30749l03388M99249J348063
1546B30254069K184838L051519L779650M358307M745394N580187N696713M031867L569901
1564.3B67252445L681451L508151L148466K495468K149880J830667J140118O88553
1580.7B85895199L91513J69128o6131l89129q34674j295656j870096k467781l077477
1599B76454896l861189m705995n464316o253183p255092p914692q017138q927986j0716155
1617.4B13339150r992391r516910j0993123j0988176j0030463r350002q002028p174015
1633.7A37292042p437214n693629l066652j551628n47670K27765Q65742J206540J672782
1652A22968078K366602K474278K713189L578439M670963N429000N520075O315664P387667
$$ plain form
1527.6 237480819 235168412 233216614 231307387 229920939 229240894 228710145 228406757 228906006 230254069
1546 230254069 232438907 235490426 239270076 243628383 248373777 253953964 259650677 263682544 267252445
1564.3 267252445 270933896 274442047 277590513 280085981 282235861 284066528 285206646 285895199
1580.7 285895199 286286712 286455840 286389709 286000580 285165906 283870250 282000154 279532373 276454896
1599 276454896 272593707 267887712 262423396 256170213 248915121 241000429 232983291 224055305 213339150
1617.4 213339150 203346759 193829849 182836726 171848550 161818087 152468085 144466057 137292042
1633.7 137292042 129854828 124161199 121094547 119542919 118995249 119223014 120088756 121295296 122968078
1652 122968078 125334680 127808958 130522147 134100586 138771549 144200549 149720624 156036288 163423955
1670.4A63423955P175267P606402Q446694Q284971Q324668R703084J2237609J1842415
1686.7B37045065J1073768J2693897J3956666J7176538K0154745K0518452K2239148
1701C54858279J8829465J5909463J5591383J3407022J1492878J0358572R668499R268284
1717.3D59383845P652760N803466N137950M722208M017561L541440L230184L091246
1733.6D96580660K699197K546727L231943M115164M952252O038487P285655Q562922
1749.9E36013007R135723Q601427Q576751Q759439Q324385Q035719P324934O800056
1766.3F01571441O747782O328523N890131N266547M540742M211962L946125L685892
1782.6F42189145L553689L301918L013134K967417K980948K618134K312541K330124
$$ plain form
1670.4 163423955 170599222 178205624 186652318 194937289 203261957 212965041 225202650 237045065
1686.7 237045065 248118833 260812730 274769396 291945934 312100679 332619131 354858279
1701 354858279 373687744 389597207 405188590 418595612 430088490 440447062 450115561 459383845
1717.3 459383845 467036605 472840071 477978021 482700229 486717790 490259230 493489414 496580660
1733.6 496580660 499279857 501826584 505058527 509173691 514125943 520164430 527450085 536013007
1749.9 536013007 545148730 553750157 562326908 571086347 579410732 587446451 594771385 601571441
1766.3 601571441 608319223 614647746 620537877 625804424 630345166 634557128 638503253 642189145
1782.6 642189145 645742834 649044752 652057886 655025303 658006251 660624385 662936926 665267050
1798.9F65267050K422869K305806K065897K015412K152205K177476J898170J729846
1815.2F82034731J842260J947761J835942J716316J736462J753509J626194J310885
1831.5F95804060J198530J354217J402140J258671J221121J285910J180828R28998
1847.8G05634475P86602Q96037J073718J040995Q54790Q27849R51827J002311R13263
1866.2G13981867P80761P12514P21216P03395O63697P83265R40561Q94070P64072Q37982
1886.6G21783400R70006Q45372O57320O61433P51853P17163N65291M91917N89251O59168
1907G28692174N54979M20689M60983O25968O08921M22835L88265M75585M39525L21328
1927.4G33411252L16442M48167M76718K85029K14160M02033M99725L10958J64211K80797
$$ plain form
1798.9 665267050 667689919 669995725 672061622 674077034 676229239 678406715 680304885 682034731
1815.2 682034731 683876991 685824752 687660694 689377010 691113472 692866981 694493175 695804060
1831.5 695804060 697002590 698356807 699758947 701017618 702238739 703524649 704705477 705634475
1847.8 705634475 706421077 707317114 708390832 709431827 710286617 711114466 712066293 713068604 713981867
1866.2 713981867 714762628 715475142 716196358 716899753 717563450 718346715 719287276 720181346 720945418 721783400
1886.6 721783400 722753406 723598778 724256098 724917531 725669384 726386547 726951838 727443755 728033006 728692174
1907 728692174 729247153 729667842 730128825 730754793 731363714 731786549 732174814 732650399 733089924 733411252
1927.4 733411252 733727694 734175861 734652579 734937608 735151768 735553801 736053526 736364484 736528695 736809492
1947.8G36809492M53711M36484L06786L20434M34160M43042L47793L58164M57704M23789
1968.2G40791559K43128J86741L50356M29750K68399J24216K16246L45826K92003J61231
1988.6G43409455J83642K62677K01106Q7917O3897J47879J63078L7849q1658p8381
2009G44397461o3061j57595k66671k60353k10524k68757l57688l57628l10003l46721
2029.4G41798460m17828l97861l09050k60949k93911l05235k41876j79887j86085j69695
2049.8G39036083r1851J491M9829O0558J19567J64032J09017P9096J71721K08795J51515
2072.2G40059853J27613J30773J16527J11341J10328J28448J89901K08259J76370J64926
2092.6G41524339J95265J96695J84715K29358K78056K66254K18689K20657K44975K09093
$$ plain form
1947.8 736809492 737263203 737699687 738006473 738326907 738761067 739204109 739551902 739910066 740367770 740791559
1968.2 740791559 741034687 741221428 741571784 742001534 742269933 742394149 742610395 742956221 743248224 743409455
1988.6 743409455 743593097 743855774 744056880 744144797 744208694 744356573 744519651 744557500 744475842 744397461
2009 744397461 744334400 744176805 743910134 743649781 743439257 743170500 742812812 742455184 742145181 741798460
2029.4 741798460 741380632 740982771 740673721 740412772 740118861 739813626 739571750 739391863 739205778 739036083
2049.8 739036083 738944232 738945723 738995552 739056110 739175677 739339709 739448726 739527822 739699543 739908338 740059853
2072.2 740059853 740187466 740318239 740434766 740546107 740656435 740784883 740974784 741183043 741359413 741524339
2092.6 741524339 741719604 741916299 742101014 742330372 742608428 742874682 743093371 743314028 743559003 743768096
2113G43768096J41680J36554J76907J68443R3937P4923J49965J63376J03712J01984
2133.4G45079577J69039J94490J37448J02758J59145J97172J31190Q1241J81317L24786
2153.8G46758163L14236K32577K76446M13180M78565M39644M50015N98252O98388O12557
2174.2G51272023N38349O08206O62803N84543N26905O14464O92726O13689M79698M87268
2194.6G57080674N94020N82814M60089M38272N49376N82934M80711M45426N41150N95332
2215G62350798N08248L93749M08649M97878M53055K98559K93196L90112L31581J71184
2235.4G66097009J42694K88248L76642K83420J82569K23159K88248K22981J33992J78098
2255.8G68417060K79129K54691J61826J71185K54273K69473J69337R2685J53005J73569
$$ plain form
2113 743768096 743909776 744046330 744223237 744391680 744485617 744560540 744710505 744873881 744977593 745079577
2133.4 745079577 745248616 745443106 745580554 745683312 745842457 746039629 746170819 746252060 746433377 746758163
2153.8 746758163 747072399 747304976 747581422 747994602 748473167 748912811 749362826 749961078 750659466 751272023
2174.2 751272023 751810372 752418578 753081381 753665924 754192829 754807293 755500019 756113708 756593406 757080674
2194.6 757080674 757674694 758257508 758717597 759155869 759705245 760288179 760768890 761214316 761755466 762350798
2215 762350798 762859046 763252795 763661444 764159322 764612377 764910936 765204132 765594244 765925825 766097009
2235.4 766097009 766239703 766527951 766904593 767188013 767370582 767593741 767881989 768104970 768238962 768417060
2255.8 768417060 768696189 768950880 769112706 769283891 769538164 769807637 769976974 770069659 770222664 770396233
2276.1G70396233o795j49429k8789K02715K73466K23816K85625L90053L67880K78175
2296.5G72232950L01659M48763N52297N82337O83248Q62181R02117P02917N73874Q86917
2316.9G78729260J403451J539409J164556Q08060Q50618R39011O12021J56700R1970
2335.3G86295056J89782J53422j12295j164913l053725l074944n51760K298116L841698
2353.6G84820437L637791K392292O54400p62105j850903k899707l666520l923476l833234
2372G74568975l554881l217220k925694k626896k256989j778543j275719q96632o91653
2390.4G55344748o24895o02483n87941o16967o60479o70910o77943p23184p90774q17180
2410.8G48571992p95782p98165q71480r55284r67323r54748r85443j014352j007199
$$ plain form
2276.1 770396233 770389438 770240009 770211220 770413935 770687401 770911217 771196842 771586895 771954775 772232950
2296.5 772232950 772534609 772983372 773535669 774118006 774801254 775663435 776565552 777268469 777842343 778729260
2316.9 778729260 780132711 781672120 782836676 783644736 784495354 785434365 786046386 786203086 786295056
2335.3 786295056 786484838 786638260 786525965 785361052 782307327 779232383 778680623 780978739 784820437
2353.6 784820437 788458228 790850520 791504920 790742815 788891912 785992205 782325685 778402209 774568975
2372 774568975 771014094 767796874 764871180 762244284 759987295 758208752 756933033 756036401 755344748
2390.4 755344748 754719853 754117370 753529429 752912462 752251983 751581073 750903130 750179946 749389172 748571992
2410.8 748571992 747776210 746978045 746106565 745151281 744183958 743229210 742243767 741229415 740222216
2429.1G40222216r93550j001001j031875j050055j072705j099467j067400j029074
2445.4G31877089j044393j068711j060307j023412r96173j013278j038552j012981
2461.7G23619282r74297r72390r80676r89556j002371j006842j010001r62436q95738
2480.1G14824975r25482r84251r62735r07540q93295r14871r21190q61168p95841q33750
2500.5G05824852q93295q59201p98404q01921q50379q69513q48234q47995q74340q90255
2520.9F97291315q88706r08851r74536j008034r83834r71437j008451j060545j044035
2539.2F88442886r96947j017511j046777j007021r58085r67502r96411r90808r52005
2557.6F79509819r18508r46045r87351r35554q69811r20713r97484r85741r39429r49681
$$ plain form
2429.1 740222216 739228666 738227665 737195790 736145735 735073030 733973563 732906163 731877089
2445.4 731877089 730832696 729763985 728703678 727680266 726684093 725670815 724632263 723619282
2461.7 723619282 722644985 721672595 720691919 719702363 718699992 717693150 716683149 715720713 714824975
2480.1 714824975 713899493 712915242 711952507 711044967 710151672 709236801 708315611 707454443 706658602 705824852
2500.5 705824852 704931557 704072356 703273952 702472031 701621652 700752139 699903905 699055910 698181570 697291315
2520.9 697291315 696402609 695493758 694519222 693511188 692527354 691555917 690547466 689486921 688442886
2539.2 688442886 687445939 686428428 685381651 684374630 683416545 682449043 681452632 680461824 679509819
2557.6 679509819 678591311 677645266 676657915 675722361 674852550 673931837 672934353 671948612 671009183 670059502
2578F70059502j005351j002670r20295q91328r64165r98914r26674q88526r45151r82642
2598.4F60533786r79543r84788j043379j152933j189053j162290j231015j368225j416564
2616.8F50005996j393974j449525j566768j601576j548708j560926j683474j751602
2633.1F37449443j692474j653850j707553j756192j736223j687825j670420j698554
2649.4F23846352j716971j651764j587391j657486j736164j668811j595199j626372
2665.7F10606194j635552j552582j460552j463652j517295j494110j411319j378119
2682E98693013j413166j424075j387894j387179j446783j488388j460671j445115j533746
2700.4E85705996j648426j664043j630425j670719j756966j758039j686275j679420
$$ plain form
2578 670059502 669054151 668051481 667131186 666239858 665275693 664276779 663350105 662461579 661516428 660533786
2598.4 660533786 659554243 658569455 657526076 656373143 655184090 654021800 652790785 651422560 650005996
2616.8 650005996 648612022 647162497 645595729 643994153 642445445 640884519 639201045 637449443
2633.1 637449443 635756969 634103119 632395566 630639374 628903151 627215326 625544906 623846352
2649.4 623846352 622129381 620477617 618890226 617232740 615496576 613827765 612232566 610606194
2665.7 610606194 608970642 607418060 605957508 604493856 602976561 601482451 600071132 598693013
2682 598693013 597279847 595855772 594467878 593080699 591633916 590145528 588684857 587239742 585705996
2700.4 585705996 584057570 582393527 580763102 579092383 577335417 575577378 573891103 572211683
2716.7E72211683j765192j785516j674891j592815j609445j613676j522780j425325
2733E59222043j425446j452147j406849j353741j375258j407027j370132j295805j271128
2751.4E46864510j300335j310230j275003j257836j295209j348794j360655j311302
2767.7E36405146j324355j421094j444757j434029j514315j611293j646220j674950
2784E24334133j774073j903236j940966j923441j961768k061963k148628k164364k192676
2802.3E06263018k300322k430082k510696k544165k601653k681196k733141k783984
2818.7D85677779k873838k995074l119677l235042l367544l550857l773898m037916
2835D58723933m403383m925162n662113o596267p548511q285582q481563p821023o335795
$$ plain form
2716.7 572211683 570446491 568660975 566986084 565393269 563783824 562170148 560647368 559222043
2733 559222043 557796597 556344450 554937601 553583860 552208602 550801575 549431443 548135638 546864510
2751.4 546864510 545564175 544253945 542978942 541721106 540425897 539077103 537716448 536405146
2767.7 536405146 535080791 533659697 532214940 530780911 529266596 527655303 526009083 524334133
2784 524334133 522560060 520656824 518715858 516792417 514830649 512768686 510620058 508455694 506263018
2802.3 506263018 503962696 501532614 499021918 496477753 493876100 491194904 488461763 485677779
2818.7 485677779 482803941 479808867 476689190 473454148 470086604 466535747 462761849 458723933
2835 458723933 454320550 449395388 443733275 437137008 429588497 421302915 412821352 405000329 398664534
2853.3C98664534m497796l006757k368420k602547l371954m284203m989744n216389
2869.7C68326724m863114m033476l029257k148896j550764j284421j282900j427740
2886C48706156j620531j821667k035499k254963k462804k674192k921194l205538l532946
2904.3C26176822l955632m500151n082786n624503o101817o376356o270915n726546
2920.6B82538116m771471l550410k229452q68977M78656J751393K923578L978341M817844
2939B85067618N226999N103738M572957L790975K886385K038389J397640J092165J285523
2957.4C12462389J952202K866476L852845M825592N687445O366015O879389P189542
2973.7C52081895P277578P206261O932885O476223N998135N514413M911154M204959
$$ plain form
2853.3 398664534 394166738 391159981 388791561 386189014 382817060 378532857 373543113 368326724
2869.7 368326724 363463610 359430134 356400877 354251981 352701217 351416796 350133896 348706156
2886 348706156 347085625 345263958 343228459 340973496 338510692 335836500 332915306 329709768 326176822
2904.3 326176822 322221190 317721039 312638253 307013750 300911933 294535577 288264662 282538116
2920.6 282538116 277766645 274216235 271986783 271117806 271596462 273347855 276271433 280249774 285067618
2939 285067618 290294617 295398355 299971312 303762287 306648672 308687061 310084701 311176866 312462389
2957.4 312462389 314414591 317281067 321133912 325959504 331646949 338012964 344892353 352081895
2973.7 352081895 359359473 366565734 373498619 379974842 385972977 391487390 396398544 400603503
2990D00603503L483653K759010K023697J244247M46409k48820q02040j201362j390218
3008.3D06918079j389802j281291j112461r97722j067728j296431j625448j982004
3024.7C96165192k215743k294809k336472k407789k460629k507210k633750k766073
3041C76542717k815008k837777k891183k935350k920151k900064k901286k889037k840042
3059.3C50612819k735972k589703k419501k212704j999318j886696j884639j859516
3075.6C33024770j750231j647621j614094j578093j463413j332462j259625j224398
3092C21154833j225561j254916j256079j242399j298100j420378j513422j510411j474679
3110.3C08958888j525164j642316j723439j742035j769095j839728j889974j924425
$$ plain form
2990 400603503 404087156 406846166 408869863 410114110 410560519 410311699 409509659 408308297 406918079
3008.3 406918079 405528277 404246986 403134525 402136803 401069075 399772644 398147196 396165192
3024.7 396165192 393949449 391654640 389318168 386910379 384449750 381942540 379308790 376542717
3041 376542717 373727709 370889932 367998749 365063399 362143248 359243184 356341898 353452861 350612819
3059.3 350612819 347876847 345287144 342867643 340654939 338655621 336768925 334884286 333024770
3075.6 333024770 331274539 329626918 328012824 326434731 324971318 323638856 322379231 321154833
3092 321154833 319929272 318674356 317418277 316175878 314877778 313457400 311943978 310433567 308958888
3110.3 308958888 307433724 305791408 304067969 302325934 300556839 298717111 296827137 294902712
3126.6B94902712j978516k019734k077102k164454k200245k176851k184093k232999
3143B77868718k253473k241224k239197k256602k289951k321452k320379k321452k334148
3161.3B57290840k337038k335519k319366k316743k324283k295136k276272k284318
3177.6B38802165k260909k254069k259060k211497k164706k168268k157673k068982
3193.9B21257001k000034j998886j958564j894876j885534j853063j762614j722276
3210.3B06181154j769781j790777j704678j624599j651347j707986j714006j693219
3226.6A92524761j681462j723617j807750j856640j866981j880169j906022j926020
3242.9A77876100j944035j984761k053514k109840k106518k089515k127707k142146
$$ plain form
3126.6 294902712 292924196 290904462 288827360 286662906 284462661 282285810 280101717 277868718
3143 277868718 275615245 273374021 271134824 268878222 266588271 264266819 261946440 259624988 257290840
3161.3 257290840 254953802 252618283 250298917 247982174 245657891 243362755 241086483 238802165
3177.6 238802165 236541256 234287187 232028127 229816630 227651924 225483656 223325983 221257001
3193.9 221257001 219256967 217258081 215299517 213404641 211519107 209666044 207903430 206181154
3210.3 206181154 204411373 202620596 200915918 199291319 197639972 195931986 194217980 192524761
3226.6 192524761 190843299 189119682 187311932 185455292 183588311 181708142 179802120 177876100
3242.9 177876100 175932065 173947304 171893790 169783950 167677432 165587917 163460210 161318064
3259.2A61318064k092317k050087k008110j942516j814752j654819j558825j465798
3275.5A46730840j323908j196608j077041r78724q97318p54714o36220n76853m72665
3293.9A38816789l63901l08872k64793j98618j36569j22532r5651j6525K7835L5629
3314.3A37372792N7280P4446R6306J33246J33932P6547L3409P3343J35109J44884J02893
3336.7A38434187L5628j0207k6226o1318r0585n8606j8462n8711j37865j24887o2108
3359.1A37820840m6924n8636p0453q2358j06231j75848k18377j33008m4494o1304r5665
3381.6A36727542n2035K6226J03325J34274P9200L7938L2842O7473J64955J70976O8695
3404A37561411J08689K47016K98962K94701L23131L88801M20750M14460M19960N18471
$$ plain form
3259.2 161318064 159225747 157175660 155167550 153225034 151410282 149755463 148196638 146730840
3275.5 146730840 145406932 144210324 143133283 142154559 141257241 140502527 139866307 139289454 138816789
3293.9 138816789 138452888 138144016 137879223 137680605 137544036 137421504 137325853 137309328 137337163 137372792
3314.3 137372792 137430072 137504518 137600824 137734070 137868002 137944549 137977958 138051301 138186410 138331294 138434187
3336.7 138434187 138469815 138459608 138433382 138372064 138281479 138222873 138204411 138145700 138007835 137882948 137820840
3359.1 137820840 137773916 137715280 137644827 137562469 137456238 137280390 137062013 136929005 136884511 136823207 136727542
3381.6 136727542 136675507 136701733 136805058 136939332 137018532 137056470 137089312 137156785 137321740 137492716 137561411
3404 137561411 137670100 137917116 138216078 138510779 138833910 139222711 139643461 140057921 140477881 140996352
3424.4A40996352O85215Q03768Q15765Q50111R33826Q59439P04914P15405Q47399R90481
3444.8A49202675J107186J106992J081318J136794J218990J267582J273096J241237
3461.1A58635870J298084J498461J609564J482084J243085J233906J508042J781404
3477.4A70290500J814902J655072J618132J775622J860932J832649J864433J885965
3493.8A84598207J901389J983165K052620K010555J897454J925930K081618K171963
3510.1B00622901K248049K316028K271026K224237K288982K448336K497241K425655
3526.4B19342455K414212K502590K655387K799854K846315K781094K805575K965138
3542.7B41112620L065139L005370K995178L096789L168524L229022L347516L487378
$$ plain form
3424.4 140996352 141681567 142485335 143301100 144151211 145085037 145944476 146649390 147364795 148212194 149202675
3444.8 149202675 150309861 151416853 152498171 153634965 154853955 156121537 157394633 158635870
3461.1 158635870 159933954 161432415 163041979 164524063 165767148 167001054 168509096 170290500
3477.4 170290500 172105402 173760474 175378606 177154228 179015160 180847809 182712242 184598207
3493.8 184598207 186499596 188482761 190535381 192545936 194443390 196369320 198450938 200622901
3510.1 200622901 202870950 205186978 207458004 209682241 211971223 214419559 216916800 219342455
3526.4 219342455 221756667 224259257 226914644 229714498 232560813 235341907 238147482 241112620
3542.7 241112620 244177759 247183129 250178307 253275096 256443620 259672642 263020158 266507536
3559B66507536L546745L557503L630131L819198L922373L910959L980964M147262M307329
3577.4C01330000M422397M509061M579842M644543M724145M832804M822493M807591
3593.7C38672876M898578N038798N120129N091220N040586N041897N161524N219728
3610C79285336N209386N311727N364120N413354N546152N413712N224615N268484N492330
3628.4D27529216N451232N042464M944592M980296M946947M982919N056858N115449
3644.7D68049973N198747N224019M854024M393309M385948M647047M606455M345477
3661E05704999M198611M216611M221499M115701M013538L810525L498793L238201L140807
3679.4E40159285L172040L329754L492355L460110L037393K539515K425492K501070
$$ plain form
3559 266507536 270054281 273611784 277241915 281061113 284983486 288894445 292875409 297022671 301330000
3577.4 301330000 305752397 310261458 314841300 319485843 324209988 329042792 333865285 338672876
3593.7 338672876 343571454 348610252 353730381 358821601 363862187 368904084 374065608 379285336
3610 379285336 384494722 389806449 395170569 400583923 406130075 411543787 416768402 422036886 427529216
3628.4 427529216 432980448 438022912 442967504 447947800 452894747 457877666 462934524 468049973
3644.7 468049973 473248720 478472739 483326763 487720072 492106020 496753067 501359522 505704999
3661 505704999 509903610 514120221 518341720 522457421 526470959 530281484 533780277 537018478 540159285
3679.4 540159285 543331325 546661079 550153434 553613544 556650937 559190452 561615944 564117014
3695.7E64117014K533496K431214K193272K018153K063036K126813J899779J413465
3712E80796242J323163J662731J966596K011836J825273J559853J369000J546859J815856
3730.3E95877409J735926J288890Q68023R21667J236021J244605J024663J253486J354575
3748.7F06805265P98523N06819R55224J288294J134992R30429J051902J157582J055181
3767.1F15684211Q77917P84755R06408J093745J166761J053989Q79168P55251O57081
3785.4F23859286P15673R16720J009524R59456R01937R59694R10819O62923P36832
3803.8F31632864P59960N05149O03378R32753R83655Q31604Q76248O51360K30610M23134
3824.2F38430715O90817O98865O96778P52926Q98123P71105K97487J81496L32534L82066
$$ plain form
3695.7 564117014 566650510 569081724 571274996 573293149 575356185 577482998 579382777 580796242
3712 580796242 582119405 583782136 585748732 587760568 589585841 591145694 592514694 594061553 595877409
3730.3 595877409 597613335 598902225 599770248 600691915 601927936 603172541 604197204 605450690 606805265
3748.7 606805265 607603788 608110607 609065831 610354125 611489117 612419546 613471448 614629030 615684211
3767.1 615684211 616562128 617346883 618253291 619347036 620513797 621567786 622446954 623202205 623859286
3785.4 623859286 624574959 625491679 626501203 627460659 628362596 629322290 630233109 630896032 631632864
3803.8 631632864 632392824 632897973 633501351 634434104 635417759 636249363 637125611 637776971 638007581 638430715
3824.2 638430715 639121532 639820397 640517175 641270101 642168224 642939329 643236816 643418312 643750846 644132912
3844.6F44132912O07371J058698J188517M00483l68356J54733O37412O94216N99265
3862.9F49105251M97341N19454M04776K26736K52485L53456M98652M82798M31120N14925
3883.3F53286994L40342K05994K74360J45554J71960M53412N50688M45485K57432K7001
3903.7F56159222o4134N4776K15233L38435L78489K69890J07110J15096K20001J86443
3924.1F57980561J49489K41160K15948O3121P8023K36213K87890K19286J60157J82152
3944.5F59814000K33174J94311J30415J79767K33829J83583J32441J32144J78039J93238
3964.9F61604941J13726J24752K11954J76907J00791R4116J40607K03371J89126J28448
3985.3F63088739J30355J63615J64747J44899J52528K08736
$$ plain form
3844.6 644132912 644740283 645798981 646987498 647387981 647019625 647174358 647811770 648505986 649105251
3862.9 649105251 649602592 650122046 650526822 650753558 651006043 651359499 651858151 652340949 652772069 653286994
3883.3 653286994 653627336 653833330 654107690 654253244 654425204 654878616 655429304 655874789 656132221 656159222
3903.7 656159222 656095088 656149864 656365097 656703532 657082021 657351911 657459021 657574117 657794118 657980561
3924.1 657980561 658130050 658371210 658587158 658650279 658728302 658964515 659252405 659471691 659631848 659814000
3944.5 659814000 660047174 660241485 660371900 660551667 660785496 660969079 661101520 661233664 661411703 661604941
3964.9 661604941 661718667 661843419 662055373 662232280 662333071 662427187 662567794 662771165 662960291 663088739
3985.3 663088739 663219094 663382709 663547456 663692355 663844883 664053619
3997.5F64053619
$$ plain form
3997.5 664053619
##END=$$ End of the data block
