##TITLE=G04-51-SE $$ Begin of the data block
##JCAMP-DX=5.00 $$ ACD/SpecManager v 10.08
##SPECTROMETER/DATA SYSTEM=Alpha
##DATE=22 Oct 2013 09:34:14
##DATA TYPE=INFRARED SPECTRUM
##DATA CLASS=XYDATA
##ORIGIN=
##OWNER=
##NPOINTS=1765
##FIRSTX=399.75695801
##LASTX=3997.56933594
##MAXX=3997.56933594
##MINX=399.75695801
##MAXY=0.81193221
##MINY=0.25756648
##XFACTOR=1.0000000000
##YFACTOR=1.000000000000000e-9
##FIRSTY=0.50667477
##DELTAX=2.03957629
##XUNITS=1/CM
##YUNITS=ARBITRARY UNITS
##XYDATA=(X++(Y..Y))
399.8 506674767 504967153 503651738 503023326 502689302 502704203 503677607 504597783 503984213 502363622
418.1 502363622 501318574 500462711 499023616 498064905 497540623 495900959 493754655 492756099 492494732
436.5 492494732 492261380 492933214 495052487 497260332 498453498 499256998 499733090 499027878 497682035
454.8 497682035 496682942 495236576 492835313 490608752 488830984 486446649 483558327 481429011 479933709
473.2 479933709 478142053 476518542 475830317 475397766 474397033 473575950 473414034 472650290 470904112
491.5 470904112 469476819 468484223 466662496 463986993 461618453 459603131 457077712 454329073 452102572
509.9 452102572 449904710 447177231 444618821 442716956 440908611 439323366 438801199 439007223 438919812
528.3 438919812 438902229 440055907 442156672 444380879 446959764 449881315 451910257 452559203 452838212
546.6 452838212 453071833 452355325 450807393 449492067 448240250 446250230 443925649 441950262 439747423
565 439747423 436849207 434400469 433313310 432918787 432947308 434260905 436846197 439707667 442642480
583.3 442642480 445976257 449074060 450979203 452198088 453469813 454164863 453987390 453988165 454554260
601.7 454554260 454809040 454765826 455338031 456311554 456746817 457080781 458253860 459822595 461230606
620 461230606 463215798 466236919 469266802 471662670 474108219 476742208 478736579 480113745 481773108
638.4 481773108 483639151 484894693 485846162 487260759 488564074 489023417 489379346 490283936 490998328
656.7 490998328 491201699 491773337 492828339 493514657 493803829 494765341 496174961 497241139 498467475
675.1 498467475 500337005 502148151 503244340 504325509 505771458 506729424 506951153 507146358 507236838
693.5 507236838 506447494 505052209 504292965 504426539 504840612 505710900 507571816 509976923 512318671
711.8 512318671 515159309 518979549 523029923 526918590 531399250 536559224 541318655 545325041
728.1 545325041 549344838 553246260 555984616 557730854 559419453 560837865 561302602 561211944 561119378
746.5 561119378 560581565 559229493 557713747 556427300 554794490 552834511 551588833 551386833 551720142
764.8 551720142 552922189 555776536 559985518 564728916 570024073 576003850 581775725 586567223
781.2 586567223 590728164 594580710 597663403 599883556 602042019 604446173 606592059 608738482
797.5 608738482 611681044 615169883 618301928 621006191 623700917 625930369 627130449 627772093 628346801
815.8 628346801 628413737 627660930 626513720 624985337 622491837 619196773 615996599 613030732 609735250
834.2 609735250 606247842 603202343 600467443 597643256 595095754 593266487 591772139 590208709
850.5 590208709 588912666 588092744 587386608 586921751 587816656 590933442 595879257 601846337 608354449
868.9 608354449 614580512 619447947 622597873 624041796 623456836 620738328 616536319 611525595 605908871
887.2 605908871 600023687 594466209 589423001 584573448 579720259 574930727 569981396 564419568
903.5 564419568 558223128 551712453 544990480 538063228 531300366 525274515 520236492 516248703
919.8 516248703 513577282 512244105 511631906 511103630 510645866 510482311 510424912 510218501 510009527 509757280
940.2 509757280 508707941 505958021 501002431 493709803 484499335 474365741 464178473 454131067
956.6 454131067 444126248 434405357 425253719 416530967 408145577 400476217 393896699 388390064
972.9 388390064 383967280 380847186 378886819 377523780 376446456 375642508 374870390 373833120 372686923
991.2 372686923 371712595 370883793 370175004 369821429 369963884 370268703 370259672 369834721 369052947 367858291
1011.6 367858291 366376042 364939213 363637000 362260491 360784590 359398574 357988834 356285870
1027.9 356285870 354457349 352829158 351254493 349433899 347488821 345669508 343900234 342136472
1044.3 342136472 340655953 339619994 338929147 338609487 338863075 339679033 340833724 342309475 344269305
1062.6 344269305 346544594 348536581 349561393 349240243 347879529 346438438 345969617 346898228 348972499
1081 348972499 351902544 355579913 359736264 363941669 368001044 371954739 375643671 378715724 381101042
1099.3 381101042 382959455 384397537 385619670 387041479 388954937 391216964 393552125 395925313
1115.6 395925313 398297012 400389165 402048171 403518349 405070275 406769454 408822209 411394000
1132 411394000 414065808 416170955 417454243 418028027 417963684 417336822 416490197 415753901 415116012 414589196
1152.4 414589196 414477617 415030479 416216403 418008804 420533150 423725247 427240610 430908561 434950322
1170.7 434950322 439532846 444532096 449902505 455736220 461858213 467946798 473947555 479824483
1187 479824483 485185176 489606529 493010372 495394200 496671498 497030288 496910095 496555388 496011317
1205.4 496011317 495484680 495328546 495551437 495834649 496094108 496402919 496543348 496225119 495516628 494571507
1225.8 494571507 493297070 491696000 490074039 488632381 487365484 486381859 485896707 485954314 486472279
1244.1 486472279 487527013 489185214 491240293 493425965 495708525 498123676 500472128 502593935
1260.4 502593935 504664838 506808043 508896291 510888696 512895286 514855981 516478598 517706156
1276.8 517706156 518798411 519875228 520853341 521791935 522829950 523796320 524395227 524588585 524405301
1295.1 524405301 523682654 522397220 520818591 519133091 517306685 515397310 513691664 512321472
1311.4 512321472 511224091 510487854 510305583 510624170 511071086 511248827 510899961 509801447 507919848
1329.8 507919848 505613744 503307939 501163363 499285161 498025000 497458100 497062981 496492058 495817602
1348.1 495817602 495023191 493934244 492532194 490972400 489217460 486942768 484132707 481181651
1364.5 481181651 478105575 474859744 471925348 469316483 466640353 463823348 460778326 457371235
1380.8 457371235 453744620 450458676 448205441 447242498 446823895 446181327 445516914 445283830 445430249
1399.1 445430249 445959449 446834952 448040485 449487567 450976938 452534288 454061031 455331862 456597418
1417.5 456597418 458690345 461312771 463678032 465839028 467602134 468706280 469239265 469124585 468363136
1435.9 468363136 467878848 468170643 468711197 469157130 469366401 469560534 469904453 469942451 469497412 469476163
1456.2 469476163 471542090 474698544 477271259 479691178 482906401 486810535 491538584 498376280
1472.6 498376280 506644309 514054537 519936502 524330735 527285814 528532684 527988136 526060462
1488.9 526060462 523517251 520605385 516480625 511103868 506026745 501515448 496520162 489254355
1505.2 489254355 479672551 472220153 466171205 459662318 453381330 448543429 445503294 443173528
1521.5 443173528 441119552 439098865 436883450 434747189 432312757 429755300 427928716 426059872
1537.8 426059872 423736095 423043847 424174190 425889075 427871734 430356860 433434695 436682522
1554.1 436682522 439563513 443218559 449298888 454609215 458418489 461654752 464509487 467407107
1570.5 467407107 469890296 471483886 472942889 474600494 475758463 476234376 476244658 475833893 475043327
1588.8 475043327 473727047 471663654 468836486 465491116 461523145 456583440 450766444 444309354
1605.1 444309354 437069088 428814501 420017004 411052644 400861293 389237255 379165947 369560361
1621.4 369560361 358329326 347257406 337082267 327438265 318888843 310768396 302771449 297717929
1637.8 297717929 295579851 294600546 294286519 294822603 296587527 298587829 300774604 304880291 309711725
1656.1 309711725 314180702 319103688 325127304 332086831 338786632 345866770 354199290 362316310
1672.4 362316310 370617777 379875392 388638824 396489680 404895544 416273206 428130269 438662618
1688.8 438662618 449855804 461256802 474114805 488797188 503715098 520462632 534991682
1703 534991682 546756327 558275819 568316698 576402307 583002567 588740528 594800532 601234734
1719.3 601234734 606768131 611250460 615017891 618015051 620464563 622359514 624201834 627034724
1735.7 627034724 629966617 632610500 635634124 639202476 643195927 647577941 652828813 659322500
1752 659322500 665771544 671563923 677063167 682264388 687597394 692797601 697152436 700868249 704198301
1770.3 704198301 707704842 711815894 715656757 718705058 721227527 723646164 726101339 728444278
1786.7 728444278 730222940 731408238 733074427 735407472 737393916 738945067 740664124 742599249
1803 742599249 744349420 745835125 747142375 748456776 749950290 751515627 752944469 754201114 755260825
1821.3 755260825 756128728 756997347 757821381 758700371 760179698 761780918 762818098 763677537 764576316
1839.7 764576316 764985263 765090346 766019702 767459035 768487334 769198716 769926608 770641327 771189749
1858 771189749 771717370 772345901 772818625 772826374 772844374 773676872 774849296 775624514 776190937 776832104
1878.4 776832104 777402997 777860999 778394341 778922200 779238820 779666841 780361414 780975103 781449914 781914115
1898.8 781914115 782414377 782870591 783178806 783420026 783760726 784185529 784520209 784663618 784745157 785012782
1919.2 785012782 785351157 785727501 786252201 786654055 786874652 787143946 787425339 787581742 787705958 787808120
1939.6 787808120 787786365 787854195 788193405 788628042 788959265 789154768 789347827 789634049 789890945 790059924
1960 790059924 790276229 790492594 790555596 790661633 790972173 791275561 791443288 791592717 791818202 792007685
1980.4 792007685 792082191 792147994 792282164 792355120 792286992 792329431 792571604 792740226 792794108 792900860 793025792
2002.8 793025792 793041348 792954981 792877555 792797565 792633772 792425096 792273283 792168975 792001545 791802049
2023.2 791802049 791639030 791461647 791231453 790998876 790776014 790520668 790246427 790012181 789844453 789715469
2043.6 789715469 789618373 789560437 789521992 789472282 789438784 789469004 789544880 789604187 789633214 789702654 789845884
2066.1 789845884 790006638 790137529 790275156 790413857 790506959 790591836 790728629 790867567 790965319 791086078
2086.5 791086078 791244805 791400611 791546941 791739047 791974366 792177320 792337716 792524397 792761803 792968690
2106.9 792968690 793109000 793261886 793447495 793581188 793684006 793835282 793986619 794078112 794173539 794316113
2127.3 794316113 794434607 794502616 794599891 794765353 794894755 794962585 795083046 795238256 795336425 795422375
2147.7 795422375 795566857 795751572 795926034 796095669 796301067 796520412 796752095 797051370 797427237 797801256
2168 797801256 798148692 798561513 799034119 799466908 799849927 800234735 800631523 801013768 801380277 801770329
2188.4 801770329 802188814 802571177 802925229 803331375 803740919 804049909 804345369 804752707 805177987 805498123
2208.8 805498123 805808604 806203723 806557596 806805909 807094991 807449758 807736278 807980597 808273733 808555841
2229.2 808555841 808749616 808907866 809111834 809297323 809398413 809513390 809710264 809884131 809968650 810070693
2249.6 810070693 810251117 810383677 810432017 810549796 810745239 810874701 810935497 811058521 811231673 811343491
2270 811343491 811432064 811560869 811672330 811699152 811733544 811852157 811932206 811901808 811879158 811910629 811876476
2292.5 811876476 811754227 811649680 811577320 811454952 811305702 811209857 811095297 810865521 810596764 810395002
2312.9 810395002 810225248 809984744 809648156 809288383 808912575 808497727 808120191 807827652 807539642 807214022
2333.3 807214022 806890607 806530237 806092560 805736601 805621088 805720150 805983007 806088746 805695176 804891348
2353.6 804891348 804110467 803529620 803062201 802731752 802555680 802492738 802536011 802648246 802826226 803065538
2374 803065538 803327322 803584874 803811848 803945959 803916991 803739071 803531408 803339601 803066373 802688301
2394.4 802688301 802313328 801955700 801529169 801052094 800623119 800236285 799777627 799248159 798744142 798237860
2414.8 798237860 797671258 797107339 796594679 796037495 795360088 794663608 794036686 793414533 792765558 792147577
2435.2 792147577 791557908 790921867 790239275 789575636 788911104 788205028 787517488 786886394 786235809 785536408
2455.6 785536408 784871042 784275413 783670962 783014834 782371283 781754911 781119168 780473471 779843390 779210150
2476 779210150 778568029 777955472 777389169 776819289 776200891 775572181 774968445 774371922 773782551 773223817
2496.4 773223817 772699833 772164941 771584392 771018565 770499825 769954264 769381642 768842816 768306732 767745137
2516.8 767745137 767185807 766618431 766037643 765455127 764844775 764206171 763534546 762820601 762121916 761472583
2537.2 761472583 760835052 760148764 759403527 758679509 758027434 757396877 756746352 756098628 755466402 754839361
2557.6 754839361 754224837 753606081 752947509 752273381 751643956 751045465 750416934 749785602 749192536 748584628
2578 748584628 747924805 747266173 746652961 746028304 745348036 744688272 744099498 743523121 742915750 742310524
2598.4 742310524 741700590 741024852 740296543 739557862 738803685 738009810 737160265 736277997 735381663 734437406
2618.8 734437406 733446002 732469440 731472850 730382502 729241431 728104413 726957798 725784481 724621534
2637.1 724621534 723509967 722399712 721233487 720055342 718883216 717692614 716503322 715356171
2653.5 715356171 714263380 713142097 711959243 710808456 709713042 708620846 707539737 706505179
2669.8 706505179 705489814 704434872 703364849 702338755 701336622 700344622 699393511 698465943 697484910
2688.1 697484910 696448624 695433974 694462240 693488836 692461014 691384614 690286636 689151466 687971592
2706.5 687971592 686772346 685570598 684360206 683158517 681977153 680771291 679543614 678372502
2722.8 678372502 677268386 676171184 675077081 674038947 673044443 672020257 670976877 669968426
2739.1 669968426 668998778 668040574 667085826 666165471 665267169 664349616 663430810 662540197 661645055 660727084
2759.5 660727084 659847558 659005761 658105314 657137811 656173646 655197620 654157102 653094471 652059793
2777.9 652059793 650971472 649754882 648485482 647226036 645941436 644602180 643209279 641758204
2794.2 641758204 640237391 638669908 637094021 635501266 633850455 632121027 630345643 628535926
2810.5 628535926 626623571 624633253 622672796 620688081 618577302 616360605 614069760 611699402
2826.8 611699402 609214783 606589437 603830636 600876153 597618222 593999326 589872122 585018635
2843.1 585018635 579409122 573237479 566917896 561105728 556445539 553204417 551118851 549531341
2859.5 549531341 547740042 545304596 542092204 538283765 534309685 530615926 527506053 525087595
2875.8 525087595 523309767 522004426 520928323 519911110 518859446 517674088 516314387 514794469
2892.1 514794469 513130784 511317551 509290874 507031679 504560530 501793861 498632133 495054036
2908.4 495054036 490987182 486330599 481131107 475647658 470292538 465453297 461441457 458499104
2924.7 458499104 456729650 456149280 456726134 458374619 460984588 464433789 468535393 472986966 477380663
2943.1 477380663 481299758 484506458 486967534 488738060 489953727 490923733 492109597 493877172
2959.4 493877172 496374577 499612510 503521740 508008957 512965858 518244743 523668647 529062331
2975.7 529062331 534335256 539410710 544097543 548287928 552048922 555392325 558254421 560592234
2992 560592234 562388718 563631654 564273953 564344645 563973010 563229203 562155783 560904682 559679806
3010.4 559679806 558539152 557441652 556392789 555323482 554053187 552500010 550731003 548807502
3026.7 548807502 546779633 544725358 542676687 540610790 538489521 536285937 534009755 531665683
3043 531665683 529239118 526745737 524249375 521779358 519277573 516747177 514269888 511891186 509611428
3061.4 509611428 507396102 505250871 503248513 501403153 499643803 497934252 496304810 494742900
3077.7 494742900 493146062 491508931 489965856 488584280 487302810 486035854 484768629 483508855
3094 483508855 482244283 480972737 479677796 478355944 477015913 475626409 474184543 472718060 471224457
3112.4 471224457 469693571 468124598 466514736 464794517 462941527 461082667 459250152 457368791
3128.7 457368791 455434233 453477114 451520175 449549377 447517633 445426524 443333179 441226840
3145 441226840 439101130 437040448 435017198 432910919 430718541 428522021 426336855 424138397 421964258
3163.4 421964258 419799328 417548418 415275067 413086832 410899550 408634096 406351596 404136956
3179.7 404136956 401956737 399757236 397594452 395486802 393356800 391154647 388943076 386808217
3196 386808217 384746671 382722735 380733132 378781468 376852095 374930918 373047292 371196836 369333148
3214.3 369333148 367478997 365687191 363939792 362151325 360299110 358452946 356625289 354755044
3230.7 354755044 352847278 350914210 348910749 346862704 344823390 342757344 340636939 338494211
3247 338494211 336324155 334117949 331899643 329678625 327441424 325180560 322949260 320799947 318707228
3265.3 318707228 316669405 314710081 312803000 310984015 309330374 307815462 306387603 305075884
3281.6 305075884 303882331 302787364 301823527 300974607 300176084 299424589 298770189 298192590 297634333
3300 297634333 297101945 296612620 296146631 295664579 295164675 294676065 294216037 293805301 293408245 292953938
3320.4 292953938 292442262 291915357 291390151 290829509 290223122 289601326 288961530 288303375 287609875 286799699
3340.8 286799699 285851002 284869492 283943623 283056468 282110393 281033397 279884040 278788745 277760744
3359.1 277760744 276689023 275557548 274470091 273439974 272374243 271240354 270099372 268998653
3375.5 268998653 267965168 267016947 266120970 265289605 264555722 263954282 263474733 262906253 262150019
3393.8 262150019 261432856 260948449 260608435 260166824 259595990 259136170 258818269 258521050 258257866 258019686
3414.2 258019686 257775277 257607669 257566482 257622898 257810652 258158356 258633107 259139001 259702384 260374993
3434.6 260374993 260975718 261428803 261957616 262725949 263681680 264735550 265791684 266851515 267970502
3453 267970502 269158632 270479947 271948218 273412764 274834633 276379853 278090030 279712319 281044960
3471.3 281044960 282347590 283912390 285743833 287665188 289453954 291182101 293042034 294938624
3487.6 294938624 296769530 298627049 300561428 302593589 304644674 306639135 308619887 310567975
3504 310567975 312508583 314549893 316725552 319021732 321310043 323468029 325620413 327917606 330391467
3522.3 330391467 332845569 335123777 337439537 339956164 342587620 345301926 348059177 350794286
3538.6 350794286 353594571 356468618 359327674 362130344 364953995 367910832 371063083 374311268
3554.9 374311268 377532095 380797237 384099364 387260407 390332609 393913388 398155302 402369827
3571.3 402369827 406337440 410317600 414375693 418541819 422852695 427135617 431294799 435641795
3587.6 435641795 440455914 445289701 449944675 454710245 459654033 464668036 469750315 474733114
3603.9 474733114 479384929 484003067 488885283 493930161 499089897 504124701 509064317 514484882
3620.2 514484882 520016789 524859309 528906226 533106744 538578570 544250190 549369812 554197729
3636.5 554197729 558820307 563294590 567583144 571326852 574431002 577950537 582844198 587889791
3652.8 587889791 592108667 596201003 600554645 604568243 608079314 611213446 613725126 615839720
3669.2 615839720 618533909 621231139 623556912 626881421 630727351 634066999 636934698 639239609
3685.5 639239609 640931606 642730236 645416379 648446679 651052952 653101861 654665291 656054199
3701.8 656054199 657803416 659574270 660663903 661229312 662360370 664605319 666843355 668306410
3718.1 668306410 669248343 670146167 671199203 672425985 673741519 674601972 674811184 675054312 676211834
3736.5 676211834 678197920 679753840 679893076 679612398 680618703 681608796 682051837 683543622 685667515
3754.8 685667515 687068284 687872529 688950598 690112054 690800846 691269159 691870689 692925215 694246352
3773.2 694246352 695237458 695826828 696283937 696929336 697674930 698417842 699282110 700143814 700852811 701206744
3793.6 701206744 701212108 701310456 701302350 701386750 702360332 703270435 703963697 705200553 706240892 706247509 705821335
3816 705821335 705947578 706069589 706588089 707955718 708999455 709536672 709800780 709887743 710051835 710014462
3836.4 710014462 709930539 710558236 711692929 712849915 713769853 714087963 713288844 711610079 711680114
3854.8 711680114 713749528 715312839 715787768 715695202 715752661 715995193 715936363 716139734 716917813 717826307
3875.2 717826307 718531013 718593717 718578219 718884647 719097078 719542503 719963849 720097065 720615089 721221864
3895.5 721221864 721116483 720527768 720186591 720421910 721309900 722397625 723105431 723470926 723591328
3913.9 723591328 723389268 723172128 723315954 723604202 723783851 723997712 724172115 724133730 724222362 724708140
3934.3 724708140 725222468 725447774 725447714 725394845 725474536 725636482 725771964 725972891 726244628 726498365 726706624
3956.7 726706624 726883054 727036655 727175057 727286577 727391422 727546930 727743924 727920532 728050947 728166282
3977.1 728166282 728237271 728289843 728459477 728706300 728894651 729024768 729133129 729254484 729409575 729541421
3997.5 729541421
##END=$$ End of the data block
