##TITLE=G04-51-SE $$ Begin of the data block
##JCAMP-DX=5.00 $$ ACD/SpecManager v 10.08
##SPECTROMETER/DATA SYSTEM=Alpha
##DATE=22 Oct 2013 09:34:14
##DATA TYPE=INFRARED SPECTRUM
##DATA CLASS=XYDATA
##ORIGIN=
##OWNER=
##NPOINTS=1765
##FIRSTX=399.75695801
##LASTX=3997.56933594
##MAXX=3997.56933594
##MINX=399.75695801
##MAXY=0.81256187
##MINY=0.25687778
##XFACTOR=1.0000000000
##YFACTOR=1.000000000000000e-9
##FIRSTY=0.50734484
##DELTAX=2.03957629
##XUNITS=1/CM
##YUNITS=ARBITRARY UNITS
##XYDATA=(X++(Y..Y))
399.8E07344842k431035j428008m45128k03550r9957O70851P06613n43773j096785
$$ 507344842 504913807 503485799 503040671 502837121 502737164 503408015 504114628 503570855 502474070
418.1E02474070m61758r37342j792610j309037q32379j319081j400023p61092n33968
$$ 502474070 502012312 501074970 499282360 497973323 497140944 495821863 494421840 493660748 493126780
436.5D93126780m96894N33521J982331K045870J023531O77645O40690l86238j315057
$$ 493126780 492629886 493163407 495145738 497191608 498215139 498892784 499533474 499147236 497832179
454.8D97832179j166999j426041k332181k390862j884102k347023l025800k420723
$$ 497832179 496665180 495239139 492906958 490516096 488631994 486284971 483259171 480838448
471.1D80838448j659960j799553j606107n30511j40846p39515o66976j66774q49962
$$ 480838448 479178488 477378935 475772828 475242317 475101471 474361956 473694980 473528206 472678244
489.5D72678244j825154j514494j081467j809835k496898k172500k052427k733767
$$ 472678244 470853090 469338596 468257129 466447294 463950396 461777896 459725469 456991702
505.8D56991702k790957k044440k067208k707064k506316j866311j974880j936257
$$ 456991702 454200745 452156305 450089097 447382033 444875717 443009406 441034526 439098269
522.1D39098269o96272L17693L4690J05351J281589J989722J952529K580703L238737
$$ 439098269 438401997 438719690 438754380 438859731 440141320 442131042 444083571 446664274 449903011
540.5D49903011K269298O55413J49846J1653r04531j563489j286388j298844j944811
$$ 449903011 452172309 452827722 452977568 452989221 452084690 450521201 449234813 447935969 445991158
558.8D45991158k139419j941264k342730k960265k425045j082033m04596L1054J316100
$$ 445991158 443851739 441910475 439567745 436607480 434182435 433100402 432695806 432726860 434042960
577.2D34042960K557218K749831K792954L289342L172011K048701J366645J395046
$$ 434042960 436600178 439350009 442142963 445432305 448604316 450653017 452019662 453414708
593.5D53414708P42168k36988o6817O08921L65138k3216M58807Q27282M09633M00722
$$ 453414708 454156876 453919888 453853071 454461992 454827130 454803914 455262721 456090003 456499636 456900358
613.9D56900358J205623J576752J373857J965344L096730L115922K473533K571464
$$ 456900358 458105981 459682733 461056590 463021934 466118664 469234586 471708119 474279583
630.2D74279583K720355J883209J174331J678795K056539J328289R39191J409202J241297
$$ 474279583 476999938 478883147 480057478 481736273 483792812 485121101 486060292 487469494 488710791
648.6D88710791L75599L52442R55045O90788J29879O23405J222491P50989K80410J129686
$$ 488710791 489086390 489438832 490393877 491084665 491214544 491837949 493060440 493811429 494091839 495221525
669D95221525J517594R94444J126886J818865J842678J164198J068771J391649R40799
$$ 495221525 496739119 497733563 498860449 500679314 502521992 503686190 504754961 506146610 507087409
687.3E07087409J60873R9898N9485q09431j459658q07583J18851L97802Q67903J905739
$$ 507087409 507248282 507348180 507407665 506598234 505138576 504330993 504449844 504847646 505715549 507621288
707.7E07621288K496362K439737K855957L744483L998399L914296M513324N172968
$$ 507621288 510117650 512557387 515413344 519157827 523156226 527070522 531583846 536756814
724E36756814M786014L969193L898143L848672K841175J876175J695812J336753L59476
$$ 536756814 541542828 545512021 549410164 553258836 556100011 557976186 559671998 561008751 561368227
742.4E61368227j71542j17183n66542j354396j406253j180827j630724j975179j260757
$$ 561368227 561196685 561079502 560512960 559158564 557752311 556571484 554940760 552965581 551704824
760.8E51704824k65241K81453J241625K961159M357755M873574N276262N846203N685508
$$ 551704824 551439583 551721036 552962661 555923820 560281575 565155149 570431411 576277614 581963122
779.1E81963122M798055M177987L815711L012955K183556K125085K356052K182961
$$ 581963122 586761177 590939164 594754875 597767830 599951386 602076471 604432523 606615484
795.4F06615484K230346L025532L579437L155530K679944K674639K217829J214445
$$ 606615484 608845830 611871362 615450799 618606329 621286273 623960912 626178741 627393186
811.7F27393186O61492N76139J14322o57261j171350j635015k543509l379166l321231
$$ 627393186 628054678 628630817 628745139 628087878 626916528 625281513 622738004 619358838 616037607
830.1F16037607k993703l242492l480256l094017k775968k810478k462864j784444
$$ 616037607 613043904 609801412 606321156 603227139 600451171 597640693 595177829 593393385
846.4E93393385j516878j569092j263202p87198o94752m42505R20355L111482M926622
$$ 593393385 591876507 590307415 589044213 588257015 587562263 587119758 588040113 591151595 596078217
864.8E96078217N974591O513834O207764M838943L096998J406133n90920k735674m194856
$$ 596078217 602052808 608566642 614774406 619613349 622710347 624116480 623525560 620789886 616595030
883.1F16595030m919470n551040n962312n674660n103231m871428m861950m808724
$$ 616595030 611675560 606124520 600162208 594487548 589384317 584512889 579650939 574842215
899.4E74842215m944027n497336o156385o527424o704450o881714o785929o117105
$$ 574842215 569898188 564400852 558244467 551717043 545012593 538130879 531344950 525227845
915.8E25227845n094767l945887k603412j331865o68884n64694m26471j26601o4253
$$ 525227845 520133078 516187191 513583779 512251914 511583030 511018336 510591865 510465264 510401011
934.1E10401011k05458j92761k62082j053393k733349m953802p293195r214520j0171145
$$ 510401011 510195553 510002792 509740710 508687317 505953968 501000166 493706971 484492451 474321306
952.5D74321306j0225624j0045230r991616r727896r152233q707315q390129p691621
$$ 474321306 464095682 454050452 444058836 434330940 425178707 416471392 408081263 400389642
968.8D00389642o567985n451829m392117l149628j999528j367479j053184p91729p58678
$$ 400389642 393821657 388369828 383977711 380828083 378828555 377461076 376407892 375616163 374857485
987.1C74857485j000434j136213r68457q02904p11054l71426J18792K53677n9545m30911
$$ 374857485 373857051 372720838 371752381 370949477 370238423 369866997 369985789 370239466 370179921 369749010
1007.5C69749010p39336j143754j453429j417399j304060j409382j498311j389385
$$ 369749010 369009674 367865920 366412491 364995092 363691032 362281650 360783339 359393954
1023.9C59393954j423925j720965j815319j609921j582206j812398j909196j773745
$$ 359393954 357970029 356249064 354433745 352823824 351241618 349429220 347520024 345746279
1040.2C45746279j715601j724124j481652j084238p68513l57777K91497Q64744J174361
$$ 345746279 344030678 342306554 340824902 339740664 338972151 338614374 338905871 339770615 340944976
1058.5C40944976J479268J965195K285957J967728J001388k96325j347839j441718
$$ 340944976 342424244 344389439 346675396 348643124 349644512 349348187 348000348 346558630
1074.8C46558630m90278Q59619K049744K964198L685832M155755M240364M079342L904700
$$ 346558630 346068352 346927971 348977715 351941913 355627745 359783500 364023864 368103206 372007906
1093.2C72007906L623933L066778K400905J848996J447320J266420J461804J892566
$$ 372007906 375631839 378698617 381099522 382948518 384395838 385662258 387124062 389016628
1109.5C89016628K203286K334744K425879K406657K095908J652121J454592J536757
$$ 389016628 391219914 393554658 395980537 398387194 400483102 402135223 403589815 405126572
1125.8D05126572J689046K039910K571761K671212K101481J319349O30438l0100o17534
$$ 405126572 406815618 408855528 411427289 414098501 416199982 417519331 418149769 418119669 417502135
1144.2D17502135q74400p87795o57677n13554j00166N50628J171470J785040K534568
$$ 417502135 416627735 415839940 415182263 414668709 414568543 415119171 416290641 418075681 420610249
1162.6D20610249L191471L492922L650278M036486M580825N003810N394906N866915
$$ 420610249 423801720 427294642 430944920 434981406 439562231 444566041 449960947 455827862
1178.9D55827862O115168O036014N970001N895525N366057M373908L350646K388328
$$ 455827862 461943030 467979044 473949045 479844570 485210627 489584535 492935181 495323509
1195.2D95323509J300096L20495j68205l43293m95582m72188j31697K09272K82824
$$ 495323509 496623605 496944100 496775895 496432602 495937020 495464832 495333135 495542407 495825231
1213.5D95825231K79158L04699J04815l49998p09445r35405j265228j576394j588911
$$ 495825231 496104389 496409088 496513903 496163905 495454460 494519055 493253827 491677433 490088522
1231.9D90088522j408845j254916j009107n07414O8843N34028J035035J621097K040744
$$ 490088522 488679677 487424761 486415654 485908240 485977083 486511111 487546146 489167243 491207987
1250.3D91207987K188861K304972K442538K368600K134978K041638K106667K093851
$$ 491207987 493396848 495701820 498144358 500512958 502647936 504689574 506796241 508890092
1266.6E08890092K010167K013326J954615J611471J228690J102924J076401R81867
$$ 508890092 510900259 512913585 514868200 516479671 517708361 518811285 519887686 520869553
1282.9E20869553R61840J049459R67682N98847J78397j85072p17640j312673j592160
$$ 520869553 521831393 522880852 523848534 524447381 524625778 524440706 523723066 522410393 520818233
1301.2E20818233j648426j796960j911819j702488j346469j072168p20918j73807K88605
$$ 520818233 519169807 517372847 515461028 513758540 512412071 511339903 510618985 510445178 510733783
1319.6E10733783L77178J30952l43442j063049j856208k295315k276838k086818j815647
$$ 510733783 511110961 511241913 510898471 509835422 507979214 505683899 503407061 501320243 499504596
1338D99504596j255959o38515m56721n79685o61432p87109j107574j429319j554340
$$ 499504596 498248637 497610122 497153401 496573716 495912284 495125175 494017601 492588282 491033942
1356.3D91033942j721114k241284k799183k978862l126323l274500k910048k559394
$$ 491033942 489312828 487071544 484272361 481293499 478167176 474892676 471982628 469423234
1372.6D69423234k664119k850294l073454l406673l595352l223926k215505j006693
$$ 469423234 466759115 463908821 460835367 457428694 453833342 450609416 448393911 447387218
1388.9D47387218m75764o37084o15507k00361J24424M73857Q52376J220078J459986
$$ 447387218 446911454 446274370 445658863 445458502 445582926 446056783 446909159 448129237 449589223
1407.3D49589223J478701J527161J527727J335561J340598K088606K557963K338320
$$ 449589223 451067924 452595085 454122812 455458373 456798971 458887577 461445540 463783860
1423.6D63783860K176792J777082J094759N12123q4609o82026m79996K30253N00738
$$ 463783860 465960652 467737734 468832493 469344616 469260007 468577981 468097985 468328238 468828976
1442D68828976M19855J94252J86026L24219L7849l87937Q5086K103835L074676K509684
$$ 468828976 469248831 469443083 469629109 469953328 469991177 469603240 469688326 471792161 474866837 477376521
1462.4D77376521K430588L210306L867507M754662O915689Q251101P297694N806387
$$ 477376521 479807109 483017415 486884922 491639584 498555273 506806374 514104068 519910455
1478.7E19910455M396379K983033J258910n20646j861573k534091k982199m152120
$$ 519910455 524306834 527289867 528548777 528028131 526166558 523632467 520650268 516498148
1495E16498148n362808n119980m573166m957140p075309r411246p521897o178290o557018
$$ 516498148 511135340 506015360 501442194 496485054 489409745 479998499 472476602 466298312 459741294
1513.4D59741294o241619m769474k986610k309859k085805k056152k265781k198845
$$ 459741294 453499675 448730201 445743591 443433732 441347927 439291775 437025994 434827149
1529.7D34827149k419174k472192j763046j784384k204656o97762J026511J610875
$$ 434827149 432407975 429935783 428172737 426388353 424183697 423485935 424512446 426123321
1546D26123321J921862K465934L071934L281862K986192L776163O007671N149872L750056
$$ 426123321 428045183 430511117 433583051 436864913 439851105 443627268 449634939 454784811 458534867
1564.3D58534867L250449K885849K896279K468824J656860J524747J597762J090735
$$ 458534867 461785316 464671165 467567444 470036268 471693128 473217875 474815637 475906372
1580.7D75906372M54962j7643m57257q47459j359790k059877k807200l337145l960550
$$ 475906372 476361334 476343691 475886434 475038975 473679185 471619308 468812108 465474963 461514413
1599D61514413m953652n860359o498933p247060q239657q809745q970499j0126650
$$ 461514413 456560761 450700402 444201469 436954409 428714752 419905007 410934508 400807858
1615.3D00807858j1570901j0109037r640724j1260539j1118203j0177702r615958q517563
$$ 400807858 389236957 379127920 369487196 358226657 347108454 336930752 327314794 318797231
1631.6C18797231q048892p932604n104243k218485r84997k46644O18816J799762K028256
$$ 318797231 310748339 302815735 297711492 295493007 294508010 294261366 294880182 296679944 298708200
1650B98708200K302021M197419M755348M399538M941583O065636O952018O687015P119358
$$ 298708200 301010221 305207640 309962988 314362526 319304109 325369745 332321763 339008778 346128136
1668.4C46128136Q380681Q125216Q302331R252638Q756190P885367Q507132J1438102
$$ 346128136 354508817 362634033 370936364 380189002 388945192 396830559 405337691 416775793
1684.7D16775793J1774808J0450840J1154115J1398465J2933522J4793247J5015632
$$ 416775793 428550601 439001441 450155556 461554021 474487543 489280790 504296422
1699E04296422J6774058J4456570J1700094J1457145R970844Q081436O684721N862415
$$ 504296422 521070480 535527050 547227144 558684289 568655133 576736569 583421290 589283705
1715.3E89283705O120503O356179N430341M448593L781557L053009K538562J979709
$$ 589283705 595404208 601760387 607190728 611639321 615420878 618473887 621012449 622992158
1731.6F22992158J894474K775669K862752K658724L044188L558219L998875M415215
$$ 622992158 624886632 627662301 630525053 633183777 636227965 639786184 643785059 648200274
1747.9F48200274N269646O443560O374002N756497N496144N235553N365372N177915
$$ 648200274 653469920 659913480 666287482 672043979 677540123 682775676 688141048 693318963
1764.2F93318963M359305L782213L398597L519297M041850L762603L023207K536237
$$ 693318963 697678268 701460481 704859078 708378375 712420225 716182828 719206035 721742272
1780.5G21742272K431572K446651K315879J774073J246571J731754K315104J944840
$$ 721742272 724173844 726620495 728936374 730710447 731957018 733688772 736003876 737948716
1796.9G37948716J550257J731813J917064J717985J474678J323760J317084J443982
$$ 737948716 739498973 741230786 743147850 744865835 746340513 747664273 748981357 750425339
1813.2G50425339J514673J424611J273810J080811R16422R28402Q62360Q80182J399397
$$ 750425339 751940012 753364623 754638433 755719244 756635666 757564068 758426428 759306610 760706007
1831.5G60706007J489223R97483Q80063R20176M70996J98484R32038J373589R86993
$$ 760706007 762195230 763192713 764072776 764992952 765463948 765662432 766594470 767968059 768955052
1849.9G68955052O99162P08521O77466N26071N51760O81460N25296P0810N3346P86185
$$ 768955052 769654214 770362735 771040201 771566272 772118032 772799492 773324788 773395598 773448944 774235129
1870.3G74235129J099825P38919N61833O44148N72264M53949N21898N23865L31820
$$ 774235129 775334954 776073873 776635706 777279854 777852118 778306067 778827965 779351830 779683650
1888.6G79683650M28795O71864O06179M82679M75168N06222M43459L05891K66730L46840
$$ 779683650 780112445 780784309 781390488 781873167 782348335 782854557 783298016 783603907 783870637 784217477
1909G84217477M01735L19839J46627R0659K76088L63112L85642N01871L97504K05278
$$ 784217477 784619212 784939051 785085678 785176337 785452425 785815537 786201179 786703050 787100554 787305832
1929.4G87305832K18868K57731J78992J53244J19209k98Q4996L31283M17233L18050
$$ 787305832 787524700 787782431 787961423 788114667 788233876 788233578 788318574 788649857 789067090 789385140
1949.8G89385140J91450J87755K52962K35200J93536K37763K31445R3639J13666L03268
$$ 789385140 789576590 789764345 790017307 790252507 790446043 790683806 790915251 791008890 791122556 791425824
1970.2G91425824L11554J48832Q9586J83285K01284J18018R9122J33395N7638o5744
$$ 791425824 791737378 791886210 791975796 792159081 792360365 792478383 792577505 792710900 792768538 792702794
1990.6G92702794M8578K52485J92166N7756P0393Q3507K2888n5254p0452p7784j44303
$$ 792702794 792751372 793003857 793196023 793253779 793324172 793407679 793430567 793375313 793304861 793227077 793082774
2013G93082774j86622j46509j16706j81317j97947j59919j96219k61604k51532k03550
$$ 793082774 792896152 792749643 792632937 792451620 792253673 792093754 791897535 791635931 791384399 791180849
2033.4G91180849k02179k38418k37346j74880j38581j30653p2301k444k1100l9219
$$ 791180849 790978670 790740252 790502906 790328026 790189445 790058792 789986491 789984047 789962947 789923728
2053.8G89923728K0265N4717M0770N8710J16170J44422J23262J06812J42991J54555
$$ 789923728 789943993 789998710 790039480 790098190 790214360 790358782 790482044 790588856 790731847 790886402
2074.2G90886402J10448R3996J30117J32501J00076J28270J78396J68979J27495J64330
$$ 790886402 790996850 791090846 791220963 791353464 791453540 791581810 791760206 791929185 792056680 792221010
2094.6G92221010K32398K06650J41263J79767K47955J91272J21057J65164K17200J62243
$$ 792221010 792453408 792660058 792801321 792981088 793229043 793420315 793541372 793706536 793923736 794085979
2115G94085979J20581J67489J57654O4194N6029J33514J33336R0003J03175J32501
$$ 794085979 794206560 794374049 794531703 794595897 794651926 794785440 794918776 795008779 795111954 795244455
2135.4G95244455J02342P6770J30236J61648J11521R2387J44422J79410J66595J65105
$$ 795244455 795346797 795423567 795553803 795715451 795826972 795919359 796063781 796243191 796409786 796574891
2155.8G96574891K17318K55883K55942K95758L89338M04954L44574L91663M70995M11332
$$ 796574891 796792209 797048092 797304034 797599792 797989130 798394084 798738658 799130321 799601316 800012648
2176.2H00012648L34501L73125M35889M27008L90708M00663M12762L72469L56973M01675
$$ 800012648 800347149 800720274 801156163 801583171 801973879 802374542 802787304 803159773 803516746 803918421
2196.6H03918421L90649L02792L23295M29809L98815K76864K83241L83973L67403K83122
$$ 803918421 804309070 804611862 804935157 805364966 805763781 806040645 806323886 806707859 807075262 807358384
2217H07358384L02732L48330K91764K49029K98738K87235J75536J38640K10285K10524
$$ 807358384 807661116 808009446 808301210 808550239 808848977 809136212 809311748 809450388 809660673 809871197
2237.4H09871197J31070J34290J95205J71363J13189J45078J90020J04725J8180J04606
$$ 809871197 810002267 810136557 810331762 810503125 810616314 810761392 810951412 811056137 811074317 811178923
2257.8H11178923J93536J27315O0142J21772J63197J14918R7096J18256J02162M4048
$$ 811178923 811372459 811499774 811559916 811681688 811844885 811959803 812056899 812175155 812277317 812321365
2278.2H12321365O2466J14619O3420j4604p629j669o6697n9486K5869n603j41144j61827
$$ 812321365 812383831 812498450 812561870 812547266 812539637 812537968 812471271 812411785 812437654 812432051 812290907 812129080
2302.7H12129080o6220p3970j86622j93238j36495j76608k41638k84493l26097l51548
$$ 812129080 812062860 811988890 811802268 811609030 811472535 811295927 811054289 810769796 810443699 810092151
2323.1H10092151l35097l17753l16739l32653l19481k52426k67207k96593k20835j54436
$$ 810092151 809757054 809439301 809122562 808789909 808470428 808218002 807950795 807654202 807433367 807278931
2343.5H07278931n1916J59741R2804k97904o28531o49571n12958m07874l63291l12507
$$ 807278931 807227015 807386756 807479560 807181656 806553125 805903554 805390596 804982722 804619431 804306924
2363.8H04306924j56164p212L9577R6560J35243J05977O7711O6936M8697m3392j79231
$$ 804306924 804150760 804143548 804183125 804279685 804414928 804520905 804588616 804655552 804704249 804660857 804481626
2386.3H04481626k43009k36630l04222l79026l57091l56138m28736m71652m28498l85463
$$ 804481626 804238617 804001987 803697765 803318739 802961648 802605510 802176774 801705122 801276624 800891161
2406.7H00891161m43101n30302n37515n26309n53966n42283n18024n87046o76870o55473
$$ 800891161 800448060 799917758 799380243 798853934 798299968 797757685 797239661 796652615 795975745 795320272
2427.1G95320272n96821o36697o71863o11484n89669o51538o74367o55473o74963o92844
$$ 795320272 794723451 794086754 793414891 792803407 792213738 791562200 790887833 790232360 789557397 788864553
2447.5G88864553o62327o29008o41942o67035o60479o50049o74307o80685o23345n83351
$$ 788864553 788202226 787573218 786931276 786264241 785603762 784953713 784279406 783598721 782975376 782392025
2467.9G82392025o10590o50883o48141o29663o29187o10649n75543n78642o04152n95868
$$ 782392025 781781435 781130552 780482411 779852748 779223561 778612912 778037369 777458727 776854575 776258707
2488.3G76258707n93126o18458o20544n76019m96089m73619n55992n91576n46336n58734
$$ 776258707 775665581 775047123 774426579 773850560 773354471 772880852 772324860 771733284 771186948 770628214
2508.7G70628214n76735n38945n39183n71907n77629n76436n87940o00696o06537o18756
$$ 770628214 770051479 769512534 768973351 768401444 767823815 767247379 766659439 766058743 765452206 764833450
2529G64833450o68764o97434o58571o34730o63698p07626p11561o78122o61850o71267
$$ 764833450 764164686 763467252 762808681 762173951 761510253 760802627 760091066 759412944 758751094 758079827
2549.4G58079827o69956o33598o11603o32286o32942o06417o27995o83188o73116o25550
$$ 758079827 757409871 756776273 756164670 755532384 754899442 754293025 753665030 752981842 752308726 751683176
2569.8G51683176o26862o35207o06477o02007o39260o39081o03199o38008p00355o50763
$$ 751683176 751056314 750421107 749814630 749212623 748573363 747934282 747331083 746693075 745992720 745341957
2590.2G45341957n61715n58435n90861n94735o10114o90102p58767p43628p29740p76946
$$ 745341957 744780242 744221807 743630946 743036211 742426097 741735995 740977228 740233600 739503860 738726914
2610.6G38726914q41141q88109r18150r37283r48727r67980j035690j123607j141191
$$ 738726914 737885773 736997664 736079514 735142231 734193504 733225524 732189834 731066227 729925036
2629G29925036j115500j123369j149297j156271j132011j123071j166284j173436j142204
$$ 729925036 728809536 727686167 726536870 725380599 724248588 723125517 721959233 720785797 719643593
2647.3G19643593j170814j202882j154243j098454j121879j168609j145661j100301
$$ 719643593 718472779 717269897 716115654 715017200 713895321 712726712 711581051 710480750
2663.7G10480750j103580j111567j069904j025080j046718j045048r79543r71853r99630
$$ 710480750 709377170 708265603 707195699 706170619 705123901 704078853 703099310 702127457 701127827
2682G01127827r71973r52840r94444j008808r82165r76921j010775j061499j085818
$$ 701127827 700155854 699203014 698208570 697199762 696217597 695240676 694229901 693168402 692082584
2700.4F92082584j114369j162588j162708j150191j193940j218617j176060j150131
$$ 692082584 690968215 689805627 688642919 687492728 686298788 685080171 683904111 682753980
2716.7F82753980j187086j219094j175165j116276j117944j115740j043498r90749
$$ 682753980 681566894 680347800 679172635 678056359 676938415 675822675 674779177 673788428
2733F73788428j022160j029312r76265r55999r75609r68039r12785q93116r32932r28342
$$ 673788428 672766268 671736956 670760691 669804692 668829083 667861044 666948259 666055143 665122211 664193869
2753.4F64193869q91745r11534r34601q93295q59857q84771r22739r40442r79424j055181
$$ 664193869 663302124 662390590 661455989 660562694 659702837 658818066 657895327 656954885 655975461 654920280
2773.8F54920280j076520j045882j093447j207173j249194j248658j311183j375198
$$ 654920280 653843760 652797878 651704431 650497258 649248064 647999406 646688223 645313025
2790.1F45313025j381398j397013j475811j562894j589119j597941j662672j737833
$$ 645313025 643931627 642534614 641058803 639495909 637906790 636308849 634646177 632908344
2806.4F32908344j765012j806498j906812j980901j990676k028406k118706k214611
$$ 632908344 631143332 629336834 627430022 625449121 623458445 621430039 619311333 617096722
2822.7F17096722k310395k387345k469778k603054k772033k970457l227711l609538
$$ 617096722 614786327 612398982 609929204 607326150 604554117 601583660 598355949 594746411
2839.1E94746411m168570m883290n624532o177604o331444n841732m663289l216982
$$ 594746411 590577841 585694551 580070019 573892415 567560971 561719239 557055950 553838968
2855.4E53838968k077341j614570j825571k430559l181934l800631l983974l695548
$$ 553838968 551761627 550147057 548321486 545890927 542708993 538908362 534924388 531228840
2871.7E31228840l116071k424955j772762j305103j080096j029670j085877j215160
$$ 531228840 528112769 525687814 523915052 522609949 521529853 520500183 519414306 518199146
2888E18199146j352847j490056j655817j851142k076328k270221k454639k752542l146947
$$ 518199146 516846299 515356243 513700426 511849284 509772956 507502735 505048096 502295554 499148607
2906.4D99148607l572255m067302m661143n224108n495847n358308m857093m002661
$$ 499148607 495576352 491509050 486847907 481623799 476127952 470769644 465912551 461909890
2922.7D61909890k903998j732737n69999N59032J627863K594828L452868M118174M461199
$$ 461909890 459005892 457273155 456703156 457262188 458890051 461484879 464937747 469055921 473517120
2941D73517120M400372L923893L216029K468794J752287J199335J004487J234770J768142
$$ 473517120 477917492 481841385 485057414 487526208 489278495 490477830 491482317 492717087 494485229
2959.4D94485229K464891L200263L889799M503607M984677N335152N499304N420208
$$ 494485229 496950120 500150383 504040182 508543789 513528466 518863618 524362922 529783130
2975.7E29783130N252063N041540M667222M219771L823876L377914K861619K345860
$$ 529783130 535035193 540076733 544743955 548963726 552787602 556165516 559027135 561372995
2992E61372995J818300J265645O56306O3181l87430p41780j063645j248776j202047
$$ 561372995 563191295 564456940 565113246 565176427 564788997 564047217 562983572 561734796 560532749
3010.4E60532749j102209j095117j073360j069367j245260j545549j803040j974285
$$ 560532749 559430540 558335423 557262063 556192696 554947436 553401887 551598847 549624562
3026.7E49624562k058089k054989k026319k040148k124012k216816k270281k342403
$$ 549624562 547566473 545511484 543485165 541445017 539321005 537104189 534833908 532491505
3043E32491505k448082k510428k494753k476096k497434k495528k462685k424121k363980
$$ 532491505 530043423 527532995 525038242 522562146 520064712 517569184 515106499 512682378 510318398
3061.4E10318398k264678k111256j947880j853704j795650j710772j645118j608819
$$ 510318398 508053720 505942464 503994584 502140880 500345230 498634458 496989340 495380521
3077.7D95380521j578987j555800j499266j422375j361460j297652j253009j258403
$$ 495380521 493801534 492245734 490746468 489324093 487962633 486664981 485411972 484153569
3094D84153569j258999j246989j294226j371055j393766j380622j416624j498311j531840
$$ 484153569 482894570 481647581 480353355 478982300 477588534 476207912 474791288 473292977 471761137
3112.4D71761137j528859j560390j618504j706064j810193j849562j834840j863956
$$ 471761137 470232278 468671888 467053384 465347320 463537127 461687565 459852725 457988769
3128.7D57988769j935244j965433j965463k007008k048343k062440k093643k131820
$$ 457988769 456053525 454088092 452122629 450115621 448067278 446004838 443911195 441779375
3145D41779375k132893k088606k076775k146929k228409k240271k210587k184510k161294
$$ 441779375 439646482 437557876 435481101 433334172 431105763 428865492 426654905 424470395 422309101
3163.4D22309101k177686k232790k268523k257824k219468k228856k283454k249122
$$ 422309101 420131415 417898625 415630102 413372278 411152810 408923954 406640500 404391378
3179.7D04391378k170235k176463k190113k162874k169520k192885k172082k131254
$$ 404391378 402221143 400044680 397854567 395691693 393522173 391329288 389157206 387025952
3196C87025952k103001k065062k012491j960188j917929j912057j897723j862287j860380
$$ 387025952 384922951 382857889 380845398 378885210 376967281 375055224 373157501 371295214 369434834
3214.3C69434834j855225j832187j825631j840412j859695j852959j844734j848549
$$ 369434834 367579609 365747422 363921791 362081379 360221684 358368725 356523991 354675442
3230.7C54675442j846701j935452k075404k078384k009958k037436k148569k216935
$$ 354675442 352828741 350893289 348817885 346739501 344729543 342692107 340543538 338326603
3247C38326603k201617k195865k221703k223641k219021k220929k217829k219140k172649
$$ 338326603 336124986 333929121 331707418 329483777 327264756 325043827 322825998 320606858 318434209
3265.3C18434209k042383j902551j818627j760065j680643j567066j425325j282692
$$ 318434209 316391826 314489275 312670648 310910583 309229940 307662874 306237549 304954857
3281.6C04954857j164645j057744r66967q88526q03918p55876p17223o36309n62370
$$ 304954857 303790212 302732468 301765501 300876975 300073057 299317181 298599958 297963649 297401279
3300B97401279n11586m58658m43220m60327m82470n11378m84973m25220m18782m45217
$$ 297401279 296889693 296431035 295987815 295527488 295045018 294533640 294048667 293623447 293204665 292759448
3320.4B92759448m92245n49793n77658o08057o36548o52492o65873o73712p36594q35865
$$ 292759448 292267203 291717410 291139752 290531695 289895147 289242655 288576782 287903070 287166476 286330611
3340.8B86330611q84414r07064r55522r90063r94712j043200j133234j143485j080543
$$ 286330611 285446197 284539133 283583611 282593548 281598836 280555636 279422402 278278917 277198374
3359.1B77198374j078039j123518j109749j058191j070827j136333j145124j095981
$$ 277198374 276120335 274996817 273887068 272828877 271758050 270621717 269476593 268380612
3375.5B68380612j046061r86100r41127q82507p75665o24179m81755n38051p25269
$$ 268380612 267334551 266348451 265407324 264524817 263749152 263124973 262643218 262105167 261379898
3393.8B61379898p14541m65363k89023m23908o27548n45770l53843k79814k58982k32428
$$ 261379898 260665357 260199994 259910971 259487063 258859515 258313745 257959902 257680088 257421106 257188678
3414.2B57188678j84179j01119k5600K8759J41025L10987M62621N22584O07282P15792
$$ 257188678 257004499 256903380 256877780 256906539 257047564 257358551 257821172 258343756 258951038 259666830
3434.6B59666830O15090M41999N13732P48903R35763J049131J076192J103937J165450
$$ 259666830 260281920 260723919 261237651 261986554 262922317 263971448 265047640 266151577 267317027
3453B67317027J203149J300872J453310J450628J423180J608074J744121J566500J290768
$$ 267317027 268520176 269821048 271274358 272724986 274148166 275756240 277500361 279066861 280357629
3471.3B80357629J318127J577765J823127J881808J751065J747102J866013J881808
$$ 280357629 281675756 283253521 285076648 286958456 288709521 290456623 292322636 294204444
3487.6B94204444J890212J967698J990378J980484J976430K013385K053172J988768
$$ 294204444 296094656 298062354 300052732 302033216 304009646 306023031 308076203 310064971
3504C10064971J943768K033293K156615K291292K340645K214312K160937K290517K479344
$$ 310064971 312008739 314042032 316198647 318489939 320830584 323044896 325205833 327496350 329975694
3522.3C29975694K478093K320230K344221K543837K694428K760023K753585K724708
$$ 329975694 332453787 334774017 337118238 339662075 342356503 345116526 347870111 350594819
3538.6C50594819K813398K922357K938449K842635K801984K956659L168553L245831
$$ 350594819 353408217 356330574 359269023 362111658 364913642 367870301 371038854 374284685
3554.9C74284685L228753L303260L363490L217220L150434L703028M292607M156053
$$ 374284685 377513438 380816698 384180188 387397408 390547842 394250870 398543477 402699530
3571.3D02699530L898054L982038M154682M276127M395753M376828M242689M386961
$$ 402699530 406597584 410579622 414734304 419010431 423406184 427783012 432025701 436412662
3587.6D36412662M785449M800736M683257M818916N007505N074382N097270M990131
$$ 436412662 441198111 445998847 450682104 455501020 460508525 465582907 470680177 475670308
3603.9D75670308M691273M691869N014151N166292N184472N037904M990876N448222
$$ 475670308 480361581 485053450 490067601 495233893 500418365 505456269 510447145 515895367
3620.2E15895367N522728M882872M175067M348397N455077N555570N061030M809797
$$ 515895367 521418095 526300967 530476034 534824431 540279508 545835078 550896108 555705905
3636.5E55705905M662752M555464M332006L805756L244102L616751M809677M912138
$$ 555705905 560368657 564924121 569256127 573061883 576305985 579922736 584732413 589644551
3652.8E89644551M176319M096985M341364M011690L528893L137112K546787K215922
$$ 589644551 593820870 597917855 602259219 606270909 609799802 612936914 615483701 617699623
3669.2F17699623K738953K721727K385258L245235L679275L232539K859294K407074
$$ 617699623 620438576 623160303 625545561 628790796 632470071 635702610 638561904 640968978
3685.5F40968978J834155J852333K604067K900899K530694K043486J610219J447797
$$ 640968978 642803133 644655466 647259533 650160432 652691126 654734612 656344831 657792628
3701.8F57792628J717925J706600J148760P11382J181483K157211K151966J444400
$$ 657792628 659510553 661217153 662365913 663077295 664258778 666415989 668567955 670012355
3718.1F70012355R71854R30547R99332J120150J299441R42468L38972L99888J183152
$$ 670012355 670984209 671914756 672914088 674034238 675333679 676276147 676615119 677015007 678198159
3736.5F78198159J816511J405477J61350j51515J040936R90450M74691J422167K021075
$$ 678198159 680014670 681420147 681581497 681429982 682470918 683461368 683936059 685358226 687379301
3754.8F87379301J404941Q48412J022697J097619P18475N09262N63085R44078J268506
$$ 687379301 688784242 689632654 690655351 691752970 692471445 692980707 693543792 694487870 695756376
3773.2F95756376J024782O07312M22537O27697Q23736Q26001Q16942P75754P07686
$$ 695756376 696781158 697388470 697811007 698438704 699262440 700088441 700905383 701681137 702388823
3791.5G02388823M00066M5240J18137L6895J50144R60469Q78215O96123J174390R69708
$$ 702388823 702788889 702834129 702952266 702989161 703139305 704099774 704977989 705674112 706848502 707818210
3811.9G07818210Q1301l06666J27375Q8573M75406J295090J013994N77510L29375J26123
$$ 707818210 707899511 707592845 707720220 707808793 708284199 709579289 710593283 711170793 711500168 711626291
3832.3G11626291J97470K4438o1690N54621J015126J064003R08017M11153n97358j455664
$$ 711626291 711823761 711848199 711786509 712341130 713356256 714420259 715328276 715739429 715142071 713686407
3852.7G13686407N1796J864255J398921L79264o1214K01225L68178N663J53541O41644
$$ 713686407 713738203 715602458 717001379 717380643 717319429 717520654 717888832 717894495 718048036 718689680
3873.1G18689680P95663O98089J60217N5671K99692J71960L74436L56078J27673N37932
$$ 718689680 719485343 720183432 720343649 720399320 720699012 720870972 721245408 721601486 721729159 722267091
3893.5G22267091O04272o7472n03958k83896K54750Q51393J003444O14643K48372P749
$$ 722267091 722871363 722803891 722299933 722016037 722270787 723122180 724125624 724740267 724988639 724996388
3913.9G24996388k25902j53184K22803L34203J79708K08974K18630P0035J55628L97205
$$ 724996388 724770486 724617302 724840105 725174308 725354016 725562990 725781620 725851655 726007283 726404488
3934.3G26404488L78370J65403J133j2279J40727J86801J19149J81556K54393K43842
$$ 726404488 726782858 726948261 726949394 726937115 727077842 727264643 727383792 727565348 727819741 728063583
3954.7G28063583K15233J85549J35958J18256J43885J42992J42813J80125K08020J55211
$$ 728063583 728278816 728464365 728600323 728718579 728862464 729005456 729148269 729328394 729536414 729691625
3975.1G29691625Q2433O1035R6619J69397J67071J11640J20580J47760J48773J65582
$$ 729691625 729774058 729835093 729931712 730101109 730268180 730379820 730500400 730648160 730796933 730962515
3995.5G30962515J47045
$$ 730962515 731109560
3997.5G31109560
$$ 731109560
##END=$$ End of the data block
